%!PS-Adobe-3.0 EPSF-3.0
%%DocumentNeededResources: font Helvetica
%%+ font Helvetica-Bold
%%+ font Helvetica-Oblique
%%+ font Helvetica-BoldOblique
%%+ font Symbol
%%Title: R Graphics Output
%%Creator: R Software
%%Pages: (atend)
%%BoundingBox: 0 0 504 504
%%EndComments
%%BeginProlog
/bp  { gs sRGB gs } def
% begin .ps.prolog
/gs  { gsave } bind def
/gr  { grestore } bind def
/ep  { showpage gr gr } bind def
/m   { moveto } bind def
/l  { rlineto } bind def
/np  { newpath } bind def
/cp  { closepath } bind def
/f   { fill } bind def
/o   { stroke } bind def
/c   { newpath 0 360 arc } bind def
/r   { 4 2 roll moveto 1 copy 3 -1 roll exch 0 exch rlineto 0 rlineto -1 mul 0 exch rlineto closepath } bind def
/p1  { stroke } bind def
/p2  { gsave bg fill grestore newpath } bind def
/p3  { gsave bg fill grestore stroke } bind def
/p6  { gsave bg eofill grestore newpath } bind def
/p7  { gsave bg eofill grestore stroke } bind def
/t   { 5 -2 roll moveto gsave rotate
       1 index stringwidth pop
       mul neg 0 rmoveto show grestore } bind def
/ta  { 4 -2 roll moveto gsave rotate show } bind def
/tb  { 2 -1 roll 0 rmoveto show } bind def
/cl  { grestore gsave newpath 3 index 3 index moveto 1 index
       4 -1 roll lineto  exch 1 index lineto lineto
       closepath clip newpath } bind def
/rgb { setrgbcolor } bind def
/s   { scalefont setfont } bind def
% end   .ps.prolog
/sRGB { [ /CIEBasedABC
          << /DecodeLMN
               [ { dup 0.03928 le
                        {12.92321 div}
                        {0.055 add 1.055 div 2.4 exp }
                     ifelse
                 } bind dup dup
               ]
             /MatrixLMN [0.412457 0.212673 0.019334
                         0.357576 0.715152 0.119192
                         0.180437 0.072175 0.950301]
             /WhitePoint [0.9505 1.0 1.0890]
           >>
         ] setcolorspace } bind def
/srgb { setcolor } bind def
%%IncludeResource: font Helvetica
/Helvetica findfont
dup length dict begin
  {1 index /FID ne {def} {pop pop} ifelse} forall
  /Encoding ISOLatin1Encoding def
  currentdict
  end
/Font1 exch definefont pop
%%IncludeResource: font Helvetica-Bold
/Helvetica-Bold findfont
dup length dict begin
  {1 index /FID ne {def} {pop pop} ifelse} forall
  /Encoding ISOLatin1Encoding def
  currentdict
  end
/Font2 exch definefont pop
%%IncludeResource: font Helvetica-Oblique
/Helvetica-Oblique findfont
dup length dict begin
  {1 index /FID ne {def} {pop pop} ifelse} forall
  /Encoding ISOLatin1Encoding def
  currentdict
  end
/Font3 exch definefont pop
%%IncludeResource: font Helvetica-BoldOblique
/Helvetica-BoldOblique findfont
dup length dict begin
  {1 index /FID ne {def} {pop pop} ifelse} forall
  /Encoding ISOLatin1Encoding def
  currentdict
  end
/Font4 exch definefont pop
%%IncludeResource: font Symbol
/Symbol findfont
dup length dict begin
  {1 index /FID ne {def} {pop pop} ifelse} forall
  currentdict
  end
/Font5 exch definefont pop
%%EndProlog
%%Page: 1 1
bp
0.00 0.00 504.00 504.00 cl
0.00 0.00 504.00 504.00 cl
0.00 0.00 504.00 504.00 cl
0.00 0.00 504.00 504.00 cl
0.00 0.00 504.00 504.00 cl
0.00 0.00 504.00 504.00 cl
0.00 0.00 504.00 504.00 cl
0.00 0.00 504.00 504.00 cl
0.00 0.00 504.00 504.00 cl
0.00 0.00 504.00 504.00 cl
0.00 0.00 504.00 504.00 cl
0.00 0.00 504.00 504.00 cl
0.00 0.00 504.00 504.00 cl
0.00 0.00 504.00 504.00 cl
0.00 0.00 504.00 504.00 cl
0.00 0.00 504.00 504.00 cl
0.00 0.00 504.00 504.00 cl
0.00 0.00 504.00 504.00 cl
/bg { 1 1 1 srgb } def
1 1 1 srgb
1.07 setlinewidth
[] 0 setdash
1 setlinecap
1 setlinejoin
10.00 setmiterlimit
0.00 0.00 504.00 504.00 r p3
0.00 0.00 504.00 504.00 cl
65.27 45.98 498.52 498.52 cl
1 1 1 srgb
0.53 setlinewidth
[] 0 setdash
0 setlinecap
1 setlinejoin
10.00 setmiterlimit
np
65.27 118.71 m
433.25 0 l
o
np
65.27 222.99 m
433.25 0 l
o
np
65.27 327.28 m
433.25 0 l
o
np
65.27 431.57 m
433.25 0 l
o
np
113.10 45.98 m
0 452.54 l
o
np
169.36 45.98 m
0 452.54 l
o
np
225.63 45.98 m
0 452.54 l
o
np
281.90 45.98 m
0 452.54 l
o
np
338.16 45.98 m
0 452.54 l
o
np
394.43 45.98 m
0 452.54 l
o
np
450.69 45.98 m
0 452.54 l
o
1.07 setlinewidth
[] 0 setdash
np
65.27 66.56 m
433.25 0 l
o
np
65.27 170.85 m
433.25 0 l
o
np
65.27 275.14 m
433.25 0 l
o
np
65.27 379.42 m
433.25 0 l
o
np
65.27 483.71 m
433.25 0 l
o
np
84.96 45.98 m
0 452.54 l
o
np
141.23 45.98 m
0 452.54 l
o
np
197.50 45.98 m
0 452.54 l
o
np
253.76 45.98 m
0 452.54 l
o
np
310.03 45.98 m
0 452.54 l
o
np
366.29 45.98 m
0 452.54 l
o
np
422.56 45.98 m
0 452.54 l
o
np
478.83 45.98 m
0 452.54 l
o
/bg { 0 1 1 srgb } def
0 0 0 srgb
2 setlinecap
0 setlinejoin
92.47 66.56 15.00 0.00 r p3
148.73 66.56 15.00 176.89 r p3
/bg { 1 0.6471 0 srgb } def
133.73 66.56 15.00 89.44 r p3
/bg { 0.6627 0.6627 0.6627 srgb } def
118.72 66.56 15.00 187.84 r p3
/bg { 0 1 1 srgb } def
205.00 66.56 15.00 298.61 r p3
/bg { 1 0.6471 0 srgb } def
189.99 66.56 15.00 189.10 r p3
/bg { 0.6627 0.6627 0.6627 srgb } def
174.99 66.56 15.00 383.22 r p3
/bg { 0 1 1 srgb } def
261.26 66.56 15.00 123.98 r p3
/bg { 1 0.6471 0 srgb } def
246.26 66.56 15.00 99.58 r p3
/bg { 0.6627 0.6627 0.6627 srgb } def
231.26 66.56 15.00 191.03 r p3
/bg { 0 1 1 srgb } def
317.53 66.56 15.00 24.87 r p3
/bg { 1 0.6471 0 srgb } def
302.53 66.56 15.00 41.49 r p3
/bg { 0.6627 0.6627 0.6627 srgb } def
287.52 66.56 15.00 55.71 r p3
/bg { 0 1 1 srgb } def
373.80 66.56 15.00 1.15 r p3
/bg { 1 0.6471 0 srgb } def
358.79 66.56 15.00 1.38 r p3
/bg { 0.6627 0.6627 0.6627 srgb } def
343.79 66.56 15.00 5.11 r p3
/bg { 0 1 1 srgb } def
430.06 66.56 15.00 0.00 r p3
/bg { 1 0.6471 0 srgb } def
415.06 66.56 15.00 0.00 r p3
/bg { 0.6627 0.6627 0.6627 srgb } def
400.05 66.56 15.00 0.01 r p3
456.32 66.56 15.00 0.00 r p3
0 setlinecap
1 setlinejoin
np
96.22 66.56 m
7.50 0 l
o
np
99.97 66.56 m
0 0 l
o
np
96.22 66.56 m
7.50 0 l
o
np
84.96 66.56 m
0 0 l
o
np
152.48 264.69 m
7.51 0 l
o
np
156.23 264.69 m
0 -42.47 l
o
np
152.48 222.22 m
7.51 0 l
o
np
137.48 165.24 m
7.50 0 l
o
np
141.23 165.24 m
0 -18.48 l
o
np
137.48 146.76 m
7.50 0 l
o
np
122.47 273.52 m
7.51 0 l
o
np
126.23 273.52 m
0 -38.24 l
o
np
122.47 235.28 m
7.51 0 l
o
np
208.75 386.99 m
7.50 0 l
o
np
212.50 386.99 m
0 -43.63 l
o
np
208.75 343.36 m
7.50 0 l
o
np
193.75 273.20 m
7.50 0 l
o
np
197.50 273.20 m
0 -35.07 l
o
np
193.75 238.13 m
7.50 0 l
o
np
178.74 477.95 m
7.50 0 l
o
np
182.49 477.95 m
0 -56.33 l
o
np
178.74 421.62 m
7.50 0 l
o
np
265.02 199.46 m
7.50 0 l
o
np
268.77 199.46 m
0 -17.84 l
o
np
265.02 181.62 m
7.50 0 l
o
np
250.01 172.63 m
7.50 0 l
o
np
253.76 172.63 m
0 -12.98 l
o
np
250.01 159.65 m
7.50 0 l
o
np
235.01 269.73 m
7.50 0 l
o
np
238.76 269.73 m
0 -24.29 l
o
np
235.01 245.44 m
7.50 0 l
o
np
321.28 93.55 m
7.50 0 l
o
np
325.03 93.55 m
0 -4.24 l
o
np
321.28 89.31 m
7.50 0 l
o
np
306.28 111.32 m
7.50 0 l
o
np
310.03 111.32 m
0 -6.53 l
o
np
306.28 104.79 m
7.50 0 l
o
np
291.27 126.63 m
7.51 0 l
o
np
295.02 126.63 m
0 -8.73 l
o
np
291.27 117.90 m
7.51 0 l
o
np
377.55 67.95 m
7.50 0 l
o
np
381.30 67.95 m
0 -0.48 l
o
np
377.55 67.47 m
7.50 0 l
o
np
362.54 68.32 m
7.51 0 l
o
np
366.29 68.32 m
0 -0.76 l
o
np
362.54 67.56 m
7.51 0 l
o
np
347.54 72.28 m
7.50 0 l
o
np
351.29 72.28 m
0 -1.22 l
o
np
347.54 71.06 m
7.50 0 l
o
np
433.81 66.56 m
7.51 0 l
o
np
437.57 66.56 m
0 0 l
o
np
433.81 66.56 m
7.51 0 l
o
np
418.81 66.56 m
7.50 0 l
o
np
422.56 66.56 m
0 0 l
o
np
418.81 66.56 m
7.50 0 l
o
np
403.81 66.59 m
7.50 0 l
o
np
407.56 66.59 m
0 -0.04 l
o
np
403.81 66.55 m
7.50 0 l
o
np
478.83 66.56 m
0 0 l
o
np
460.07 66.56 m
7.50 0 l
o
np
463.82 66.56 m
0 0 l
o
np
460.07 66.56 m
7.50 0 l
o
0.00 0.00 504.00 504.00 cl
0.00 0.00 504.00 504.00 cl
0.00 0.00 504.00 504.00 cl
0.00 0.00 504.00 504.00 cl
0.00 0.00 504.00 504.00 cl
0.00 0.00 504.00 504.00 cl
0.00 0.00 504.00 504.00 cl
0.00 0.00 504.00 504.00 cl
0.00 0.00 504.00 504.00 cl
0.00 0.00 504.00 504.00 cl
0.00 0.00 504.00 504.00 cl
0.00 0.00 504.00 504.00 cl
0.00 0.00 504.00 504.00 cl
0 0 0 srgb
1.07 setlinewidth
[] 0 setdash
0 setlinecap
1 setlinejoin
10.00 setmiterlimit
np
65.27 45.98 m
0 452.54 l
o
0.00 0.00 504.00 504.00 cl
0.00 0.00 504.00 504.00 cl
0.00 0.00 504.00 504.00 cl
/Font1 findfont 15 s
0.3020 0.3020 0.3020 srgb
60.34 61.18 (0) 1 0 t
60.34 165.46 (2000) 1 0 t
60.34 269.75 (4000) 1 0 t
60.34 374.04 (6000) 1 0 t
60.34 478.33 (8000) 1 0 t
0.00 0.00 504.00 504.00 cl
0.00 0.00 504.00 504.00 cl
0.2000 0.2000 0.2000 srgb
1.07 setlinewidth
[] 0 setdash
0 setlinecap
1 setlinejoin
10.00 setmiterlimit
np
62.53 66.56 m
2.74 0 l
o
np
62.53 170.85 m
2.74 0 l
o
np
62.53 275.14 m
2.74 0 l
o
np
62.53 379.42 m
2.74 0 l
o
np
62.53 483.71 m
2.74 0 l
o
0.00 0.00 504.00 504.00 cl
0.00 0.00 504.00 504.00 cl
0.00 0.00 504.00 504.00 cl
0.00 0.00 504.00 504.00 cl
0.00 0.00 504.00 504.00 cl
0.00 0.00 504.00 504.00 cl
0.00 0.00 504.00 504.00 cl
0 0 0 srgb
1.07 setlinewidth
[] 0 setdash
0 setlinecap
1 setlinejoin
10.00 setmiterlimit
np
65.27 45.98 m
433.25 0 l
o
0.00 0.00 504.00 504.00 cl
0.00 0.00 504.00 504.00 cl
0.00 0.00 504.00 504.00 cl
0.2000 0.2000 0.2000 srgb
1.07 setlinewidth
[] 0 setdash
0 setlinecap
1 setlinejoin
10.00 setmiterlimit
np
84.96 43.24 m
0 2.74 l
o
np
141.23 43.24 m
0 2.74 l
o
np
197.50 43.24 m
0 2.74 l
o
np
253.76 43.24 m
0 2.74 l
o
np
310.03 43.24 m
0 2.74 l
o
np
366.29 43.24 m
0 2.74 l
o
np
422.56 43.24 m
0 2.74 l
o
np
478.83 43.24 m
0 2.74 l
o
0.00 0.00 504.00 504.00 cl
0.00 0.00 504.00 504.00 cl
/Font1 findfont 15 s
0.3020 0.3020 0.3020 srgb
84.96 30.28 (0) .5 0 t
141.23 30.28 (1) .5 0 t
197.50 30.28 (2) .5 0 t
253.76 30.28 (3) .5 0 t
310.03 30.28 (4) .5 0 t
366.29 30.28 (5) .5 0 t
422.56 30.28 (6) .5 0 t
478.83 30.28 (7) .5 0 t
0.00 0.00 504.00 504.00 cl
0.00 0.00 504.00 504.00 cl
0.00 0.00 504.00 504.00 cl
0.00 0.00 504.00 504.00 cl
0.00 0.00 504.00 504.00 cl
0.00 0.00 504.00 504.00 cl
/Font1 findfont 20 s
0 0 0 srgb
132.40 9.88 (DND attr) 0 ta
0.300 (ib) tb
-0.400 (uted to selected B cells) tb gr
0.00 0.00 504.00 504.00 cl
0.00 0.00 504.00 504.00 cl
/Font1 findfont 20 s
0 0 0 srgb
19.84 272.25 (Frequency) .5 90 t
0.00 0.00 504.00 504.00 cl
0.00 0.00 504.00 504.00 cl
0.00 0.00 504.00 504.00 cl
0.00 0.00 504.00 504.00 cl
0.00 0.00 504.00 504.00 cl
0.00 0.00 504.00 504.00 cl
0.00 0.00 504.00 504.00 cl
0.00 0.00 504.00 504.00 cl
/bg { 1 1 1 srgb } def
382.26 409.66 102.54 87.21 r p2
0.00 0.00 504.00 504.00 cl
0.00 0.00 504.00 504.00 cl
0.00 0.00 504.00 504.00 cl
0.00 0.00 504.00 504.00 cl
/Font1 findfont 17 s
0 0 0 srgb
387.74 477.32 (Models) 0 0 t
0.00 0.00 504.00 504.00 cl
0.00 0.00 504.00 504.00 cl
0.00 0.00 504.00 504.00 cl
/bg { 0.9490 0.9490 0.9490 srgb } def
1 1 1 srgb
1.07 setlinewidth
[] 0 setdash
1 setlinecap
1 setlinejoin
10.00 setmiterlimit
387.74 449.70 17.28 17.28 r p3
0.00 0.00 504.00 504.00 cl
0.00 0.00 504.00 504.00 cl
/bg { 0.6627 0.6627 0.6627 srgb } def
0 0 0 srgb
1.07 setlinewidth
[] 0 setdash
2 setlinecap
0 setlinejoin
10.00 setmiterlimit
388.45 450.41 15.86 15.86 r p3
0.00 0.00 504.00 504.00 cl
0.00 0.00 504.00 504.00 cl
/bg { 0.9490 0.9490 0.9490 srgb } def
1 1 1 srgb
1.07 setlinewidth
[] 0 setdash
1 setlinecap
1 setlinejoin
10.00 setmiterlimit
387.74 432.42 17.28 17.28 r p3
0.00 0.00 504.00 504.00 cl
0.00 0.00 504.00 504.00 cl
/bg { 1 0.6471 0 srgb } def
0 0 0 srgb
1.07 setlinewidth
[] 0 setdash
2 setlinecap
0 setlinejoin
10.00 setmiterlimit
388.45 433.13 15.86 15.86 r p3
0.00 0.00 504.00 504.00 cl
0.00 0.00 504.00 504.00 cl
/bg { 0.9490 0.9490 0.9490 srgb } def
1 1 1 srgb
1.07 setlinewidth
[] 0 setdash
1 setlinecap
1 setlinejoin
10.00 setmiterlimit
387.74 415.14 17.28 17.28 r p3
0.00 0.00 504.00 504.00 cl
0.00 0.00 504.00 504.00 cl
/bg { 0 1 1 srgb } def
0 0 0 srgb
1.07 setlinewidth
[] 0 setdash
2 setlinecap
0 setlinejoin
10.00 setmiterlimit
388.45 415.85 15.86 15.86 r p3
0.00 0.00 504.00 504.00 cl
0.00 0.00 504.00 504.00 cl
0.00 0.00 504.00 504.00 cl
0.00 0.00 504.00 504.00 cl
/Font1 findfont 15 s
0 0 0 srgb
413.49 452.95 (DisseD) 0 0 t
0.00 0.00 504.00 504.00 cl
0.00 0.00 504.00 504.00 cl
0.00 0.00 504.00 504.00 cl
0.00 0.00 504.00 504.00 cl
0.00 0.00 504.00 504.00 cl
/Font1 findfont 15 s
0 0 0 srgb
413.49 435.67 (BCinTime) 0 0 t
0.00 0.00 504.00 504.00 cl
0.00 0.00 504.00 504.00 cl
0.00 0.00 504.00 504.00 cl
0.00 0.00 504.00 504.00 cl
0.00 0.00 504.00 504.00 cl
/Font1 findfont 15 s
0 0 0 srgb
413.49 418.39 (Mix) 0 ta
-0.450 (ed) tb gr
0.00 0.00 504.00 504.00 cl
0.00 0.00 504.00 504.00 cl
0.00 0.00 504.00 504.00 cl
0.00 0.00 504.00 504.00 cl
0.00 0.00 504.00 504.00 cl
0.00 0.00 504.00 504.00 cl
0.00 0.00 504.00 504.00 cl
0.00 0.00 504.00 504.00 cl
0.00 0.00 504.00 504.00 cl
0.00 0.00 504.00 504.00 cl
0.00 0.00 504.00 504.00 cl
0.00 0.00 504.00 504.00 cl
0.00 0.00 504.00 504.00 cl
ep
%%Trailer
%%Pages: 1
%%EOF
