<?xml version="1.0" encoding="utf-8"?>
<!-- Generator: Adobe Illustrator 21.1.0, SVG Export Plug-In . SVG Version: 6.00 Build 0)  -->
<svg version="1.1" id="Capa_1" xmlns="http://www.w3.org/2000/svg" xmlns:xlink="http://www.w3.org/1999/xlink" x="0px" y="0px"
	 viewBox="0 0 384.2 384.2" style="enable-background:new 0 0 384.2 384.2;" xml:space="preserve">
<g>
	<g>
		<path d="M384.1,352.2L364.7,32c-1.1-17.6-16.3-31.9-34-31.9h-277c-17.9,0-33,14.3-34.1,31.9L0.1,352.2
			c-1.1,17.6,12.4,31.9,30.1,31.9H354C371.8,384.1,385.2,369.8,384.1,352.2z M43.5,341.4L61.7,42.7h260.9l18.1,298.7L43.5,341.4
			L43.5,341.4z"/>
	</g>
</g>
<g>
	<g>
		<path d="M234.6,85.4v53.9c0,3.2-1.3,9.6-5,15.7c-6.1,10.2-17.1,16.3-37.7,16.3s-31.6-6.1-37.7-16.3c-3.7-6.1-5-12.6-5-15.7V85.4
			h-42.7v53.9c0,10.2,2.7,23.8,11,37.7c13.9,23.2,38.9,37.1,74.3,37.1s60.4-13.9,74.3-37.1c8.3-13.9,11-27.5,11-37.7V85.4H234.6z"/>
	</g>
</g>
</svg>
