<?xml version="1.0" encoding="utf-8"?>
<!-- Generator: Adobe Illustrator 21.1.0, SVG Export Plug-In . SVG Version: 6.00 Build 0)  -->
<svg version="1.1" id="Capa_1" xmlns="http://www.w3.org/2000/svg" xmlns:xlink="http://www.w3.org/1999/xlink" x="0px" y="0px"
	 viewBox="0 0 157.5 157.5" style="enable-background:new 0 0 157.5 157.5;" xml:space="preserve">
<g>
	<g>
		<path d="M92.7,78.8l62-62c3.8-3.8,3.8-10.1,0-13.9c-3.8-3.8-10.1-3.8-13.9,0l-62,62l-62-62C13-1,6.7-1,2.9,2.9
			C-1,6.7-1,13,2.9,16.8l62,62l-62,62c-3.8,3.8-3.8,10.1,0,13.9c1.9,1.9,4.4,2.9,7,2.9s5-1,7-2.9l62-62l62,62c1.9,1.9,4.4,2.9,7,2.9
			c2.5,0,5-1,7-2.9c3.8-3.8,3.8-10.1,0-13.9L92.7,78.8z"/>
	</g>
</g>
</svg>
