Division,WeightClassKg,Place,Name,Team,BodyweightKg,Best3SquatKg,Best3BenchKg,Best3DeadliftKg,TotalKg,Equipment,Event,Sex
Boys,51.71,1,Daniel Herrera,Navasota,51.26,129.27,83.91,138.35,351.53,Single-ply,SBD,M
Boys,51.71,2,Osbaldo Esquivel,Bryan,48.53,104.33,70.31,113.4,288.03,Single-ply,SBD,M
Boys,51.71,3,Juan Padron,Navasota,51.44,113.4,61.23,113.4,288.03,Single-ply,SBD,M
Boys,51.71,4,Jahir Aldaba,Navasota,50.62,104.33,58.97,95.25,258.55,Single-ply,SBD,M
Boys,51.71,5,Bryce Roundtree,Madisonville,42.64,83.91,45.36,88.45,217.72,Single-ply,SBD,M
Boys,55.79,1,Taylor Riley,Magnolia,55.07,156.49,95.25,174.63,426.38,Single-ply,SBD,M
Boys,55.79,2,Nicholas Daigle,Waller,55.7,136.08,54.43,161.03,351.53,Single-ply,SBD,M
Boys,55.79,3,Desmond Walls,Madisonville,53.16,108.86,68.04,136.08,312.98,Single-ply,SBD,M
Boys,59.87,1,Ian Campbell,Navasota,55.97,140.61,106.59,136.08,383.29,Single-ply,SBD,M
Boys,59.87,2,Alex Ellison,Bryan Rudder,58.88,145.15,79.38,149.69,374.21,Single-ply,SBD,M
Boys,59.87,3,Daniel Gannaway,Madisonville,59.51,145.15,65.77,163.29,374.21,Single-ply,SBD,M
Boys,59.87,4,Dylan Mikus,Magnolia West,55.88,131.54,90.72,147.42,369.68,Single-ply,SBD,M
Boys,59.87,5,Ryan Anthis,Waller,59.78,124.74,70.31,167.83,362.87,Single-ply,SBD,M
Boys,59.87,6,Kelbe Sylvan,Katy Taylor,56.52,124.74,70.31,156.49,351.53,Single-ply,SBD,M
Boys,59.87,7,Alan Tzul,Waller,58.69,120.2,58.97,111.13,290.3,Single-ply,SBD,M
Boys,67.13,1,Caleb Broussard,Waller,66.9,181.44,99.79,181.44,462.66,Single-ply,SBD,M
Boys,67.13,2,Gabriel Gonzales,Magnolia West,66.41,181.44,104.33,174.63,460.4,Single-ply,SBD,M
Boys,67.13,3,Cameron Nava,Magnolia,66.41,165.56,88.45,181.44,435.45,Single-ply,SBD,M
Boys,67.13,4,Ellis Reyes,Madisonville,65.77,145.15,115.67,170.1,430.91,Single-ply,SBD,M
Boys,67.13,5,Charlie Reyes,Tomball,67.04,154.22,81.65,188.24,424.11,Single-ply,SBD,M
Boys,67.13,6,Kevin Ramos,Navasota,65.32,165.56,95.25,156.49,417.3,Single-ply,SBD,M
Boys,67.13,7,Joan Catalan,Tomball,66.04,165.56,88.45,163.29,417.3,Single-ply,SBD,M
Boys,67.13,8,Jose Escolero,Katy Taylor,64.95,154.22,90.72,149.69,394.63,Single-ply,SBD,M
Boys,67.13,9,Eliseo Reyes,Madisonville,60.96,124.74,83.91,156.49,365.14,Single-ply,SBD,M
Boys,67.13,10,Bladen Reaves,Bryan Rudder,65.05,127.01,65.77,145.15,337.93,Single-ply,SBD,M
Boys,67.13,DQ,Gerald Puglisi,Waller,65.59,,,,,Single-ply,SBD,M
Boys,74.84,1,Noah Steptoe,Navasota,71.4,240.4,122.47,204.12,566.99,Single-ply,SBD,M
Boys,74.84,2,Austin McDaniel,Magnolia,71.58,183.7,97.52,172.37,453.59,Single-ply,SBD,M
Boys,74.84,3,Donquavian Steptoe,Navasota,71.3,181.44,86.18,158.76,426.38,Single-ply,SBD,M
Boys,74.84,4,Brock Knighten,Tomball,72.48,167.83,83.91,170.1,421.84,Single-ply,SBD,M
Boys,74.84,5,Ryan Rios,Navasota,68.31,172.37,104.33,142.88,419.57,Single-ply,SBD,M
Boys,74.84,6,Mark Vavra,Bryan,74.75,154.22,86.18,163.29,403.7,Single-ply,SBD,M
Boys,74.84,7,Eduardo Camarena,Madisonville,69.49,136.08,95.25,149.69,381.02,Single-ply,SBD,M
Boys,74.84,8,Michael Garrett,Magnolia,73.3,129.27,90.72,154.22,374.21,Single-ply,SBD,M
Boys,74.84,9,Payne Gessner,Navasota,71.3,136.08,90.72,136.08,362.87,Single-ply,SBD,M
Boys,74.84,10,John Cosino,Navasota,71.4,140.61,72.57,149.69,362.87,Single-ply,SBD,M
Boys,82.1,1,Walker Holverson,Tomball,82.01,208.65,113.4,226.8,548.85,Single-ply,SBD,M
Boys,82.1,2,Leonard Abke,Navasota,78.56,204.12,127.01,181.44,512.56,Single-ply,SBD,M
Boys,82.1,3,Logan Whitney,Magnolia,81.01,192.78,108.86,188.24,489.88,Single-ply,SBD,M
Boys,82.1,4,Chris Aimi,Katy Taylor,78.29,183.7,99.79,174.63,458.13,Single-ply,SBD,M
Boys,82.1,5,Jason Cartwright,Navasota,79.2,172.37,90.72,185.97,449.06,Single-ply,SBD,M
Boys,82.1,6,Preston Deming,Magnolia West,77.2,158.76,115.67,165.56,439.98,Single-ply,SBD,M
Boys,82.1,7,Taylor Ester,Tomball,81.83,170.1,88.45,170.1,428.64,Single-ply,SBD,M
Boys,82.1,8,Jaxsen Sedwell,Magnolia West,80.2,167.83,99.79,145.15,412.77,Single-ply,SBD,M
Boys,82.1,9,Anthony Acosta,Navasota,78.2,149.69,90.72,156.49,396.89,Single-ply,SBD,M
Boys,82.1,10,Juan Villalobos,Waller,81.01,131.54,61.23,136.08,328.85,Single-ply,SBD,M
Boys,89.81,1,Noah Clarkson,Magnolia West,87.54,215.46,145.15,201.85,562.45,Single-ply,SBD,M
Boys,89.81,2,Jake Juranek,Tomball,89.36,185.97,136.08,204.12,526.17,Single-ply,SBD,M
Boys,89.81,3,Noah Bryson,Magnolia West,88.09,229.06,88.45,201.85,519.36,Single-ply,SBD,M
Boys,89.81,4,Corbin Rodriguez,Madisonville,85.64,181.44,124.74,192.78,498.95,Single-ply,SBD,M
Boys,89.81,5,Edgar Silva,Navasota,86.45,190.51,127.01,181.44,498.95,Single-ply,SBD,M
Boys,89.81,6,Ian Morrow,Madisonville,82.83,174.63,108.86,179.17,462.66,Single-ply,SBD,M
Boys,89.81,7,Royce Gilreath,Bryan,87.18,149.69,111.13,190.51,451.32,Single-ply,SBD,M
Boys,89.81,8,Johnathon Peterson,Bryan Rudder,84.01,172.37,86.18,158.76,417.3,Single-ply,SBD,M
Boys,89.81,9,Dylan Dolenski,Waller,88.09,158.76,90.72,147.42,396.89,Single-ply,SBD,M
Boys,89.81,10,Barron Gonzalo,Bryan,89.18,136.08,81.65,142.88,360.61,Single-ply,SBD,M
Boys,99.79,1,Cole Wade,Magnolia West,90.45,238.14,133.81,229.06,601.01,Single-ply,SBD,M
Boys,99.79,2,Bailey Reid,Bryan Rudder,98.52,244.94,145.15,210.92,601.01,Single-ply,SBD,M
Boys,99.79,3,Nick Tucci,Katy Taylor,93.35,208.65,111.13,242.67,562.45,Single-ply,SBD,M
Boys,99.79,4,Nickolas Johnson #1,Bryan Rudder,97.89,226.8,131.54,201.85,560.19,Single-ply,SBD,M
Boys,99.79,5,Logan Clarke,Magnolia West,99.25,206.38,127.01,201.85,535.24,Single-ply,SBD,M
Boys,99.79,6,Jared Soyring,Magnolia West,96.98,210.92,115.67,185.97,512.56,Single-ply,SBD,M
Boys,99.79,7,Hilario Rodriguez,Navasota,98.88,213.19,113.4,181.44,508.02,Single-ply,SBD,M
Boys,99.79,8,Cody Stirman,Tomball,94.71,192.78,102.06,210.92,505.76,Single-ply,SBD,M
Boys,99.79,9,Zachary Marcisz,Waller,96.52,204.12,102.06,195.04,501.22,Single-ply,SBD,M
Boys,99.79,10,Eamon McGregor,Bryan,95.98,192.78,102.06,190.51,485.34,Single-ply,SBD,M
Boys,99.79,11,Jalyen Bell,Bryan,93.8,172.37,92.99,192.78,458.13,Single-ply,SBD,M
Boys,99.79,12,Gavin Calloway,Waller,98.34,170.1,86.18,167.83,424.11,Single-ply,SBD,M
Boys,99.79,13,Nathaniel Banvelos,Navasota,94.8,170.1,83.91,158.76,412.77,Single-ply,SBD,M
Boys,99.79,14,Erik Diaz,Waller,94.98,147.42,92.99,172.37,412.77,Single-ply,SBD,M
Boys,99.79,15,Raphael Franco,Madisonville,98.79,147.42,97.52,158.76,403.7,Single-ply,SBD,M
Boys,99.79,16,Austin English,Magnolia,99.06,158.76,83.91,151.95,394.63,Single-ply,SBD,M
Boys,99.79,DQ,Travis Damazio,Magnolia,91.17,181.44,,,,Single-ply,SBD,M
Boys,109.77,1,Cal Bauer,Navasota,102.6,222.26,154.22,226.8,603.28,Single-ply,SBD,M
Boys,109.77,2,Clifford Chambers,Bryan Rudder,109.13,249.48,113.4,190.51,553.38,Single-ply,SBD,M
Boys,109.77,3,Caleb Diehl,Tomball,105.69,208.65,124.74,217.72,551.11,Single-ply,SBD,M
Boys,109.77,4,Lautaro Putallaz,Katy Taylor,104.33,199.58,108.86,204.12,512.56,Single-ply,SBD,M
Boys,109.77,5,Brady Roberts,Bryan Rudder,106.59,197.31,133.81,181.44,512.56,Single-ply,SBD,M
Boys,109.77,6,Ronald Lee,Navasota,101.7,185.97,104.33,190.51,480.81,Single-ply,SBD,M
Boys,109.77,7,Steve Robinson,Madisonville,109.77,183.7,113.4,181.44,478.54,Single-ply,SBD,M
Boys,109.77,8,Jonathan Alfonso,Katy Taylor,100.7,197.31,102.06,172.37,471.74,Single-ply,SBD,M
Boys,109.77,9,Tucker Coon,Waller,108.23,136.08,90.72,136.08,362.87,Single-ply,SBD,M
Boys,109.77,DQ,Zachary French,Waller,106.78,136.08,,,,Single-ply,SBD,M
Boys,124.74,1,Charles Owens,Bryan Rudder,123.29,322.05,185.97,276.69,784.71,Single-ply,SBD,M
Boys,124.74,2,Tyler Burford,Magnolia West,114.21,240.4,127.01,247.21,614.62,Single-ply,SBD,M
Boys,124.74,3,Cobin Estorffe,Katy Taylor,121.65,215.46,136.08,217.72,569.26,Single-ply,SBD,M
Boys,124.74,4,Tyler Lang #2,Navasota,119.57,210.92,122.47,210.92,544.31,Single-ply,SBD,M
Boys,124.74,5,Otito Ogbonnia,Katy Taylor,113.13,192.78,122.47,226.8,542.04,Single-ply,SBD,M
Boys,124.74,6,Joshua Peoples,Bryan Rudder,122.47,188.24,115.67,235.87,539.77,Single-ply,SBD,M
Boys,124.74,7,Tatum Brokaw,Magnolia,116.57,188.24,102.06,185.97,476.27,Single-ply,SBD,M
Boys,124.74,8,Rudy Wilkins,Katy Taylor,119.75,158.76,97.52,197.31,453.59,Single-ply,SBD,M
Boys,124.74,9,Andrew Hale,Magnolia,115.85,158.76,106.59,163.29,428.64,Single-ply,SBD,M
Boys,124.74+,1,Chris Rogers,Katy Taylor,132.81,301.64,170.1,265.35,737.09,Single-ply,SBD,M
Boys,124.74+,2,Corey Ross,Navasota,129,274.42,192.78,244.94,712.14,Single-ply,SBD,M
Boys,124.74+,3,Stephen Nevarez,Magnolia West,125.65,254.01,154.22,226.8,635.03,Single-ply,SBD,M
Boys,124.74+,4,Jacod Sols,Magnolia,143.43,242.67,145.15,244.94,632.76,Single-ply,SBD,M
Boys,124.74+,5,Matthew Heffernan,Tomball,158.21,247.21,129.27,183.7,560.19,Single-ply,SBD,M
Boys,124.74+,6,Shaquan Warren,Bryan Rudder,126.01,188.24,136.08,226.8,551.11,Single-ply,SBD,M
Boys,124.74+,7,Chris Alexander,Tomball,126.51,210.92,124.74,197.31,532.97,Single-ply,SBD,M
Boys,124.74+,8,Joey Mclver,Madisonville,126.28,181.44,124.74,154.22,460.4,Single-ply,SBD,M
