Place,Name,Sex,Event,Division,WeightClassKg,Equipment,BirthYear,Team,State,BodyweightKg,Squat1Kg,Squat2Kg,Squat3Kg,Best3SquatKg,Bench1Kg,Bench2Kg,Bench3Kg,Best3BenchKg,Deadlift1Kg,Deadlift2Kg,Deadlift3Kg,Best3DeadliftKg,TotalKg,Age,BirthDate
1,Sofia Torres,F,SBD,FR-C,47,Raw,2003,Midland University,TX,46.75,90,95,100,100,47.5,50,52.5,52.5,90,95,102.5,102.5,255,,
2,Sally Green,F,SBD,FR-C,47,Raw,2003,Midland University,NE,46.8,70,75,-80,75,37.5,40,42.5,42.5,100,105,110,110,227.5,,
1,Sindy Aguilera,F,SBD,FR-C,52,Raw,2002,Midland University,NE,50.7,85,90,95,95,40,42.5,45,45,107.5,112.5,117.5,117.5,257.5,,
1,Kieara Kaufman,F,SBD,FR-C,57,Raw,2001,Sterling College,KS,52.7,85,-90,95,95,42.5,45,47.5,47.5,-102.5,102.5,105,105,247.5,,
DQ,Katherine Shanline,F,SBD,FR-C,57,Raw,2002,Sterling College,KS,54.9,-45,-45,,,-27.5,,,,,,,,,,
1,Maci Avila,F,SBD,FR-C,63,Raw,2003,Midland University,NV,62.6,127.5,-132.5,132.5,132.5,80,85,90,90,-135,135,140,140,362.5,,
2,Victoria Perez,F,SBD,FR-C,63,Raw,2002,Midland University,TX,62.9,100,-105,105,105,62.5,65,67.5,67.5,-115,115,122.5,122.5,295,,
1,Katherine Roudebush,F,SBD,FR-C,69,Raw,2004,Midland University,MO,68.35,145,152.5,157.5,157.5,80,85,90,90,150,160,167.5,167.5,415,,
2,Mackenzie Weaver,F,SBD,FR-C,69,Raw,2002,Midland University,KS,67.35,140,147.5,-152.5,147.5,90,95,-97.5,95,155,165,-172.5,165,407.5,,
3,Lauren Pimentel,F,SBD,FR-C,69,Raw,2003,Midland University,MA,68.35,145,-152.5,-152.5,145,77.5,82.5,85,85,162.5,-170,-170,162.5,392.5,,
4,Stephanny Sabril,F,SBD,FR-C,69,Raw,2003,Midland University,TX,68.6,100,105,112.5,112.5,60,65,67.5,67.5,125,132.5,140,140,320,,
5,Makayla Ratzlaff,F,SBD,FR-C,69,Raw,2002,,MO,64.4,97.5,-102.5,102.5,102.5,67.5,70,-72.5,70,100,105,-110,105,277.5,,
6,Sonya Zamora,F,SBD,FR-C,69,Raw,2003,,MO,67.9,97.5,-100,-100,97.5,55,57.5,-60,57.5,117.5,122.5,-127.5,122.5,277.5,,
7,Kat Price,F,SBD,FR-C,69,Raw,2002,,MO,65.7,85,-90,92.5,92.5,40,45,47.5,47.5,85,90,-97.5,90,230,,
8,Amanda Tormanen,F,SBD,FR-C,69,Raw,2002,,MO,64.25,85,90,92.5,92.5,35,-37.5,-37.5,35,82.5,-90,-90,82.5,210,,
1,Mackenzie Crowder,F,SBD,FR-C,84,Raw,2002,Sterling College,OK,81.4,125,135,-142.5,135,65,72.5,-77.5,72.5,135,140,142.5,142.5,350,,
1,Lagi Marina Ahsang,F,SBD,FR-C,84+,Raw,2003,Midland University,TX,148.15,170,177.5,185,185,72.5,80,85,85,175,185,200,200,470,,
2,Gabriella Hantla,F,SBD,FR-C,84+,Raw,2002,Midland University,KS,90.6,160,170,180,180,92.5,97.5,100,100,160,165,-175,165,445,,
3,Alayna Searcy,F,SBD,FR-C,84+,Raw,2003,Midland University,TX,133.6,170,180,190,190,72.5,80,82.5,82.5,140,150,155,155,427.5,,
4,Karly Huerta,F,SBD,FR-C,84+,Raw,2003,Midland University,NE,105.6,127.5,135,142.5,142.5,65,70,72.5,72.5,140,150,160,160,375,,
1,Austin Cuthbertson,M,SBD,MR-C,53,Raw,2002,Midland University,TX,52.4,152.5,157.5,165,165,85,90,92.5,92.5,157.5,167.5,170,170,427.5,,
1,Chase Chapa,M,SBD,MR-C,59,Raw,2002,Midland University,TX,58.15,170,175,180,180,105,110,112.5,112.5,210,220,227.5,227.5,520,,
1,Robert Cardoza,M,SBD,MR-C,66,Raw,2003,,NE,63.35,160,167.5,175,175,95,100,105,105,185,197.5,205,205,485,,
2,Luke Miner,M,SBD,MR-C,66,Raw,2002,Sterling College,TX,64.25,142.5,-157.5,-160,142.5,95,-100,100,100,170,177.5,182.5,182.5,425,,
1,Javier Pichardo,M,SBD,MR-C,74,Raw,2002,Midland University,TX,74,195,200,205,205,115,120,122.5,122.5,230,240,250,250,577.5,,
2,Sam Burkart,M,SBD,MR-C,74,Raw,2000,,MO,73.15,132.5,135,-140,135,87.5,92.5,-95,92.5,-170,170,-182.5,170,397.5,,
1,Kyle Dawson,M,SBD,MR-C,83,Raw,1999,,NE,82.65,272.5,-287.5,-287.5,272.5,-142.5,142.5,150,150,287.5,305,-317.5,305,727.5,,
2,Carter Hoffman,M,SBD,MR-C,83,Raw,2002,Midland University,SD,81,210,222.5,232.5,232.5,127.5,132.5,140,140,215,220,227.5,227.5,600,,
3,Cade Gardner,M,SBD,MR-C,83,Raw,2002,,MO,78.9,212.5,220,-225,220,132.5,140,-142.5,140,212.5,220,227.5,227.5,587.5,,
4,Tyler Hartwich,M,SBD,MR-C,83,Raw,2003,,MO,81.85,-185,192.5,-200,192.5,100,105,107.5,107.5,185,192.5,200,200,500,,
5,Jayme Barkley,M,SBD,MR-C,83,Raw,2003,,MO,79.2,170,-180,182.5,182.5,85,90,95,95,202.5,212.5,220,220,497.5,,
6,Alexander Gorczyca,M,SBD,MR-C,83,Raw,2003,Midland University,MA,80.2,127.5,135,142.5,142.5,80,-85,87.5,87.5,175,185,190,190,420,,
DQ,Garrett Huff,M,SBD,MR-C,83,Raw,2003,Sterling College,KS,81.55,-207.5,-207.5,-207.5,,117.5,120,125,125,205,210,222.5,222.5,,,
1,Peyton Mitties,M,SBD,MR-C,93,Raw,2003,,NE,92.2,235,242.5,-247.5,242.5,122.5,127.5,132.5,132.5,250,260,267.5,267.5,642.5,,
2,Braden Morris,M,SBD,MR-C,93,Raw,2002,Sterling College,KS,87.95,207.5,212.5,215,215,130,135,140,140,240,252.5,-265,252.5,607.5,,
3,Dwayne Wilson,M,SBD,MR-C,93,Raw,2002,Midland University,NE,83.9,190,200,-205,200,100,102.5,105,105,205,212.5,222.5,222.5,527.5,,
4,Joseph Garza,M,SBD,MR-C,93,Raw,2003,Midland University,TX,89.55,175,-185,185,185,95,100,-105,100,190,197.5,205,205,490,,
1,Jalen Faulk,M,SBD,MR-C,105,Raw,2003,Midland University,SC,95.35,255,265,272.5,272.5,-170,170,175,175,275,292.5,310,310,757.5,,
2,Carter Trowbridge,M,SBD,MR-C,105,Raw,2002,Midland University,SD,102.05,247.5,257.5,-265,257.5,150,155,160,160,250,262.5,270,270,687.5,,
3,Zane Sanchez,M,SBD,MR-C,105,Raw,2002,Midland University,TX,104.1,255,-265,265,265,155,162.5,167.5,167.5,235,247.5,255,255,687.5,,
4,Micaiah Loop,M,SBD,MR-C,105,Raw,2003,Midland University,TX,104.6,190,197.5,202.5,202.5,150,157.5,-162.5,157.5,225,235,245,245,605,,
5,Leland Stanford,M,SBD,MR-C,105,Raw,2002,Midland University,KS,102.58,205,215,222.5,222.5,110,117.5,122.5,122.5,220,235,-245,235,580,,
6,Kaleth Polanco-Pinto,M,SBD,MR-C,105,Raw,2002,Midland University,TX,94.6,185,195,202.5,202.5,130,140,145,145,195,207.5,217.5,217.5,565,,
7,Tommy Penner,M,SBD,MR-C,105,Raw,2003,,MO,98.7,202.5,210,217.5,217.5,117.5,122.5,-127.5,122.5,170,180,187.5,187.5,527.5,,
1,Jesse Perez,M,SBD,MR-C,120,Raw,2003,Midland University,TX,109.4,155,162.5,-170,162.5,95,100,102.5,102.5,165,175,185,185,450,,
1,Bartol Guevara,M,SBD,MR-C,120+,Raw,2003,Midland University,NE,139.7,215,225,235,235,135,142.5,145,145,190,220,235,235,615,,
2,Cody Rice,M,SBD,MR-C,120+,Raw,2002,Midland University,NE,135.25,215,222.5,227.5,227.5,117.5,125,-132.5,125,200,220,235,235,587.5,,
DQ,Joel Iracheta,M,SBD,MR-C,120+,Raw,2001,Sterling College,TX,143.4,-307.5,-312.5,-312.5,,-160,160,-167.5,160,-292.5,-292.5,-292.5,,,,
