Place,Sex,Name,CyrillicName,BodyweightKg,Squat1Kg,Squat2Kg,Squat3Kg,Best3SquatKg,Squat4Kg,Bench1Kg,Bench2Kg,Bench3Kg,Best3BenchKg,Bench4Kg,Deadlift1Kg,Deadlift2Kg,Deadlift3Kg,Best3DeadliftKg,Deadlift4Kg,TotalKg,WeightClassKg,Event,Equipment,Tested,Division,Age,BirthDate
1,F,Alena Roslikova,Алена Росликова,51.7,75,-80,80,80,,45,-50,-50,45,,-95,-95,95,95,,220,52,SBD,Raw,Yes,Amateur Masters 40-49,41,1979-06-21
1,F,Elizaveta Abrosimova,Елизавета Абросимова,54.5,65,70,,70,,40,45,,45,,85,90,95,95,,210,56,SBD,Raw,Yes,Amateur Teen 14-16,15,2006-02-02
1,M,Georgiy Zobkov,Георгий Зобков,53,50,-87.5,-92.5,50,,-55,55,-60,55,,80,90,-100,90,,195,56,SBD,Raw,Yes,Amateur Teen 14-16,16,2005-02-06
1,M,Georgiy Zobkov,Георгий Зобков,53,50,-87.5,-92.5,50,,-55,55,-60,55,,80,90,-100,90,,195,56,SBD,Raw,Yes,Amateur Open,16,2005-02-06
1,M,Sergey Mizgin,Сергей Мизгин,64.4,135,-142.5,-142.5,135,,85,92.5,100,100,,170,180,-190,180,,415,67.5,SBD,Raw,Yes,Amateur Teen 14-16,16,2005-05-05
2,M,Aleksandr Kazantsev,Александр Казанцев,66.7,-115,115,120,120,,-92.5,92.5,-100,92.5,,175,-182.5,-182.5,175,,387.5,67.5,SBD,Raw,Yes,Amateur Teen 14-16,16,2004-09-12
1,M,Grigoriy Tolstoy,Григорий Толстой,63.5,-100,-100,100,100,,-77.5,77.5,-82.5,77.5,,130,140,150,150,,327.5,67.5,SBD,Raw,Yes,Amateur Sub-Juniors 17-19,17,2003-10-05
1,M,Sergey Mizgin,Сергей Мизгин,64.4,135,-142.5,-142.5,135,,85,92.5,100,100,,170,180,-190,180,,415,67.5,SBD,Raw,Yes,Amateur Open,16,2005-05-05
1,M,Aleksandr Barakan,Александр Баракан,69.6,125,130,135,135,,85,90,-92.5,90,,-165,170,175,175,,400,75,SBD,Raw,Yes,Amateur Sub-Juniors 17-19,17,2004-02-05
1,M,Nikita Tolstikov,Никита Толстиков,82.1,-115,115,-120,115,,75,-80,-80,75,,140,150,-155,150,,340,82.5,SBD,Raw,Yes,Amateur Sub-Juniors 17-19,18,2002-05-31
1,M,Denis Kiselyov,Денис Киселёв,87.9,210,220,225,225,,155,-165,165,165,,240,-255,-255,240,,630,90,SBD,Raw,Yes,Amateur Juniors 20-23,23,1997-08-03
1,M,Ilya Galimov,Илья Галимов,91.8,180,-190,190,190,,125,135,-145,135,,215,-230,230,230,,555,100,SBD,Raw,Yes,Amateur Open,25,1995-08-14
1,M,Anton Smirnov,Антон Смирнов,110,190,-200,200,200,,110,120,-130,120,,255,265,-282.5,265,,585,110,SBD,Raw,Yes,Amateur Open,35,1985-06-07
1,M,Nikita Vardugin,Никита Вардугин,67,70,-75,75,75,,65,-70,-70,65,,120,130,-140,130,,270,67.5,SBD,Raw,No,Pro Teen 14-16,16,2004-07-05
1,M,Nikolay Merkulov,Николай Меркулов,81.5,-105,105,117.5,117.5,,-100,105,112.5,112.5,,150,165,-180,165,,395,82.5,SBD,Raw,No,Pro Open,28,1992-06-16
1,M,Artur Idrisov,Артур Идрисов,84.8,95,-100,-100,95,,92.5,-97.5,100,100,,140,150,155,155,,350,90,SBD,Raw,No,Pro Teen 14-16,16,2005-01-14
1,M,Evgeniy Mokshaev,Евгений Мокшаев,86.9,-200,210,-220,210,,140,150,155,155,,220,235,240,240,,605,90,SBD,Raw,No,Pro Open,33,1987-07-08
1,M,Sergey Enshin,Сергей Еньшин,98.2,220,-230,,220,,170,180,-190,180,,200,210,220,220,,620,100,SBD,Raw,No,Pro Open,35,1986-03-11
1,M,Aleksandr Ushakov,Александр Ушаков,85.3,-160,-160,160,160,,90,100,-105,100,,170,180,192.5,192.5,,452.5,90,SBD,Wraps,No,Pro Open,38,1982-06-11
1,F,Alena Roslikova,Алена Росликова,51.7,,,,,,45,-50,-50,45,,,,,,,45,52,B,Raw,Yes,Amateur Masters 40-49,41,1979-06-21
1,M,Daniil Romashev,Даниил Ромашев,60.2,,,,,,90,-95,100,100,,,,,,,100,67.5,B,Raw,Yes,Amateur Sub-Juniors 17-19,17,2004-04-15
1,M,Boris Basov,Борис Басов,74,,,,,,110,117.5,120,120,,,,,,,120,75,B,Raw,Yes,Amateur Open,31,1989-06-27
1,M,Evgeniy Korkin,Евгений Коркин,80.5,,,,,,90,100,-105,100,,,,,,,100,82.5,B,Raw,Yes,Amateur Open,34,1987-04-14
1,M,Kirill Goncharov,Кирилл Гончаров,82.9,,,,,,70,77.5,82.5,82.5,,,,,,,82.5,90,B,Raw,Yes,Amateur Teen 14-16,15,2005-07-29
1,M,Denis Kiselyov,Денис Киселёв,87.9,,,,,,155,-165,165,165,,,,,,,165,90,B,Raw,Yes,Amateur Juniors 20-23,23,1997-08-03
1,M,Aleksandr Stryakhilev,Александр Стряхилев,87,,,,,,142.5,-152.5,152.5,152.5,,,,,,,152.5,90,B,Raw,Yes,Amateur Open,39,1981-08-16
1,M,Evgeniy Shadrin,Евгений Шадрин,103.1,,,,,,135,-140,-140,135,,,,,,,135,110,B,Raw,Yes,Amateur Open,32,1988-10-20
2,M,Anton Smirnov,Антон Смирнов,110,,,,,,110,120,-130,120,,,,,,,120,110,B,Raw,Yes,Amateur Open,35,1985-06-07
1,M,Vitaliy Kleshchenkov,Виталий Клещенков,94.7,,,,,,150,-160,-160,150,,,,,,,150,100,B,Raw,No,Pro Masters 50-59,51,1970-02-05
1,M,Oleg Paklin,Олег Паклин,108.7,,,,,,-200,200,207.5,207.5,,,,,,,207.5,110,B,Raw,No,Pro Open,33,1987-10-28
2,M,Ruslan Prokopchik,Руслан Прокопчик,108.2,,,,,,185,192.5,200,200,,,,,,,200,110,B,Raw,No,Pro Open,27,1993-08-20
3,M,Mikhail Prykin,Михаил Прыкин,107.6,,,,,,185,-192.5,-192.5,185,,,,,,,185,110,B,Raw,No,Pro Open,26,1994-09-18
1,F,Alena Roslikova,Алена Росликова,51.7,,,,,,,,,,,-95,-95,95,95,,95,52,D,Raw,Yes,Amateur Masters 40-49,41,1979-06-21
1,M,Gleb Titov,Глеб Титов,50.2,,,,,,,,,,,-90,102.5,110,110,,110,52,D,Raw,Yes,Amateur Teen 14-16,14,2006-08-25
1,M,Aleksandr Galygin,Александр Галыгин,54.2,,,,,,,,,,,90,100,107.5,107.5,,107.5,56,D,Raw,Yes,Amateur Teen 14-16,15,2005-11-19
2,M,Nikita Loganin,Никита Логанин,55.1,,,,,,,,,,,85,92.5,100,100,,100,56,D,Raw,Yes,Amateur Teen 14-16,14,2006-08-04
1,M,Sergey Mizgin,Сергей Мизгин,64.4,,,,,,,,,,,170,180,-190,180,,180,67.5,D,Raw,Yes,Amateur Teen 14-16,16,2005-05-05
2,M,Aleksandr Kazantsev,Александр Казанцев,66.7,,,,,,,,,,,175,-182.5,-182.5,175,,175,67.5,D,Raw,Yes,Amateur Teen 14-16,16,2004-09-12
1,M,Sergey Mizgin,Сергей Мизгин,64.4,,,,,,,,,,,170,180,-190,180,,180,67.5,D,Raw,Yes,Amateur Open,16,2005-05-05
1,M,Aleksandr Barakan,Александр Баракан,69.6,,,,,,,,,,,-165,170,175,175,,175,75,D,Raw,Yes,Amateur Sub-Juniors 17-19,17,2004-02-05
1,M,Denis Kiselyov,Денис Киселёв,87.9,,,,,,,,,,,240,-255,-255,240,,240,90,D,Raw,Yes,Amateur Juniors 20-23,23,1997-08-03
1,M,Egor Dodukh,Егор Додух,108.4,,,,,,,,,,,170,-185,-185,170,,170,110,D,Raw,Yes,Amateur Teen 14-16,15,2005-08-12
1,M,Anton Smirnov,Антон Смирнов,110,,,,,,,,,,,255,265,-282.5,265,,265,110,D,Raw,Yes,Amateur Open,35,1985-06-07
1,F,Valeriya Mukhametzhanova,Валерия Мухаметжанова,77.9,,,,,,,,,,,110,-112.5,-112.5,110,,110,82.5,D,Raw,No,Pro Open,25,1996-01-25
1,M,Evgeniy Mokshaev,Евгений Мокшаев,86.9,,,,,,,,,,,220,235,240,240,,240,90,D,Raw,No,Pro Open,33,1987-07-08
1,M,Aleksey Konakov,Алексей Конаков,99.3,,,,,,,,,,,260,-280,-280,260,,260,100,D,Raw,No,Pro Masters 40-49,43,1977-10-12
1,M,Andrey Bogatyrev,Андрей Богатырев,117.8,,,,,,,,,,,190,215,227.5,227.5,,227.5,125,D,Raw,No,Pro Masters 60-69,60,1960-07-10
