Division,WeightClassKg,Place,Name,Team,BodyweightKg,Best3SquatKg,Best3BenchKg,Best3DeadliftKg,TotalKg,Equipment,Event,Sex,BirthDate
Boys,55.79,1,Jose Cuellar,Celina,52.93,106.59,65.77,115.67,288.03,Single-ply,SBD,M,
Boys,59.87,1,Cade Dudley,Celina,58.38,142.88,104.33,142.88,390.09,Single-ply,SBD,M,
Boys,59.87,2,Evan Rogers,Celina,59.56,136.08,90.72,142.88,369.68,Single-ply,SBD,M,
Boys,67.13,1,Edwin Rodriguez,Pilot Point,60.78,226.8,95.25,190.51,512.56,Single-ply,SBD,M,
Boys,67.13,2,Edson Torres,Celina,67,204.12,92.99,183.7,480.81,Single-ply,SBD,M,
Boys,67.13,3,Diego Alejos,Pilot Point,66.18,124.74,68.04,156.49,349.27,Single-ply,SBD,M,
Boys,67.13,4,Jackson Wahl,Celina,66.86,124.74,88.45,124.74,337.93,Single-ply,SBD,M,
Boys,74.84,1,Greyson Blanchard,Celina,74.39,272.16,136.08,219.99,628.23,Single-ply,SBD,M,
Boys,74.84,2,Curly Brockman,Pilot Point,74.84,158.76,102.06,163.29,424.11,Single-ply,SBD,M,
Boys,74.84,3,Ryan Reemts,Celina,68.17,120.2,79.38,142.88,342.46,Single-ply,SBD,M,
Boys,74.84,NS,Brandon Wheeler,Tioga,,,,,,Single-ply,SBD,M,
Boys,74.84,NS,Dalton Stanley,Tioga,,,,,,Single-ply,SBD,M,
Boys,82.1,1,Jose Martinez,Celina,81.15,249.48,136.08,249.48,635.03,Single-ply,SBD,M,
Boys,82.1,2,Army Ellison,Celina,80.47,206.38,147.42,215.46,569.26,Single-ply,SBD,M,
Boys,82.1,3,Ricky Matehuala,Celina,81.42,215.46,124.74,183.7,523.9,Single-ply,SBD,M,
Boys,82.1,4,Ethan Elliot,Celina,81.37,204.12,124.74,183.7,512.56,Single-ply,SBD,M,
Boys,82.1,NS,Michael Peterson,Pilot Point,,,,,,Single-ply,SBD,M,
Boys,99.79,1,Brad Kissinger,Celina,94.3,254.01,142.88,206.38,603.28,Single-ply,SBD,M,
Boys,124.74,1,Caleb Holloway,Pilot Point,120.79,219.99,124.74,188.24,532.97,Single-ply,SBD,M,
Boys,124.74,2,Collin Haynes,Pilot Point,115.08,156.49,124.74,215.46,496.68,Single-ply,SBD,M,
Boys,139.71+,1,Jacob Scott,Pilot Point,150.68,249.48,136.08,215.46,601.01,Single-ply,SBD,M,
Boys,,NS,Brendan Armijo,Celina,,,,,,Single-ply,SBD,M,
