Division,WeightClassKg,Place,Name,Team,BodyweightKg,Best3SquatKg,Best3BenchKg,Best3DeadliftKg,TotalKg,Equipment,Event,Sex
Boys,51.71,1,Austen Campbell,Sour Lake Hardin-Jefferson,49.99,136.08,58.97,136.08,331.12,Single-ply,SBD,M
Boys,51.71,2,Juan Paniagua,Winnie East Chambers,51.44,117.93,72.57,127.01,317.51,Single-ply,SBD,M
Boys,51.71,3,Brent Meguess,Winnie East Chambers,50.98,113.4,63.5,122.47,299.37,Single-ply,SBD,M
Boys,59.87,1,Colton Smith #4,Kountze,56.02,124.74,74.84,174.63,374.21,Single-ply,SBD,M
Boys,59.87,2,Kevin Sanders #5,Sour Lake Hardin-Jefferson,55.88,136.08,65.77,147.42,349.27,Single-ply,SBD,M
Boys,55.79,3,Hunter Smart,Kountze,53.89,99.79,68.04,140.61,308.44,Single-ply,SBD,M
Boys,55.79,3,Luke Martin,High Island,52.44,113.4,86.18,115.67,315.25,Single-ply,SBD,M
Boys,55.79,4,Gavin Robles,Kountze,53.43,88.45,56.7,106.59,251.74,Single-ply,SBD,M
Boys,55.79,5,Austin Scarborough,Kountze,53.8,86.18,61.23,104.33,251.74,Single-ply,SBD,M
Boys,59.87,1,Jesse Flores,Winnie East Chambers,59.78,147.42,83.91,145.15,376.48,Single-ply,SBD,M
Boys,59.87,2,Cole Priddy,Sour Lake Hardin-Jefferson,59.15,113.4,61.23,142.88,317.51,Single-ply,SBD,M
Boys,59.87,4,Seth Mounts,Kountze,59.6,83.91,68.04,113.4,265.35,Single-ply,SBD,M
Boys,59.87,5,Jaycob Tullock,Hardin,59.78,129.27,61.23,117.93,308.44,Single-ply,SBD,M
Boys,59.87,DQ,Serlyn Rivera,Winnie East Chambers,58.79,,,,,Single-ply,SBD,M
Boys,67.13,1,Austin Copeland,Sour Lake Hardin-Jefferson,65.5,115.67,77.11,140.61,333.39,Single-ply,SBD,M
Boys,67.13,2,Ashton Bowen,Liberty,64.23,95.25,68.04,142.88,306.17,Single-ply,SBD,M
Boys,67.13,3,Jake Nobles,Sour Lake Hardin-Jefferson,65.59,90.72,63.5,129.27,283.5,Single-ply,SBD,M
Boys,67.13,DQ,Alan Asher,Sour Lake Hardin-Jefferson,63.05,108.86,,,,Single-ply,SBD,M
Boys,67.13,DQ,Jakub Lucas,Anahuac,62.6,,,,,Single-ply,SBD,M
Boys,74.84,1,Keith Volpitta,Winnie East Chambers,73.57,213.19,142.88,213.19,569.26,Single-ply,SBD,M
Boys,74.84,2,Tanner Jones,Sour Lake Hardin-Jefferson,74.48,183.7,108.86,210.92,503.49,Single-ply,SBD,M
Boys,74.84,3,Kayhlib Sarles,High Island,73.48,188.24,120.2,188.24,496.68,Single-ply,SBD,M
Boys,74.84,4,Alan Mata,Hardin,73.66,188.24,111.13,179.17,478.54,Single-ply,SBD,M
Boys,74.84,5,Drew Moulton,Anahuac,70.49,158.76,106.59,181.44,446.79,Single-ply,SBD,M
Boys,74.84,6,Santiago Muniz,Winnie East Chambers,74.3,158.76,115.67,167.83,442.25,Single-ply,SBD,M
Boys,74.84,7,Vinson Aragonez,Hardin,68.13,145.15,83.91,156.49,385.55,Single-ply,SBD,M
Boys,74.84,8,Devon Harmon,Liberty,71.94,131.54,79.38,149.69,360.61,Single-ply,SBD,M
Boys,74.84,9,Devon Kozina,Liberty,71.94,117.93,70.31,149.69,337.93,Single-ply,SBD,M
Boys,74.84,DQ,Coby West,Hardin,74.39,,,,,Single-ply,SBD,M
Boys,74.84,DQ,Alberto Cabrera,Anahuac,74.84,,,,,Single-ply,SBD,M
Boys,82.1,1,Charlie Kappelman,Kountze,80.56,172.37,142.88,199.58,514.83,Single-ply,SBD,M
Boys,82.1,2,Cesar Molina,Anahuac,77.66,183.7,131.54,188.24,503.49,Single-ply,SBD,M
Boys,82.1,3,Hunter McNair,Sour Lake Hardin-Jefferson,80.01,172.37,79.38,183.7,435.45,Single-ply,SBD,M
Boys,82.1,4,Cole McNair,Sour Lake Hardin-Jefferson,80.47,170.1,86.18,154.22,410.5,Single-ply,SBD,M
Boys,82.1,5,Mason Duhon,Anahuac,77.84,140.61,83.91,145.15,369.68,Single-ply,SBD,M
Boys,82.1,DQ,Warren Brown,Kountze,81.65,,,,,Single-ply,SBD,M
Boys,82.1,DQ,Chris O'Banion,Anahuac,75.75,,,,,Single-ply,SBD,M
Boys,89.81,1,John Artis,Anahuac,85.09,185.97,99.79,217.72,503.49,Single-ply,SBD,M
Boys,89.81,2,Shaquille Warren,Kountze,84.1,170.1,113.4,208.65,492.15,Single-ply,SBD,M
Boys,89.81,3,Tim Flores,Sour Lake Hardin-Jefferson,88.63,176.9,106.59,208.65,492.15,Single-ply,SBD,M
Boys,89.81,4,Skyler Conner,Sour Lake Hardin-Jefferson,86.64,183.7,106.59,190.51,480.81,Single-ply,SBD,M
Boys,89.81,5,Zane Conner,Sour Lake Hardin-Jefferson,89.09,158.76,83.91,208.65,451.32,Single-ply,SBD,M
Boys,89.81,6,Robert Bumstead,Kountze,82.64,154.22,88.45,176.9,419.57,Single-ply,SBD,M
Boys,89.81,7,Austin Hodges,Anahuac,85.18,142.88,77.11,142.88,362.87,Single-ply,SBD,M
Boys,89.81,DQ,Gavin Small,Liberty,84.37,154.22,108.86,,,Single-ply,SBD,M
Boys,89.81,DQ,Logan Gusman,Liberty,89.81,,,,,Single-ply,SBD,M
Boys,109.77,1,Blain Padgett,Sour Lake Hardin-Jefferson,99.93,210.92,131.54,179.17,521.63,Single-ply,SBD,M
Boys,99.79,2,Dylan Garcia,Anahuac,94.8,149.69,102.06,154.22,405.97,Single-ply,SBD,M
Boys,99.79,DQ,Craig Johnson,Anahuac,92.53,,,,,Single-ply,SBD,M
Boys,109.77,1,Juan Lopez,Winnie East Chambers,103.06,249.48,165.56,217.72,632.76,Single-ply,SBD,M
Boys,109.77,2,Roe Wilkins,Sour Lake Hardin-Jefferson,102.87,197.31,102.06,165.56,464.93,Single-ply,SBD,M
Boys,109.77,3,Daren Garcia,Anahuac,101.51,158.76,108.86,147.42,415.04,Single-ply,SBD,M
Boys,109.77,4,Jesse Simien,Winnie East Chambers,107.95,154.22,106.59,154.22,415.04,Single-ply,SBD,M
Boys,109.77,5,Eduardo Alvarado,Anahuac,103.06,131.54,77.11,129.27,337.93,Single-ply,SBD,M
Boys,109.77,DQ,Caleb Atkins,Kountze,109.5,,,,,Single-ply,SBD,M
Boys,124.74,1,Josh Leader,Hardin,124.65,217.72,117.93,181.44,517.1,Single-ply,SBD,M
Boys,124.74,2,Chris Stanley,Anahuac,111.67,183.7,129.27,174.63,487.61,Single-ply,SBD,M
Boys,124.74+,1,Merel Bunfill,Hardin,137.35,249.48,115.67,204.12,569.26,Single-ply,SBD,M
Boys,124.74+,2,Daniel Reyes,Hardin,156.4,206.38,106.59,161.03,474,Single-ply,SBD,M
Boys,,NS,John Erwin,Kountze,,,,,,Single-ply,SBD,M
