Division,WeightClassKg,Place,Name,Team,BodyweightKg,Best3SquatKg,Best3BenchKg,Best3DeadliftKg,TotalKg,Equipment,Event,Sex,BirthDate
Boys,51.71,1,Rhett Hutchins,Whitehouse,49.8,104.33,58.97,106.59,269.89,Single-ply,SBD,M,
Boys,51.71,2,Crew Goodson,Lindale,40.19,79.38,38.56,90.72,208.65,Single-ply,SBD,M,
Boys,55.79,1,Jacob Gray,Longview Pine Tree,55.79,145.15,83.91,140.61,369.68,Single-ply,SBD,M,
Boys,55.79,2,Joseph Cordova,Longview Pine Tree,55.79,108.86,58.97,117.93,285.76,Single-ply,SBD,M,
Boys,59.87,1,Tristan Larsen,Tyler Chapel Hill,57.88,183.7,86.18,183.7,453.59,Single-ply,SBD,M,
Boys,59.87,2,Memphis Dorsey,Lindale,59.24,149.69,81.65,172.37,403.7,Single-ply,SBD,M,
Boys,59.87,3,Caden Pickard,Longview Pine Tree,59.87,133.81,79.38,151.95,365.14,Single-ply,SBD,M,
Boys,59.87,4,Tysen Pierce,Henderson,59.51,129.27,70.31,147.42,347,Single-ply,SBD,M,
Boys,59.87,5,Cameron Flowers,Whitehouse,57.79,117.93,70.31,127.01,315.25,Single-ply,SBD,M,
Boys,67.13,1,D'Cameron Walker,Henderson,67.13,197.31,124.74,192.78,514.83,Single-ply,SBD,M,
Boys,67.13,2,Greg Kalulu,Longview Pine Tree,67.13,167.83,99.79,197.31,464.93,Single-ply,SBD,M,
Boys,67.13,3,Nik Moody,Tyler Chapel Hill,62.41,147.42,90.72,174.63,412.77,Single-ply,SBD,M,
Boys,67.13,4,Daniel Cabrera,Tyler Chapel Hill,63.87,154.22,86.18,165.56,405.97,Single-ply,SBD,M,
Boys,67.13,5,Nicholas Rodriguez,Tyler Chapel Hill,66.59,147.42,97.52,158.76,403.7,Single-ply,SBD,M,
Boys,67.13,6,Levi Thornton,Lindale,63.78,124.74,65.77,131.54,322.05,Single-ply,SBD,M,
Boys,67.13,7,Cole Murry,Whitehouse,63.87,106.59,65.77,136.08,308.44,Single-ply,SBD,M,
Boys,67.13,8,Kanon Angulo,Tyler Chapel Hill,60.87,102.06,61.23,124.74,288.03,Single-ply,SBD,M,
Boys,74.84,1,Keandre Nesbitt,Longview Pine Tree,71.85,199.58,104.33,217.72,521.63,Single-ply,SBD,M,
Boys,74.84,2,Henry Waggoner,Lindale,72.21,195.04,108.86,210.92,514.83,Single-ply,SBD,M,
Boys,74.84,3,Ya'Corus Porter,Henderson,74.48,181.44,120.2,213.19,514.83,Single-ply,SBD,M,
Boys,74.84,4,John Cunyus,Henderson,73.48,158.76,102.06,204.12,464.93,Single-ply,SBD,M,
Boys,74.84,5,Giovanni Morales,Henderson,70.31,161.03,97.52,170.1,428.64,Single-ply,SBD,M,
Boys,74.84,6,Nathaniel Sanchez,Longview Pine Tree,71.67,145.15,92.99,172.37,410.5,Single-ply,SBD,M,
Boys,74.84,7,Lucas Mahoney,Tyler Chapel Hill,73.48,161.03,90.72,154.22,405.97,Single-ply,SBD,M,
Boys,74.84,8,Cason McFarlin,Whitehouse,70.58,124.74,102.06,161.03,387.82,Single-ply,SBD,M,
Boys,74.84,9,Corey Sanders,Lindale,72.67,136.08,83.91,158.76,378.75,Single-ply,SBD,M,
Boys,74.84,10,Kevin Willis,Lindale,72.85,136.08,95.25,142.88,374.21,Single-ply,SBD,M,
Boys,74.84,11,Tristan Josey,Jacksonville,74.84,142.88,79.38,149.69,371.95,Single-ply,SBD,M,
Boys,74.84,12,Erick Brody,Whitehouse,72.3,129.27,88.45,147.42,365.14,Single-ply,SBD,M,
Boys,74.84,13,Evan Alford,Lindale,72.57,108.86,68.04,131.54,308.44,Single-ply,SBD,M,
Boys,82.1,1,Jaret Allen,Lindale,81.1,158.76,111.13,219.99,489.88,Single-ply,SBD,M,
Boys,82.1,2,Jacob Huddleston,Jacksonville,76.2,183.7,102.06,190.51,476.27,Single-ply,SBD,M,
Boys,82.1,3,Gerardo Ramirez,Jacksonville,77.38,174.63,111.13,181.44,467.2,Single-ply,SBD,M,
Boys,82.1,4,Darion Jones,Jacksonville,76.93,161.03,113.4,179.17,453.59,Single-ply,SBD,M,
Boys,82.1,5,Jordan Slaton,Whitehouse,80.2,154.22,111.13,176.9,442.25,Single-ply,SBD,M,
Boys,82.1,6,Donivon Robinson,Whitehouse,79.65,156.49,102.06,142.88,401.43,Single-ply,SBD,M,
Boys,82.1,7,Lukas Branson,Longview Pine Tree,78.02,140.61,95.25,163.29,399.16,Single-ply,SBD,M,
Boys,82.1,8,Kasey Villareal,Lindale,77.93,158.76,79.38,158.76,396.89,Single-ply,SBD,M,
Boys,89.81,1,Patrick Martinez,Longview Pine Tree,88.18,297.1,167.83,278.96,743.89,Single-ply,SBD,M,
Boys,89.81,2,Jayden Smith #1,Longview Pine Tree,87.54,278.96,163.29,235.87,678.12,Single-ply,SBD,M,
Boys,89.81,3,Luis Lozano,Big Sandy Harmony,88.81,226.8,102.06,195.04,523.9,Single-ply,SBD,M,
Boys,89.81,4,Omarr Webber,Lindale,87.91,183.7,104.33,213.19,501.22,Single-ply,SBD,M,
Boys,89.81,5,Anthony Cummings,Jacksonville,87.63,127.01,86.18,156.49,369.68,Single-ply,SBD,M,
Boys,89.81,DQ,Jacob Taylor,Henderson,89.27,,,,,Single-ply,SBD,M,
Boys,99.79,1,Max Richardson,Tyler Chapel Hill,99.7,233.6,138.35,251.74,623.69,Single-ply,SBD,M,
Boys,99.79,2,Colton Munoz,Longview Pine Tree,91.08,219.99,140.61,219.99,580.6,Single-ply,SBD,M,
Boys,99.79,3,Na'Tyus Kelly,Lindale,97.79,154.22,92.99,181.44,428.64,Single-ply,SBD,M,
Boys,99.79,4,Andrew Mullins,Big Sandy Harmony,94.98,147.42,90.72,158.76,396.89,Single-ply,SBD,M,
Boys,99.79,5,Sutton Frazier,Big Sandy Harmony,96.62,154.22,97.52,142.88,394.63,Single-ply,SBD,M,
Boys,99.79,6,Corey Johnson,Tyler Chapel Hill,94.17,145.15,90.72,154.22,390.09,Single-ply,SBD,M,
Boys,99.79,7,Brantley Bauer,Jacksonville,92.62,161.03,74.84,151.95,387.82,Single-ply,SBD,M,
Boys,99.79,8,Keiler Miller,Lindale,93.89,158.76,77.11,151.95,387.82,Single-ply,SBD,M,
Boys,109.77,1,Zala Antonio,Jacksonville,109.13,195.04,102.06,197.31,494.42,Single-ply,SBD,M,
Boys,109.77,2,Gabe Hart,Lindale,100.06,174.63,95.25,192.78,462.66,Single-ply,SBD,M,
Boys,109.77,3,Emiliano Corona,Jacksonville,101.51,147.42,97.52,195.04,439.98,Single-ply,SBD,M,
Boys,109.77,4,Billy Bateman,Jacksonville,100.43,154.22,102.06,174.63,430.91,Single-ply,SBD,M,
Boys,109.77,5,Raul Duran,Lindale,108.59,176.9,88.45,163.29,428.64,Single-ply,SBD,M,
Boys,109.77,6,Dalton Couch,Lindale,104.05,167.83,99.79,154.22,421.84,Single-ply,SBD,M,
Boys,109.77,7,Colton Moncrief,Whitehouse,105.69,104.33,70.31,115.67,290.3,Single-ply,SBD,M,
Boys,109.77,8,Steven Alexander,Whitehouse,101.24,111.13,65.77,106.59,283.5,Single-ply,SBD,M,
Boys,124.74,1,Brayden Price,Tyler Chapel Hill,118.57,290.3,172.37,226.8,689.46,Single-ply,SBD,M,
Boys,124.74,2,Michael Sutton,Tyler Chapel Hill,119.93,267.62,151.95,249.48,669.05,Single-ply,SBD,M,
Boys,124.74,3,Lance Deal,Whitehouse,114.12,206.38,142.88,226.8,576.06,Single-ply,SBD,M,
Boys,124.74,4,Trey Hudson,Tyler Chapel Hill,116.94,215.46,145.15,197.31,557.92,Single-ply,SBD,M,
Boys,124.74,5,Samuel Quintanilla,Henderson,124.65,197.31,102.06,204.12,503.49,Single-ply,SBD,M,
Boys,124.74,6,Joe Richard,Lindale,114.49,170.1,86.18,183.7,439.98,Single-ply,SBD,M,
Boys,124.74,7,Blake Causey,Jacksonville,119.39,131.54,74.84,147.42,353.8,Single-ply,SBD,M,
Boys,124.74,8,Anthony Yarbrough,Whitehouse,113.67,102.06,68.04,124.74,294.84,Single-ply,SBD,M,
Boys,124.74+,1,Brycelen Phillips,Longview Pine Tree,131.81,181.44,129.27,199.58,510.29,Single-ply,SBD,M,
Boys,124.74+,2,Mason Adams,Henderson,135.53,197.31,115.67,176.9,489.88,Single-ply,SBD,M,
Boys,124.74+,3,Jadarlon Key,Longview Pine Tree,148.51,179.17,102.06,208.65,489.88,Single-ply,SBD,M,
Boys,124.74+,4,Kayden Ballard,Big Sandy Harmony,157.49,195.04,90.72,183.7,469.47,Single-ply,SBD,M,
Boys,124.74+,5,Alexis Martinez #4,Jacksonville,137.26,136.08,77.11,140.61,353.8,Single-ply,SBD,M,
