{
  "npmScope": "phenom-commons",
  "affected": {
    "defaultBase": "master"
  },
  "implicitDependencies": {
    "workspace.json": "*",
    "package.json": {
      "dependencies": "*",
      "devDependencies": "*"
    },
    "tsconfig.base.json": "*",
    "tslint.json": "*",
    ".eslintrc.json": "*",
    "nx.json": "*"
  },
  "tasksRunnerOptions": {
    "default": {
      "runner": "@nrwl/workspace/tasks-runners/default",
      "options": {
        "cacheableOperations": ["build", "lint", "test", "e2e"]
      }
    }
  },
  "projects": {
    "queue-service": {
      "tags": []
    },
    "nest-queue-service": {
      "tags": [],
      "implicitDependencies": ["queue-service"]
    },
    "package-creator": {
      "tags": []
    },
    "xml-generator": {
      "tags": [],
      "implicitDependencies": ["test-utils"]
    },
    "test-utils": {
      "tags": []
    },
    "emails": {
      "tags": []
    },
    "file-repository": {
      "tags": []
    },
    "logger": {
      "tags": []
    }
  }
}
