{
	"info": {
		"_postman_id": "7e545ff5-b0ce-4303-90f4-7374a734760f",
		"name": "Examen final silviopd",
		"schema": "https://schema.getpostman.com/json/collection/v2.1.0/collection.json"
	},
	"item": [
		{
			"name": "Movie",
			"item": [
				{
					"name": "listar",
					"request": {
						"method": "GET",
						"header": [],
						"url": {
							"raw": "http://localhost:8003/api/movies",
							"protocol": "http",
							"host": [
								"localhost"
							],
							"port": "8003",
							"path": [
								"api",
								"movies"
							]
						}
					},
					"response": []
				},
				{
					"name": "crear",
					"request": {
						"method": "POST",
						"header": [],
						"body": {
							"mode": "raw",
							"raw": "{\n    \"name\": \"Dr. Strange2\",\n    \"description\": \"Loco2\",\n    \"premiereDate\": \"2021-05-06\",\n    \"premiere\": false\n}\n",
							"options": {
								"raw": {
									"language": "json"
								}
							}
						},
						"url": {
							"raw": "http://localhost:8003/api/movies",
							"protocol": "http",
							"host": [
								"localhost"
							],
							"port": "8003",
							"path": [
								"api",
								"movies"
							]
						}
					},
					"response": []
				},
				{
					"name": "editar",
					"request": {
						"method": "PUT",
						"header": [],
						"body": {
							"mode": "raw",
							"raw": "{\n    \"id\": 200,\n    \"name\": \"Dr. \",\n    \"description\": \"asdasd\",\n    \"premiereDate\": \"2021-05-06\",\n    \"premiere\": false\n}\n",
							"options": {
								"raw": {
									"language": "json"
								}
							}
						},
						"url": {
							"raw": "http://localhost:8003/api/movies",
							"protocol": "http",
							"host": [
								"localhost"
							],
							"port": "8003",
							"path": [
								"api",
								"movies"
							]
						}
					},
					"response": []
				},
				{
					"name": "eliminar",
					"request": {
						"method": "DELETE",
						"header": [],
						"url": {
							"raw": "http://localhost:8003/api/movies/9",
							"protocol": "http",
							"host": [
								"localhost"
							],
							"port": "8003",
							"path": [
								"api",
								"movies",
								"9"
							]
						}
					},
					"response": []
				}
			]
		},
		{
			"name": "Usuario",
			"item": [
				{
					"name": "iniciarSesion",
					"request": {
						"method": "GET",
						"header": [],
						"url": {
							"raw": "http://localhost:8003/api/movies",
							"protocol": "http",
							"host": [
								"localhost"
							],
							"port": "8003",
							"path": [
								"api",
								"movies"
							]
						}
					},
					"response": []
				}
			]
		},
		{
			"name": "Review",
			"item": [
				{
					"name": "listar",
					"request": {
						"method": "GET",
						"header": [],
						"url": {
							"raw": "http://localhost:8003/api/reviews",
							"protocol": "http",
							"host": [
								"localhost"
							],
							"port": "8003",
							"path": [
								"api",
								"reviews"
							]
						}
					},
					"response": []
				},
				{
					"name": "crear",
					"request": {
						"method": "POST",
						"header": [],
						"body": {
							"mode": "raw",
							"raw": "{\n    \"comment\": \"Dr. Strange2\",\n    \"commentator\": \"Loco2\",\n    \"createAt\": \"2021-05-06\",\n    \"movie\": 37\n}\n",
							"options": {
								"raw": {
									"language": "json"
								}
							}
						},
						"url": {
							"raw": "http://localhost:8003/api/reviews",
							"protocol": "http",
							"host": [
								"localhost"
							],
							"port": "8003",
							"path": [
								"api",
								"reviews"
							]
						}
					},
					"response": []
				},
				{
					"name": "editar",
					"request": {
						"method": "PUT",
						"header": [],
						"body": {
							"mode": "raw",
							"raw": "{\n    \"id\": 200,\n    \"name\": \"Dr. \",\n    \"description\": \"asdasd\",\n    \"premiereDate\": \"2021-05-06\",\n    \"premiere\": false\n}\n",
							"options": {
								"raw": {
									"language": "json"
								}
							}
						},
						"url": {
							"raw": "http://localhost:8003/api/movies",
							"protocol": "http",
							"host": [
								"localhost"
							],
							"port": "8003",
							"path": [
								"api",
								"movies"
							]
						}
					},
					"response": []
				},
				{
					"name": "eliminar",
					"request": {
						"method": "DELETE",
						"header": [],
						"url": {
							"raw": "http://localhost:8003/api/movies/9",
							"protocol": "http",
							"host": [
								"localhost"
							],
							"port": "8003",
							"path": [
								"api",
								"movies",
								"9"
							]
						}
					},
					"response": []
				}
			]
		}
	]
}