/Users/silviopd/Documents/NTT Data/clase3/src/main/java/Model/Ejercicio3/Main.java
/Users/silviopd/Documents/NTT Data/clase3/src/main/java/Model/Ejercicio3/Serie.java
/Users/silviopd/Documents/NTT Data/clase3/src/main/java/Model/Ejercicio1/Main.java
/Users/silviopd/Documents/NTT Data/clase3/src/main/java/Model/Ejercicio1/Calculadora.java
/Users/silviopd/Documents/NTT Data/clase3/src/main/java/Model/Ejercicio2/Persona.java
/Users/silviopd/Documents/NTT Data/clase3/src/main/java/Model/Ejercicio3/Entregable.java
/Users/silviopd/Documents/NTT Data/clase3/src/main/java/Model/Ejercicio2/Main.java
/Users/silviopd/Documents/NTT Data/clase3/src/main/java/Model/Ejercicio3/Videojuegos.java
