{
	"info": {
		"_postman_id": "0f659363-19d7-416e-b7e5-1df162259795",
		"name": "Curso Angular",
		"schema": "https://schema.getpostman.com/json/collection/v2.1.0/collection.json",
		"_exporter_id": "561739"
	},
	"item": [
		{
			"name": "Producto",
			"item": [
				{
					"name": "Listar",
					"request": {
						"method": "GET",
						"header": [],
						"url": {
							"raw": "localhost:9090/product",
							"host": [
								"localhost"
							],
							"port": "9090",
							"path": [
								"product"
							]
						}
					},
					"response": []
				},
				{
					"name": "Crear",
					"request": {
						"method": "POST",
						"header": [],
						"body": {
							"mode": "raw",
							"raw": "{\r\n    \"address\": \"sdf233\",\r\n    \"date\": \"1992-02-02\",\r\n    \"location\": \"asdf2\",\r\n    \"name\": \"sdfsafdsa2\",\r\n    \"price\": 13\r\n}",
							"options": {
								"raw": {
									"language": "json"
								}
							}
						},
						"url": {
							"raw": "http://localhost:9090/product/",
							"protocol": "http",
							"host": [
								"localhost"
							],
							"port": "9090",
							"path": [
								"product",
								""
							]
						}
					},
					"response": []
				},
				{
					"name": "Actualizar",
					"request": {
						"method": "PUT",
						"header": [],
						"body": {
							"mode": "raw",
							"raw": "{\r\n    \"id\": \"13\",\r\n    \"address\": \"2341324\",\r\n    \"date\": \"1992-02-02\",\r\n    \"location\": \"2134\",\r\n    \"name\": \"234\",\r\n    \"price\": 1322\r\n}",
							"options": {
								"raw": {
									"language": "json"
								}
							}
						},
						"url": {
							"raw": "http://localhost:9090/product/",
							"protocol": "http",
							"host": [
								"localhost"
							],
							"port": "9090",
							"path": [
								"product",
								""
							]
						}
					},
					"response": []
				},
				{
					"name": "Eliminar",
					"request": {
						"method": "DELETE",
						"header": [],
						"url": {
							"raw": "http://localhost:9090/product/10",
							"protocol": "http",
							"host": [
								"localhost"
							],
							"port": "9090",
							"path": [
								"product",
								"10"
							]
						}
					},
					"response": []
				},
				{
					"name": "Buscar por Id",
					"request": {
						"method": "GET",
						"header": [],
						"url": {
							"raw": "http://localhost:9090/product/1",
							"protocol": "http",
							"host": [
								"localhost"
							],
							"port": "9090",
							"path": [
								"product",
								"1"
							]
						}
					},
					"response": []
				}
			]
		},
		{
			"name": "Articulo",
			"item": [
				{
					"name": "Listar",
					"request": {
						"method": "GET",
						"header": [],
						"url": {
							"raw": "localhost:9090/articulo/?page=0&size=5&enablePagination=true",
							"host": [
								"localhost"
							],
							"port": "9090",
							"path": [
								"articulo",
								""
							],
							"query": [
								{
									"key": "page",
									"value": "0"
								},
								{
									"key": "size",
									"value": "5"
								},
								{
									"key": "enablePagination",
									"value": "true"
								}
							]
						}
					},
					"response": []
				},
				{
					"name": "Crear",
					"request": {
						"method": "POST",
						"header": [],
						"body": {
							"mode": "raw",
							"raw": "{\r\n    \"address\": \"sdf233\",\r\n    \"date\": \"1992-02-02\",\r\n    \"location\": \"asdf2\",\r\n    \"name\": \"sdfsafdsa2\",\r\n    \"price\": 13\r\n}",
							"options": {
								"raw": {
									"language": "json"
								}
							}
						},
						"url": {
							"raw": "http://localhost:9090/product/",
							"protocol": "http",
							"host": [
								"localhost"
							],
							"port": "9090",
							"path": [
								"product",
								""
							]
						}
					},
					"response": []
				},
				{
					"name": "Actualizar",
					"request": {
						"method": "PUT",
						"header": [],
						"body": {
							"mode": "raw",
							"raw": "{\r\n    \"id\": \"13\",\r\n    \"address\": \"2341324\",\r\n    \"date\": \"1992-02-02\",\r\n    \"location\": \"2134\",\r\n    \"name\": \"234\",\r\n    \"price\": 1322\r\n}",
							"options": {
								"raw": {
									"language": "json"
								}
							}
						},
						"url": {
							"raw": "http://localhost:9090/product/",
							"protocol": "http",
							"host": [
								"localhost"
							],
							"port": "9090",
							"path": [
								"product",
								""
							]
						}
					},
					"response": []
				},
				{
					"name": "Eliminar",
					"request": {
						"method": "DELETE",
						"header": [],
						"url": {
							"raw": "http://localhost:9090/product/10",
							"protocol": "http",
							"host": [
								"localhost"
							],
							"port": "9090",
							"path": [
								"product",
								"10"
							]
						}
					},
					"response": []
				},
				{
					"name": "Buscar por Id",
					"request": {
						"method": "GET",
						"header": [],
						"url": {
							"raw": "http://localhost:9090/product/1",
							"protocol": "http",
							"host": [
								"localhost"
							],
							"port": "9090",
							"path": [
								"product",
								"1"
							]
						}
					},
					"response": []
				}
			]
		},
		{
			"name": "Auth",
			"item": [
				{
					"name": "signup",
					"request": {
						"method": "POST",
						"header": [],
						"body": {
							"mode": "raw",
							"raw": "{\n    \"username\":\"mod23\",\n    \"email\":\"mod23@bezkoder.com\",\n    \"password\":\"123456789\",\n    \"role\":[\"mod\",\"user\"]\n}",
							"options": {
								"raw": {
									"language": "json"
								}
							}
						},
						"url": {
							"raw": "http://localhost:8080/api/auth/signup",
							"protocol": "http",
							"host": [
								"localhost"
							],
							"port": "8080",
							"path": [
								"api",
								"auth",
								"signup"
							]
						}
					},
					"response": []
				},
				{
					"name": "update",
					"request": {
						"method": "POST",
						"header": [],
						"body": {
							"mode": "raw",
							"raw": "{\n    \"id\": \"1\",\n    \"username\":\"mod3122\",\n    \"email\":\"mod3221@bezkoder.com\",\n    \"password\":\"1234512345\",\n    \"role\":[\"user\",\"mod\"]\n}",
							"options": {
								"raw": {
									"language": "json"
								}
							}
						},
						"url": {
							"raw": "http://localhost:8080/api/auth/update",
							"protocol": "http",
							"host": [
								"localhost"
							],
							"port": "8080",
							"path": [
								"api",
								"auth",
								"update"
							]
						}
					},
					"response": []
				},
				{
					"name": "signin",
					"request": {
						"method": "POST",
						"header": [],
						"body": {
							"mode": "raw",
							"raw": "{\n    \"username\":\"mod\",\n    \"password\":\"123456789\"\n}",
							"options": {
								"raw": {
									"language": "json"
								}
							}
						},
						"url": {
							"raw": "http://localhost:8080/api/auth/signin",
							"protocol": "http",
							"host": [
								"localhost"
							],
							"port": "8080",
							"path": [
								"api",
								"auth",
								"signin"
							]
						}
					},
					"response": []
				},
				{
					"name": "listar",
					"request": {
						"method": "GET",
						"header": [],
						"url": {
							"raw": "http://localhost:8080/api/auth/?page=0&size=5&enablePagination=true",
							"protocol": "http",
							"host": [
								"localhost"
							],
							"port": "8080",
							"path": [
								"api",
								"auth",
								""
							],
							"query": [
								{
									"key": "page",
									"value": "0"
								},
								{
									"key": "size",
									"value": "5"
								},
								{
									"key": "enablePagination",
									"value": "true"
								}
							]
						}
					},
					"response": []
				},
				{
					"name": "Buscar por Id",
					"request": {
						"method": "GET",
						"header": [],
						"url": {
							"raw": "http://localhost:8080/api/auth/2",
							"protocol": "http",
							"host": [
								"localhost"
							],
							"port": "8080",
							"path": [
								"api",
								"auth",
								"2"
							]
						}
					},
					"response": []
				}
			]
		}
	],
	"auth": {
		"type": "bearer"
	},
	"event": [
		{
			"listen": "prerequest",
			"script": {
				"type": "text/javascript",
				"exec": [
					""
				]
			}
		},
		{
			"listen": "test",
			"script": {
				"type": "text/javascript",
				"exec": [
					""
				]
			}
		}
	]
}