{
  "project_info": {
    "project_number": "457280795174",
    "firebase_url": "https://medmap-20f15.firebaseio.com",
    "project_id": "medmap-20f15",
    "storage_bucket": "medmap-20f15.appspot.com"
  },
  "client": [
    {
      "client_info": {
        "mobilesdk_app_id": "1:457280795174:android:8d59d24e9d52ed0d",
        "android_client_info": {
          "package_name": "com.example.silvi.medmap_android"
        }
      },
      "oauth_client": [
        {
          "client_id": "457280795174-iu1m6qnaq13sedihl4or3kun3bkd9a0o.apps.googleusercontent.com",
          "client_type": 3
        }
      ],
      "api_key": [
        {
          "current_key": "AIzaSyD4S_irG5jSZYF7lLroXO_ReDkIyIE7ZbQ"
        }
      ],
      "services": {
        "analytics_service": {
          "status": 1
        },
        "appinvite_service": {
          "status": 1,
          "other_platform_oauth_client": []
        },
        "ads_service": {
          "status": 2
        }
      }
    }
  ],
  "configuration_version": "1"
}