{
    "type": "service_account",
    "project_id": "lcl-uccidere-novembre",
    "private_key_id": "04abc3a831a7d21faaac8d1e76f04d6e5cb79522",
    "private_key": "-----BEGIN PRIVATE KEY-----\nMIIEvQIBADANBgkqhkiG9w0BAQEFAASCBKcwggSjAgEAAoIBAQDLokBGwS1cRr7f\n+a59miSqK95xN09Zr7tko0v6LAqGrG3jlkGmVvrxk1ncE5Wa+h9qSHOcxyW6Ub98\n7ACd9kcpT5CroWkB7eJD2Vn8E0C36pecAms5ZtzBwOFYYKVaVVPUW3JeARvzk0UN\nwSOcGdZNkb1AmMe6XSxXyyz0I4l39BGRs57NZdXO1pq3Y+zoSJVWoFM0T9i3TrIU\n+Ij2dIAs9wttRyYZItbvimow0lkd6GTkx3Ucs+yXGwGsWtlzWwOHkmkzIwjDoI9w\nFd5WJnf6tP5szhLGIBugbj/yZMV5T9a5g5kgHYbXzHV/mUMi8mpSMjXyi9pQa9/U\newDXIminAgMBAAECggEACklHYuuWLX+bW7gCkvCq4ne11FU9amPgnOxMxbXc0EG8\niU8JQOxK39IYK3BH0dzJonZHdMdwhfFkMVzAiTosDQ+qWKkeI01PbSr5Cy0zyzaL\n8wMCRJOIGjdyiqLTJ3WA9wypgcsfjNXHGrNDZ7q8Yw22GCG/kQ/s0gB+5FQ5OPhh\nq7HifoYJd4n7Syto5BFvE74K036KjT0By3Mn6Mq+aspRnkxa/I6JXoIJlna/WEdA\nBNRLYKUm6av0xmF9BiVQn3SzxGsBNacR9e2+i2fKLzJ4jS/fbaNIn8rYeW+9YGsa\nj1kSF9xulB0TSfhEtcvcKoGJ51JeGJ9JYRtOTDmmGQKBgQDkl6M6gesdJb9vSkOE\nSYXaADmDdM6nwlVHiNUv6m5uZIflEqgBk/7iVehPIaFnXlXwXBTx5vQo3OlBIgjQ\nWmEcjW4t2WdCQ/f/K1KpoOgOwgRGd+c0pGoTRAsCY7Jf0NlzVD+WCLBmN5BVZ3rd\nVifUKNgPs59Wuw/RE/KsY3b4yQKBgQDkDIqiqxhb0gB8fqoquC1RzreniKZEbCKD\nrtMDXqN/H+A2gcCkn5/EHGes+vtybEfZBI4mzj2xBvRHdGCKzspwkHvoDqAU3DNS\nrPLN7NtOWbK1vZQJ5kRMj0/FezF22ghFvkz8o8ca8ExBkxGMCNUbN7g6XMCO86Iy\nD7Qu5+Z97wKBgHpUrAWjgS8YBFqKY5dnwTno5N50pCMi3IBruarqyi5Jnm/4i/BM\nQxrc3nV6ieXHljYLESpjbkZv8mPo0s6tj0q4ZT4kGh5cQVtM0+/zLDy5l5AempyR\nYDLvNvUQZWThX31YmK6x97S8B4Gs3xOUB7yCHx5IAf1oHg7FnhijIggBAoGAMCi1\n3kRjkIB4udHF/d+HMo+FGUwyUKDFaSmyRjPmMyJ4JwqftCRBiRi2jEE0eKWFRr8/\nhdJoFMpzK+PXv3iMJ9lbUVZFWCJodD0xyWsLpTAsHVU7vhtysPhS0FGD0KWauZ/G\nglPT6Ex2ziJQwlHbLzRFI44S3B13UzsdwgoXEuECgYEAk/9AotBKsd3R57a8slNy\nUzhqYNRtmKtNEEgSQjDJ9aRQYYY1U5Gdnnu9VH1zQSYuBSaGE5vfenzXOy4HSml/\npDmwH0rhGNQKd551aMa07cAC1dAJd/qF5nQ8Os5WJ8i5TknvgkmwTjEifcUHCxFO\nl5pOwlMpivwylBi3lFps7Iw=\n-----END PRIVATE KEY-----\n",
    "client_email": "lcl-378@lcl-uccidere-novembre.iam.gserviceaccount.com",
    "client_id": "117664294157172773672",
    "auth_uri": "https://accounts.google.com/o/oauth2/auth",
    "token_uri": "https://oauth2.googleapis.com/token",
    "auth_provider_x509_cert_url": "https://www.googleapis.com/oauth2/v1/certs",
    "client_x509_cert_url": "https://www.googleapis.com/robot/v1/metadata/x509/lcl-378%40lcl-uccidere-novembre.iam.gserviceaccount.com"
  }
  