{
  "project_info": {
    "project_number": "713465333143",
    "firebase_url": "https://gostore-9b7c8.firebaseio.com",
    "project_id": "gostore-9b7c8",
    "storage_bucket": "gostore-9b7c8.appspot.com"
  },
  "client": [
    {
      "client_info": {
        "mobilesdk_app_id": "1:713465333143:android:97e559642bd2bf82",
        "android_client_info": {
          "package_name": "com.otacodes.gostore"
        }
      },
      "oauth_client": [
        {
          "client_id": "713465333143-cqbq15ll9rsle01s7ene9kfaie4hkb22.apps.googleusercontent.com",
          "client_type": 1,
          "android_info": {
            "package_name": "com.otacodes.gostore",
            "certificate_hash": "e21a6230e84ead0957aa267446809256edd20bac"
          }
        },
        {
          "client_id": "713465333143-63gfq7rq5c67ggslmhj8f9qrcmvo1q2c.apps.googleusercontent.com",
          "client_type": 1,
          "android_info": {
            "package_name": "com.otacodes.gostore",
            "certificate_hash": "20efd5c424e6a19f5f5c6f93e239a36c9e70f6de"
          }
        },
        {
          "client_id": "713465333143-lj5vb7n9ck2s6pri5bnk1qvvr3a4uasf.apps.googleusercontent.com",
          "client_type": 3
        }
      ],
      "api_key": [
        {
          "current_key": "AIzaSyCGJspDFF_Cz7nXGH2GgeUnAuMAkzREX-k"
        }
      ],
      "services": {
        "appinvite_service": {
          "other_platform_oauth_client": [
            {
              "client_id": "713465333143-lj5vb7n9ck2s6pri5bnk1qvvr3a4uasf.apps.googleusercontent.com",
              "client_type": 3
            }
          ]
        }
      }
    }
  ],
  "configuration_version": "1"
}