{
  "users": [
    {
      "id": "1",
      "name": "Paper 2 Syllabus",
      "email": "Engg. Subordinate Exam",
      "link": "https://www.dropbox.com/s/r4446xvgyq2rjnq/syllabus_paper_2.pdf?dl=1"
    },
    {
      "id": "2",
      "name": "Previous Year Solved papers",
      "email": "Paper 2",
      "link": "https://www.dropbox.com/s/wdfq9kduqygwy5e/merged_old_paper_2.pdf?dl=1"
    },
    {
      "id": "3",
      "name": "Study Material coming soon",
      "email": "Work in Progress",
      "link": "https://www.dropbox.com/s/r4446xvgyq2rjnq/syllabus_paper_2.pdf?dl=1"
    }

  ]
}
