../Core/Src/stm32f1xx_hal_msp.c:66:6:HAL_MspInit	16	static
../Core/Src/stm32f1xx_hal_msp.c:88:6:HAL_ADC_MspInit	40	static
../Core/Src/stm32f1xx_hal_msp.c:142:6:HAL_ADC_MspDeInit	16	static
../Core/Src/stm32f1xx_hal_msp.c:177:6:HAL_CAN_MspInit	48	static
../Core/Src/stm32f1xx_hal_msp.c:221:6:HAL_CAN_MspDeInit	16	static
../Core/Src/stm32f1xx_hal_msp.c:252:6:HAL_TIM_Base_MspInit	24	static
../Core/Src/stm32f1xx_hal_msp.c:279:6:HAL_TIM_MspPostInit	40	static
../Core/Src/stm32f1xx_hal_msp.c:316:6:HAL_TIM_Base_MspDeInit	16	static
