../Core/Inc/PCBs/SBC_func.c:59:8:get_V_Hi	0	static
../Core/Inc/PCBs/SBC_func.c:63:8:get_I_Hi	0	static
../Core/Inc/PCBs/SBC_func.c:67:8:get_V_Lo	0	static
../Core/Inc/PCBs/SBC_func.c:71:8:get_I_Lo	0	static
../Core/Inc/PCBs/SBC_func.c:85:7:enable_PWM	16	static
../Core/Inc/PCBs/SBC_func.c:92:7:disable_PWM	16	static
