VHi,VLo,ILo,IHi
1.608,-0.008,0.000,0.008
1.608,0.000,0.000,0.016
1.608,-0.008,0.000,0.008
1.608,-0.008,0.000,0.016
1.608,0.000,0.000,0.016
1.608,0.000,0.000,0.008
1.608,0.000,0.000,0.008
1.608,0.000,0.000,0.008
1.608,-0.008,0.000,0.008
1.608,0.000,0.000,0.008
1.608,-0.008,0.000,0.008
1.608,0.000,0.000,0.008
1.608,-0.008,0.000,0.016
1.608,-0.008,0.000,0.016
1.608,-0.008,0.000,0.008
1.608,-0.008,0.000,0.008
1.608,-0.008,0.000,0.016
1.608,-0.008,0.000,0.016
1.608,-0.008,0.000,0.016
1.608,0.000,0.000,0.008
1.608,-0.008,0.000,0.008
1.608,-0.008,0.000,0.008
1.608,-0.008,0.000,0.008
1.608,0.000,0.000,0.016
1.608,-0.008,0.000,0.016
1.608,-0.008,0.000,0.016
1.608,-0.008,0.000,0.000
1.608,-0.008,0.000,0.008
1.608,0.000,0.000,0.016
1.608,0.000,0.000,0.008
1.608,-0.008,0.000,0.016
1.608,-0.008,0.000,0.008
1.625,-0.008,0.000,0.016
1.608,-0.008,0.000,0.008
1.608,0.000,0.000,0.016
1.608,-0.008,0.000,0.016
1.608,0.000,0.000,0.008
1.608,0.000,0.000,0.016
1.608,-0.008,0.000,0.008
1.608,-0.008,0.000,0.008
1.608,-0.008,0.000,0.008
1.608,-0.008,0.000,0.016
1.608,0.000,0.000,0.008
1.608,0.000,0.000,0.008
1.608,-0.008,0.000,0.008
1.608,-0.008,0.000,0.008
1.608,-0.008,0.000,0.008
1.608,-0.008,0.000,0.008
1.608,-0.008,0.000,0.008
1.608,0.000,0.000,0.008
1.608,-0.008,0.000,0.008
1.608,-0.008,0.000,0.016
1.608,-0.008,0.000,0.008
1.625,-0.008,0.000,0.016
1.608,0.000,0.000,0.008
1.625,-0.008,0.000,0.008
1.608,-0.008,0.000,0.008
1.608,-0.008,0.000,0.008
1.608,0.000,0.000,0.016
1.608,0.000,0.000,0.016
1.608,-0.008,0.000,0.016
1.608,-0.008,0.000,0.008
1.608,-0.008,0.000,0.008
1.608,0.000,0.000,0.008
1.608,0.000,0.000,0.016
1.608,-0.008,0.000,0.008
1.608,-0.008,0.000,0.008
1.625,-0.008,0.000,0.008
1.608,-0.008,0.000,0.008
1.608,-0.008,0.000,0.016
1.608,-0.008,0.000,0.016
1.608,-0.008,0.000,0.016
1.608,-0.008,0.000,0.008
1.608,0.000,0.000,0.008
1.608,0.000,0.000,0.016
1.608,-0.008,0.000,0.016
1.608,0.000,0.000,0.016
1.625,0.000,0.000,0.008
1.608,-0.008,0.000,0.016
1.625,-0.008,0.000,0.008
1.608,0.000,0.000,0.016
1.608,0.000,0.000,0.008
1.608,-0.008,0.000,0.008
1.608,-0.008,0.000,0.008
1.625,-0.008,0.000,0.016
1.608,-0.008,0.000,0.008
1.608,-0.008,0.000,0.000
1.608,-0.008,0.000,0.016
1.608,-0.008,0.000,0.008
1.608,-0.008,0.000,0.000
1.608,-0.008,0.000,0.008
1.625,0.000,0.000,0.008
1.608,-0.008,0.000,0.008
1.608,-0.008,0.000,0.008
1.625,0.000,0.000,0.008
1.608,-0.008,0.000,0.008
1.608,-0.008,0.000,0.008
1.608,0.000,0.000,0.016
1.608,0.000,0.000,0.016
1.608,0.000,0.000,0.008
1.625,0.000,0.000,0.016
1.625,0.000,0.000,0.008
1.608,-0.008,0.000,0.008
1.625,-0.008,0.000,0.008
1.625,-0.008,0.000,0.008
1.608,-0.008,0.000,0.008
1.608,-0.008,0.000,0.008
1.608,-0.008,0.000,0.008
1.608,-0.008,0.000,0.016
1.608,0.000,0.000,0.008
1.608,-0.008,0.000,0.008
1.625,0.000,0.000,0.016
1.608,-0.008,0.000,0.008
1.608,-0.008,0.000,0.008
1.608,0.000,0.000,0.008
1.625,-0.008,0.000,0.008
1.608,0.000,0.000,0.016
1.608,-0.008,0.000,0.008
1.608,0.000,0.000,0.008
1.608,0.000,0.000,0.008
1.625,-0.008,0.000,0.016
1.608,-0.008,0.000,0.016
1.608,0.000,0.000,0.008
1.625,-0.008,0.000,0.000
1.625,-0.008,0.000,0.008
1.625,-0.008,0.000,0.008
1.625,-0.008,0.000,0.016
1.625,-0.008,0.000,0.008
1.625,0.000,0.000,0.016
1.625,0.000,0.000,0.016
1.625,0.000,0.000,0.008
1.625,-0.008,0.000,0.008
1.625,-0.008,0.000,0.008
1.625,0.000,0.000,0.008
1.625,-0.008,0.000,0.008
1.625,0.000,0.000,0.008
1.625,-0.008,0.000,0.008
1.625,0.000,0.000,0.016
1.625,0.000,0.000,0.008
1.625,0.000,0.000,0.008
1.625,0.000,0.000,0.016
1.625,0.000,0.000,0.016
1.625,0.000,0.000,0.008
1.608,0.000,0.000,0.008
1.625,-0.008,0.000,0.016
1.625,0.000,0.000,0.008
1.625,-0.008,0.000,0.008
1.608,0.000,0.000,0.008
1.625,-0.008,0.000,0.016
1.625,-0.008,0.000,0.008
1.625,0.000,0.000,0.008
1.625,0.000,0.000,0.008
1.625,-0.008,0.000,0.008
1.625,-0.008,0.000,0.008
1.625,-0.008,0.000,0.008
1.625,0.000,0.000,0.016
1.625,0.000,0.000,0.008
1.625,-0.008,0.000,0.008
1.625,-0.008,0.000,0.008
1.625,-0.008,0.000,0.008
1.625,-0.008,0.000,0.016
1.625,-0.008,0.000,0.008
1.625,-0.008,0.000,0.016
1.625,-0.008,0.000,0.008
1.625,-0.008,0.000,0.008
1.625,-0.008,0.000,0.016
1.642,0.000,0.000,0.016
1.625,-0.008,0.000,0.016
1.625,-0.008,0.000,0.008
1.625,0.000,0.000,0.016
1.625,-0.008,0.000,0.008
1.608,-0.008,0.000,0.016
1.625,0.000,0.000,0.008
1.625,0.000,0.000,0.008
1.625,0.000,0.000,0.008
1.625,-0.008,0.000,0.016
1.625,-0.008,0.000,0.008
1.625,-0.008,0.000,0.016
1.625,-0.008,0.000,0.008
1.625,-0.008,0.000,0.008
1.625,-0.008,0.000,0.008
1.608,-0.008,0.000,0.016
1.625,0.000,0.000,0.008
1.642,-0.008,0.000,0.016
1.625,0.000,0.000,0.016
1.625,-0.008,0.000,0.008
1.625,0.000,0.000,0.008
1.625,0.000,0.000,0.008
1.625,-0.008,0.000,0.016
1.625,-0.008,0.000,0.008
1.625,0.000,0.000,0.016
1.625,0.000,0.000,0.016
1.625,-0.008,0.000,0.016
1.625,0.000,0.000,0.008
1.625,-0.008,0.000,0.008
1.625,-0.008,0.000,0.016
1.625,-0.008,0.000,0.016
1.625,-0.008,0.000,0.008
1.625,-0.008,0.000,0.008
1.625,-0.008,0.000,0.016
1.625,-0.008,0.000,0.016
1.625,-0.008,0.000,0.008
1.625,-0.008,0.000,0.008
1.625,0.000,0.000,0.016
1.625,0.000,0.000,0.016
1.625,-0.008,0.000,0.008
1.625,0.000,0.000,0.016
1.642,0.000,0.000,0.008
1.625,-0.008,0.000,0.008
1.625,0.000,0.000,0.016
1.625,0.000,0.000,0.008
1.642,0.000,0.000,0.008
1.642,-0.008,0.000,0.016
1.642,-0.008,0.000,0.016
1.625,-0.008,0.000,0.008
1.625,-0.008,0.000,0.008
1.625,0.000,0.000,0.016
1.625,-0.008,0.000,0.016
1.625,0.000,0.000,0.008
1.625,-0.008,0.000,0.008
1.625,-0.008,0.000,0.008
1.642,0.000,0.000,0.016
1.625,0.000,0.000,0.008
1.625,0.000,0.000,0.016
1.625,-0.008,0.000,0.008
1.625,-0.008,0.000,0.016
1.625,0.000,0.000,0.008
1.642,0.000,0.000,0.008
1.642,-0.008,0.000,0.016
1.625,0.000,0.000,0.016
1.625,-0.008,0.000,0.008
1.625,0.000,0.000,0.008
1.625,0.000,0.000,0.008
1.625,-0.008,0.000,0.008
1.642,-0.008,0.000,0.016
1.625,0.000,0.000,0.016
1.642,0.000,0.000,0.016
1.642,-0.008,0.000,0.016
1.625,0.000,0.000,0.008
1.642,0.000,0.000,0.016
1.625,-0.008,0.000,0.016
1.625,0.000,0.000,0.008
1.642,-0.008,0.000,0.016
1.625,-0.008,0.000,0.008
1.625,-0.008,0.000,0.008
1.625,-0.008,0.000,0.008
1.625,0.000,0.000,0.016
1.642,0.000,0.000,0.008
1.642,-0.008,0.000,0.016
1.642,0.000,0.000,0.016
1.642,-0.008,0.000,0.008
1.642,-0.008,0.000,0.008
1.642,0.000,0.000,0.008
1.743,0.008,0.000,0.016
1.862,0.008,0.000,0.016
1.980,0.008,0.000,0.016
2.115,0.008,0.000,0.016
2.234,0.008,0.000,0.008
2.352,0.008,0.000,0.008
2.471,0.008,0.000,0.008
2.589,0.008,0.000,0.016
2.708,0.000,0.000,0.016
2.826,0.008,0.000,0.016
2.962,0.008,0.000,0.016
3.063,0.008,0.000,0.008
3.182,0.008,0.000,0.016
3.300,0.008,0.000,0.008
3.418,0.008,0.000,0.016
3.537,0.008,0.000,0.008
3.655,0.008,0.000,0.016
3.774,0.008,0.000,0.016
3.875,0.008,0.000,0.016
3.994,0.008,0.000,0.016
4.112,0.008,0.000,0.016
4.231,0.008,0.000,0.008
4.349,0.008,0.000,0.008
4.451,0.000,0.000,0.016
4.569,0.000,0.000,0.016
4.688,0.008,0.000,0.016
4.789,0.000,0.000,0.016
4.908,0.000,0.000,0.016
5.026,0.000,0.000,0.016
5.128,0.008,0.000,0.016
5.246,0.008,0.000,0.016
5.365,0.008,0.000,0.016
5.466,0.008,0.000,0.016
5.568,0.000,0.000,0.016
5.686,0.008,0.000,0.016
5.771,0.008,0.000,0.016
5.906,0.008,0.000,0.016
6.008,0.000,0.000,0.016
6.109,0.000,0.000,0.024
6.211,0.008,0.000,0.016
6.329,0.008,0.000,0.024
6.448,0.008,0.000,0.024
6.549,0.008,0.000,0.024
6.651,0.000,0.000,0.016
6.769,0.008,0.000,0.024
6.871,0.008,0.000,0.024
6.972,0.008,0.000,0.024
7.074,0.008,0.000,0.024
7.175,0.000,0.000,0.016
7.294,0.000,0.000,0.016
7.395,0.008,0.000,0.024
7.497,0.008,0.000,0.016
7.598,0.008,0.000,0.024
7.700,0.008,0.000,0.024
7.802,0.008,0.000,0.016
7.903,0.008,0.000,0.016
8.005,0.008,0.000,0.024
8.123,0.000,0.000,0.024
8.225,0.008,0.000,0.024
8.326,0.008,0.000,0.024
8.428,0.008,0.000,0.024
8.529,0.008,0.000,0.024
8.631,0.008,0.000,0.024
8.732,0.000,0.000,0.024
8.834,0.008,0.000,0.024
8.935,0.008,0.000,0.024
9.037,0.008,0.000,0.024
9.138,0.000,0.000,0.024
9.240,0.000,0.000,0.016
9.325,0.000,0.000,0.024
9.426,0.008,0.000,0.016
9.528,0.008,0.000,0.024
9.629,0.008,0.000,0.024
9.731,0.008,0.000,0.024
9.815,0.008,0.000,0.024
9.917,0.008,0.000,0.024
10.018,0.008,0.000,0.024
10.120,0.008,0.000,0.024
10.205,0.000,0.000,0.024
10.306,0.000,0.000,0.024
10.408,0.000,0.000,0.024
10.509,0.000,0.000,0.024
10.594,0.000,0.000,0.024
10.695,0.008,0.000,0.016
10.780,0.008,0.000,0.024
10.882,0.008,0.000,0.024
10.966,0.000,0.000,0.024
11.068,0.000,0.000,0.024
11.169,0.008,0.000,0.024
11.254,0.008,0.000,0.024
11.355,0.000,0.000,0.024
11.457,0.008,0.000,0.024
11.542,0.000,0.000,0.024
11.626,0.000,0.000,0.024
11.728,0.008,0.000,0.024
11.829,0.008,0.000,0.024
11.914,0.000,0.000,0.016
11.998,0.000,0.000,0.024
12.083,0.008,0.000,0.024
12.185,0.008,0.000,0.024
12.269,0.008,0.000,0.024
12.354,0.000,0.000,0.024
12.455,0.000,0.000,0.024
12.540,0.008,0.000,0.024
12.642,0.000,0.000,0.024
12.709,0.008,0.000,0.024
12.811,0.008,0.000,0.024
12.895,0.000,0.000,0.024
12.997,0.000,0.000,0.024
13.082,0.000,0.000,0.024
13.166,0.000,0.000,0.024
13.251,0.000,0.000,0.032
13.352,0.000,0.000,0.032
13.420,0.008,0.000,0.032
13.522,0.008,0.000,0.024
13.606,0.000,0.000,0.024
13.691,0.008,0.000,0.032
13.792,0.008,0.000,0.032
13.860,0.008,0.000,0.024
13.962,0.000,0.000,0.032
14.046,0.000,0.000,0.024
14.131,0.008,0.000,0.024
14.198,0.000,0.000,0.024
14.300,0.000,0.000,0.032
14.385,0.000,0.000,0.024
14.469,0.000,0.000,0.032
14.554,0.008,0.000,0.024
14.638,0.000,0.000,0.024
14.723,0.000,0.000,0.024
14.808,0.000,0.000,0.032
14.892,0.008,0.000,0.032
14.977,0.008,0.000,0.032
15.045,0.008,0.000,0.024
15.146,0.000,0.000,0.032
15.231,0.000,0.000,0.032
15.315,0.008,0.000,0.032
15.383,0.008,0.000,0.024
15.468,0.000,0.000,0.032
15.552,0.000,0.000,0.024
15.637,0.008,0.000,0.032
15.722,0.000,0.000,0.032
15.789,0.000,0.000,0.032
15.874,0.000,0.000,0.024
15.958,0.000,0.000,0.032
16.043,0.008,0.000,0.024
16.128,0.000,0.000,0.032
16.195,0.000,0.000,0.032
16.280,0.000,0.000,0.024
16.365,0.000,0.000,0.032
16.449,0.000,0.000,0.032
16.517,0.000,0.000,0.032
16.602,0.000,0.000,0.032
16.686,0.000,0.000,0.032
16.754,0.008,0.000,0.024
16.838,0.008,0.000,0.032
16.906,0.000,0.000,0.032
16.991,0.000,0.000,0.032
17.075,0.000,0.000,0.032
17.143,0.000,0.000,0.032
17.228,0.000,0.000,0.032
17.312,0.000,0.000,0.032
17.380,0.000,0.000,0.032
17.465,0.000,0.000,0.032
17.532,0.000,0.000,0.032
17.617,0.000,0.000,0.032
17.685,0.000,0.000,0.032
17.752,0.000,0.000,0.032
17.837,0.008,0.000,0.032
17.922,0.000,0.000,0.032
17.989,0.000,0.000,0.024
18.074,0.000,0.000,0.032
18.142,0.000,0.000,0.032
18.209,0.000,0.000,0.024
18.294,0.000,0.000,0.040
18.362,0.000,0.000,0.032
18.446,0.008,0.000,0.032
18.497,0.000,0.000,0.032
18.582,0.008,0.000,0.032
18.666,0.000,0.000,0.032
18.734,0.008,0.000,0.032
18.818,0.000,0.000,0.032
18.886,0.000,0.000,0.032
18.954,0.000,0.000,0.032
19.022,0.000,0.000,0.032
19.106,0.000,0.000,0.032
19.174,0.000,0.000,0.032
19.242,0.000,0.000,0.032
19.326,0.000,0.000,0.032
19.377,0.000,0.000,0.040
19.462,0.000,0.000,0.040
19.529,0.000,0.000,0.040
19.597,0.000,0.000,0.040
19.665,0.000,0.000,0.040
19.732,0.000,0.000,0.040
19.817,0.008,0.000,0.032
19.885,0.008,0.000,0.040
19.952,0.000,0.000,0.040
20.020,0.008,0.000,0.032
20.088,0.000,0.000,0.040
20.172,0.000,0.000,0.040
20.240,0.000,0.000,0.040
20.308,0.000,0.000,0.040
20.375,0.000,0.000,0.032
20.443,0.000,0.000,0.040
20.511,0.000,0.000,0.040
20.578,0.000,0.000,0.040
20.646,0.000,0.000,0.040
20.714,0.000,0.000,0.040
20.782,0.000,0.000,0.040
20.849,0.000,0.000,0.040
20.917,0.000,0.000,0.040
20.985,0.000,0.000,0.040
21.052,0.000,0.000,0.040
21.120,0.000,0.000,0.040
21.188,0.000,0.000,0.040
21.255,0.000,0.000,0.040
21.323,0.000,0.000,0.048
21.391,0.000,0.000,0.040
21.458,0.000,0.000,0.040
21.509,0.000,0.000,0.040
21.594,0.000,0.000,0.040
21.645,0.000,0.000,0.048
21.712,0.000,0.000,0.040
21.780,0.000,0.000,0.040
21.848,0.000,0.000,0.040
21.915,0.000,0.000,0.040
21.966,0.000,0.000,0.040
22.034,0.000,0.000,0.040
22.118,0.000,0.000,0.040
22.169,0.000,0.000,0.040
22.220,0.000,0.000,0.040
22.305,0.000,0.000,0.040
22.355,0.000,0.000,0.040
22.423,0.000,0.000,0.040
22.491,0.000,0.000,0.040
22.542,0.000,0.000,0.040
22.626,0.000,0.000,0.048
22.677,0.000,0.000,0.040
22.745,0.000,0.000,0.040
22.812,0.000,0.000,0.040
22.880,0.000,0.000,0.040
22.931,0.000,0.000,0.040
22.982,0.000,0.000,0.048
23.066,0.000,0.000,0.048
23.117,0.000,0.000,0.040
23.185,0.000,0.000,0.048
23.235,0.000,0.000,0.040
23.303,0.000,0.000,0.040
23.371,0.000,0.000,0.048
23.422,0.000,0.000,0.048
23.489,0.000,0.000,0.040
23.557,0.000,0.000,0.048
23.608,0.000,0.000,0.040
23.675,0.000,0.000,0.048
23.726,0.000,0.000,0.048
23.777,0.000,0.000,0.040
23.845,0.000,0.000,0.040
23.912,0.000,0.000,0.048
23.963,0.000,0.000,0.040
24.031,0.000,0.000,0.040
24.098,0.000,0.000,0.048
24.149,0.000,0.000,0.048
24.217,0.000,0.000,0.048
24.268,0.000,0.000,0.048
24.318,0.000,0.000,0.048
24.386,0.008,0.000,0.048
24.437,0.000,0.000,0.048
24.505,0.000,0.000,0.048
24.555,0.000,0.000,0.048
24.623,0.000,0.000,0.048
24.674,0.000,0.000,0.048
24.725,0.000,0.000,0.048
24.792,0.000,0.000,0.048
24.843,0.000,0.000,0.048
24.911,0.000,0.000,0.048
24.962,0.000,0.000,0.048
25.029,0.000,0.000,0.048
25.080,0.000,0.000,0.048
25.131,0.000,0.000,0.048
25.182,0.000,0.000,0.040
25.249,0.000,0.000,0.048
25.300,0.000,0.000,0.056
25.368,0.000,0.000,0.048
25.418,0.000,0.000,0.048
25.469,0.000,0.000,0.048
25.520,0.000,0.000,0.048
25.588,0.000,0.000,0.048
25.638,0.000,0.000,0.040
25.689,0.000,0.000,0.048
25.757,0.000,0.000,0.048
25.808,0.000,0.000,0.048
25.858,0.000,0.000,0.048
25.909,0.000,0.000,0.048
25.960,0.000,0.000,0.040
26.011,0.008,0.000,0.048
26.078,0.000,0.000,0.048
26.129,0.000,0.000,0.048
26.180,0.000,0.000,0.048
26.248,0.000,0.000,0.048
26.298,0.000,0.000,0.048
26.349,0.000,0.000,0.048
26.400,0.000,0.000,0.048
26.451,0.000,0.000,0.048
26.502,0.000,0.000,0.048
26.569,0.000,0.000,0.048
26.620,0.000,0.000,0.056
26.671,0.000,0.000,0.048
26.722,0.000,0.000,0.048
26.772,0.000,0.000,0.048
26.823,0.000,0.000,0.048
26.874,0.000,0.000,0.048
26.925,0.000,0.000,0.048
26.975,0.000,0.000,0.048
27.026,0.000,0.000,0.048
27.077,0.000,0.000,0.048
27.128,0.000,0.000,0.048
27.178,0.000,0.000,0.048
27.246,0.000,0.000,0.048
27.280,0.000,0.000,0.048
27.331,0.000,0.000,0.048
27.382,0.000,0.000,0.048
27.432,0.000,0.000,0.048
27.500,0.000,0.000,0.056
27.534,0.000,0.000,0.048
27.602,0.000,0.000,0.048
27.635,0.000,0.000,0.048
27.686,0.000,0.000,0.056
27.737,0.000,0.000,0.048
27.788,0.000,0.000,0.048
27.838,0.000,0.000,0.056
27.889,0.000,0.000,0.048
27.940,0.000,0.000,0.048
27.991,0.000,0.000,0.048
28.042,0.000,0.000,0.048
28.092,0.000,0.000,0.048
28.126,0.000,0.000,0.056
28.194,0.000,0.000,0.048
28.228,0.000,0.000,0.048
28.278,0.000,0.000,0.048
28.329,0.000,0.000,0.056
28.380,0.000,0.000,0.056
28.414,0.000,0.000,0.056
28.482,0.000,0.000,0.048
28.515,0.000,0.000,0.056
28.566,0.000,0.000,0.048
28.617,0.000,0.000,0.056
28.668,0.000,0.000,0.048
28.718,0.000,0.000,0.048
28.752,0.000,0.000,0.048
28.803,0.000,0.000,0.048
28.854,0.000,0.000,0.056
28.905,0.000,0.000,0.056
28.938,0.000,0.000,0.056
28.989,0.000,0.000,0.056
29.040,0.000,0.000,0.056
29.091,0.000,0.000,0.048
29.142,0.000,0.000,0.048
29.175,0.000,0.000,0.056
29.226,0.000,0.000,0.048
29.277,0.000,0.000,0.048
29.311,0.000,0.000,0.056
29.362,0.000,0.000,0.048
29.395,0.000,0.000,0.056
29.446,0.000,0.000,0.056
29.497,0.000,0.000,0.056
29.531,0.000,0.000,0.056
29.598,0.000,0.000,0.056
29.632,0.000,0.000,0.056
29.683,0.000,0.000,0.048
29.717,0.000,0.000,0.056
29.768,0.000,0.000,0.056
29.818,0.000,0.000,0.056
29.852,0.000,0.000,0.048
29.903,0.000,0.000,0.056
29.937,0.000,0.000,0.056
29.988,-0.008,0.000,0.056
30.038,0.000,0.000,0.048
30.089,0.000,0.000,0.056
30.123,0.000,0.000,0.048
30.174,0.000,0.000,0.056
30.208,0.000,0.000,0.056
30.258,0.000,0.000,0.056
30.309,0.000,0.000,0.056
30.343,0.000,0.000,0.056
30.377,0.000,0.000,0.048
30.428,0.000,0.000,0.056
30.462,0.000,0.000,0.056
30.512,0.000,0.000,0.056
30.563,0.000,0.000,0.056
30.597,-0.008,0.000,0.064
30.648,0.000,0.000,0.056
30.682,0.000,0.000,0.056
30.732,0.000,0.000,0.056
30.766,0.000,0.000,0.048
30.817,0.000,0.000,0.056
30.851,0.000,0.000,0.056
30.902,0.000,0.000,0.056
30.935,0.000,0.000,0.056
30.986,0.000,0.000,0.056
31.020,-0.008,0.000,0.056
31.054,0.000,0.000,0.056
31.088,0.000,0.000,0.056
31.138,0.000,0.000,0.056
31.172,0.000,0.000,0.056
31.223,0.000,0.000,0.056
31.257,0.000,0.000,0.056
31.308,0.000,0.000,0.056
31.342,0.000,0.000,0.056
31.392,0.000,0.000,0.056
31.426,0.000,0.000,0.056
31.477,0.000,0.000,0.056
31.511,0.000,0.000,0.056
31.545,0.000,0.000,0.056
31.578,0.000,0.000,0.056
31.629,0.000,0.000,0.056
31.663,0.000,0.000,0.056
31.714,0.000,0.000,0.056
31.748,0.000,0.000,0.056
31.798,0.000,0.000,0.056
31.832,0.000,0.000,0.056
31.866,0.000,0.000,0.056
31.917,0.000,0.000,0.056
31.951,0.000,0.000,0.056
31.985,0.000,0.000,0.056
32.018,0.000,0.000,0.056
32.052,0.000,0.000,0.056
32.103,0.000,0.000,0.056
32.137,0.000,0.000,0.056
32.171,0.000,0.000,0.064
32.222,0.000,0.000,0.056
32.255,0.000,0.000,0.056
32.289,0.000,0.000,0.056
32.323,0.000,0.000,0.056
32.374,0.000,0.000,0.056
32.408,0.000,0.000,0.056
32.442,0.000,0.000,0.056
32.492,0.000,0.000,0.064
32.509,0.000,0.000,0.064
32.560,0.000,0.000,0.056
32.611,0.000,0.000,0.056
32.645,0.000,0.000,0.056
32.662,0.000,0.000,0.064
32.695,0.000,0.000,0.056
32.746,0.000,0.000,0.056
32.780,0.000,0.000,0.056
32.814,0.000,0.000,0.056
32.865,0.000,0.000,0.064
32.882,0.000,0.000,0.056
32.932,0.000,0.000,0.064
32.966,0.000,0.000,0.064
33.000,0.000,0.000,0.064
33.034,0.000,0.000,0.056
33.068,0.000,0.000,0.056
33.102,0.000,0.000,0.056
33.152,0.000,0.000,0.056
33.186,0.000,0.000,0.064
33.220,0.000,0.000,0.064
33.254,0.000,0.000,0.064
33.305,0.000,0.000,0.056
33.322,0.000,0.000,0.056
33.355,0.000,0.000,0.064
33.406,0.000,0.000,0.064
33.423,0.000,0.000,0.056
33.474,0.000,0.000,0.064
33.508,0.000,0.000,0.064
33.542,0.000,0.000,0.056
33.575,0.000,0.000,0.056
33.609,0.000,0.000,0.056
33.643,0.000,0.000,0.064
33.677,-0.008,0.000,0.056
33.711,0.000,0.000,0.056
33.745,0.000,0.000,0.056
33.778,0.000,0.000,0.064
33.829,0.000,0.000,0.056
33.846,0.000,0.000,0.056
33.897,0.000,0.000,0.056
33.914,0.000,0.000,0.064
33.965,0.000,0.000,0.064
33.982,0.000,0.000,0.064
34.032,0.000,0.000,0.056
34.066,0.000,0.000,0.064
34.100,0.000,0.000,0.064
34.117,0.000,0.000,0.056
34.151,-0.008,0.000,0.064
34.185,0.000,0.000,0.064
34.218,0.000,0.000,0.056
34.252,0.000,0.000,0.064
34.286,0.000,0.000,0.064
34.337,0.000,0.000,0.064
34.354,0.000,0.000,0.056
34.388,0.000,0.000,0.064
34.422,0.000,0.000,0.064
34.455,-0.008,0.000,0.056
34.489,0.000,0.000,0.064
34.523,0.000,0.000,0.056
34.540,0.000,0.000,0.064
34.591,0.000,0.000,0.064
34.625,0.000,0.000,0.064
34.658,0.000,0.000,0.056
34.692,0.000,0.000,0.048
34.726,0.000,0.000,0.048
34.760,0.000,0.000,0.048
34.794,0.000,0.000,0.048
34.811,0.000,0.000,0.048
34.845,0.000,0.000,0.048
34.878,0.000,0.000,0.048
34.912,0.000,0.000,0.048
34.946,0.000,0.000,0.048
34.980,0.000,0.000,0.048
35.014,0.000,0.000,0.048
35.048,0.000,0.000,0.048
35.065,0.000,0.000,0.048
35.098,0.000,0.000,0.048
35.132,0.000,0.000,0.048
35.149,0.000,0.000,0.048
35.200,0.000,0.000,0.048
35.217,0.000,0.000,0.048
35.251,0.000,0.000,0.048
35.285,0.000,0.000,0.048
35.318,0.000,0.000,0.048
35.335,0.000,0.000,0.048
35.386,0.000,0.000,0.048
35.420,0.000,0.000,0.048
35.437,0.000,0.000,0.048
35.471,0.000,0.000,0.048
35.505,0.000,0.000,0.048
35.538,0.000,0.000,0.048
35.555,0.000,0.000,0.048
35.589,0.000,0.000,0.056
35.623,0.000,0.000,0.048
35.640,0.000,0.000,0.048
35.674,0.000,0.000,0.048
35.708,0.000,0.000,0.048
35.742,-0.008,0.000,0.048
35.758,0.000,0.000,0.048
35.792,0.000,0.000,0.048
35.826,0.000,0.000,0.048
35.860,0.000,0.000,0.048
35.877,0.000,0.000,0.048
35.911,0.000,0.000,0.048
35.945,0.000,0.000,0.048
35.978,0.000,0.000,0.048
36.012,0.000,0.000,0.048
36.029,-0.008,0.000,0.048
36.063,0.000,0.000,0.048
36.097,0.008,0.000,0.056
36.114,0.000,0.000,0.048
36.148,0.000,0.000,0.048
36.182,0.000,0.000,0.048
36.198,0.000,0.000,0.048
36.232,0.000,0.000,0.056
36.266,0.000,0.000,0.048
36.300,0.000,0.000,0.048
36.317,0.000,0.000,0.048
36.351,0.000,0.000,0.048
36.368,0.000,0.000,0.056
36.402,0.000,0.000,0.048
36.418,0.000,0.000,0.056
36.452,0.000,0.000,0.048
36.486,0.000,0.000,0.048
36.503,0.000,0.000,0.048
36.537,0.000,0.000,0.048
36.571,0.000,0.000,0.056
36.588,0.000,0.000,0.056
36.622,0.000,0.000,0.048
36.638,0.000,0.000,0.048
36.672,0.000,0.000,0.048
36.706,0.000,0.000,0.048
36.723,0.000,0.000,0.056
36.757,0.008,0.000,0.056
36.791,0.000,0.000,0.048
36.808,0.000,0.000,0.056
36.842,0.000,0.000,0.048
36.875,0.000,0.000,0.056
36.892,0.000,0.000,0.056
36.926,0.000,0.000,0.048
36.943,0.000,0.000,0.048
36.994,0.000,0.000,0.048
36.994,0.000,0.000,0.048
37.028,0.000,0.000,0.048
37.062,0.000,0.000,0.048
37.078,0.000,0.000,0.048
37.112,0.000,0.000,0.056
37.129,0.000,0.000,0.048
37.163,0.000,0.000,0.056
37.180,0.000,0.000,0.048
37.197,0.000,0.000,0.048
37.248,0.000,0.000,0.048
37.265,0.000,0.000,0.048
37.282,0.000,0.000,0.056
37.315,0.000,0.000,0.056
37.332,0.000,0.000,0.048
37.349,0.000,0.000,0.048
37.400,0.000,0.000,0.056
37.417,0.000,0.000,0.048
37.451,0.000,0.000,0.048
37.468,0.000,0.000,0.056
37.485,0.000,0.000,0.056
37.502,0.000,0.000,0.056
37.535,0.000,0.000,0.056
37.569,0.000,0.000,0.048
37.586,0.000,0.000,0.048
37.603,0.000,0.000,0.056
37.637,0.000,0.000,0.056
37.654,0.000,0.000,0.056
37.688,0.000,0.000,0.056
37.705,0.000,0.000,0.056
37.722,0.000,0.000,0.056
37.755,0.000,0.000,0.048
37.789,0.000,0.000,0.056
37.806,0.000,0.000,0.048
37.840,0.000,0.000,0.056
37.857,0.000,0.000,0.056
37.891,0.000,0.000,0.048
37.908,0.000,0.000,0.048
37.942,0.000,0.000,0.048
37.958,0.000,0.000,0.048
37.992,0.000,0.000,0.056
38.009,0.000,0.000,0.048
38.026,0.000,0.000,0.048
38.043,0.000,0.000,0.056
38.077,0.000,0.000,0.048
38.094,0.000,0.000,0.048
38.111,0.000,0.000,0.056
38.128,0.000,0.000,0.056
38.162,0.000,0.000,0.048
38.195,0.000,0.000,0.056
38.212,0.000,0.000,0.056
38.229,0.000,0.000,0.048
38.263,0.000,0.000,0.056
38.297,-0.008,0.000,0.048
38.314,0.000,0.000,0.048
38.331,0.000,0.000,0.056
38.348,0.000,0.000,0.056
38.365,0.000,0.000,0.048
38.398,0.000,0.000,0.056
38.415,0.000,0.000,0.056
38.432,0.000,0.000,0.056
38.466,-0.008,0.000,0.056
38.483,0.000,0.000,0.056
38.500,0.000,0.000,0.056
38.534,0.000,0.000,0.056
38.551,0.000,0.000,0.056
38.568,0.000,0.000,0.056
38.602,0.000,0.000,0.056
38.602,0.000,0.000,0.056
38.635,0.000,0.000,0.048
38.669,-0.008,0.000,0.056
38.686,0.000,0.000,0.056
38.703,-0.008,0.000,0.056
38.720,-0.008,0.000,0.056
38.754,-0.008,0.000,0.056
38.771,0.000,0.000,0.056
38.805,0.000,0.000,0.056
38.822,-0.008,0.000,0.056
38.822,0.000,0.000,0.056
38.855,0.000,0.000,0.056
38.872,0.000,0.000,0.056
38.906,0.000,0.000,0.056
38.923,0.000,0.000,0.056
38.940,0.000,0.000,0.056
38.974,0.000,0.000,0.056
38.991,0.000,0.000,0.056
39.008,0.000,0.000,0.056
39.025,0.000,0.000,0.056
39.058,0.000,0.000,0.056
39.075,-0.008,0.000,0.048
39.092,0.000,0.000,0.056
39.109,0.000,0.000,0.056
39.126,0.000,0.000,0.056
39.160,0.000,0.000,0.056
39.177,0.000,0.000,0.048
39.211,0.000,0.000,0.056
39.211,0.000,0.000,0.056
39.245,0.000,0.000,0.056
39.262,-0.008,0.000,0.056
39.295,0.000,0.000,0.056
39.295,0.000,0.000,0.056
39.312,0.000,0.000,0.056
39.346,0.000,0.000,0.056
39.363,0.000,0.000,0.056
39.380,0.000,0.000,0.056
39.397,0.000,0.000,0.056
39.414,0.000,0.000,0.056
39.448,0.000,0.000,0.056
39.465,0.000,0.000,0.056
39.482,0.000,0.000,0.064
39.498,-0.008,0.000,0.056
39.515,0.000,0.000,0.056
39.549,0.000,0.000,0.056
39.566,0.000,0.000,0.056
39.583,0.000,0.000,0.056
39.600,0.000,0.000,0.056
39.617,0.000,0.000,0.056
39.634,0.000,0.000,0.056
39.668,0.000,0.000,0.048
39.668,0.000,0.000,0.056
39.702,0.000,0.000,0.056
39.718,0.000,0.000,0.056
39.735,0.000,0.000,0.048
39.752,0.000,0.000,0.056
39.786,0.000,0.000,0.056
39.786,0.000,0.000,0.056
39.820,0.000,0.000,0.048
39.820,0.000,0.000,0.056
39.854,0.000,0.000,0.056
39.871,-0.008,0.000,0.056
39.888,0.000,0.000,0.048
39.905,0.000,0.000,0.056
39.922,0.000,0.000,0.048
39.938,0.000,0.000,0.056
39.955,0.000,0.000,0.056
39.989,0.000,0.000,0.056
40.006,0.000,0.000,0.056
40.006,-0.008,0.000,0.064
40.023,0.000,0.000,0.056
40.057,0.000,0.000,0.056
40.074,-0.008,0.000,0.056
40.091,0.000,0.000,0.048
40.108,0.000,0.000,0.056
40.125,0.000,0.000,0.056
40.158,-0.008,0.000,0.056
40.158,0.000,0.000,0.056
40.175,0.000,0.000,0.056
40.209,0.000,0.000,0.056
40.209,0.000,0.000,0.056
40.243,0.000,0.000,0.056
40.260,0.000,0.000,0.056
40.277,0.000,0.000,0.056
40.294,0.000,0.000,0.056
40.311,0.000,0.000,0.056
40.328,-0.008,0.000,0.056
40.345,0.000,0.000,0.056
40.362,-0.008,0.000,0.056
40.378,0.000,0.000,0.056
40.395,0.000,0.000,0.056
40.412,0.000,0.000,0.056
40.429,-0.008,0.000,0.064
40.446,0.000,0.000,0.056
40.463,-0.008,0.000,0.056
40.480,0.000,0.000,0.056
40.497,0.000,0.000,0.056
40.514,0.000,0.000,0.056
40.531,0.000,0.000,0.056
40.548,0.000,0.000,0.056
40.565,0.000,0.000,0.056
40.582,0.000,0.000,0.056
40.598,0.000,0.000,0.056
40.632,-0.008,0.000,0.056
40.632,0.000,0.000,0.064
40.649,0.000,0.000,0.056
40.666,0.000,0.000,0.056
40.700,-0.008,0.000,0.056
40.700,0.000,0.000,0.056
40.717,0.000,0.000,0.056
40.734,0.000,0.000,0.056
40.768,0.000,0.000,0.056
40.768,0.000,0.000,0.056
40.785,0.000,0.000,0.056
40.802,0.000,0.000,0.056
40.818,-0.008,0.000,0.048
40.852,0.000,0.000,0.056
40.852,-0.008,0.000,0.056
40.869,0.000,0.000,0.056
40.886,0.000,0.000,0.056
40.920,0.000,0.000,0.056
40.937,-0.008,0.000,0.056
40.937,-0.008,0.000,0.056
40.954,0.000,0.000,0.056
40.988,-0.008,0.000,0.064
40.988,0.000,0.000,0.056
41.005,0.000,0.000,0.056
41.022,-0.008,0.000,0.056
41.038,0.000,0.000,0.064
41.055,-0.008,0.000,0.056
41.072,0.000,0.000,0.056
41.072,-0.008,0.000,0.056
41.106,0.000,0.000,0.064
41.123,0.000,0.000,0.056
41.123,0.000,0.000,0.056
41.140,-0.008,0.000,0.056
41.157,0.000,0.000,0.056
41.174,0.000,0.000,0.056
41.191,0.000,0.000,0.056
41.208,0.000,0.000,0.056
41.225,0.000,0.000,0.064
41.242,0.000,0.000,0.056
41.258,0.000,0.000,0.056
41.275,0.000,0.000,0.056
41.292,0.000,0.000,0.056
41.292,0.000,0.000,0.056
41.326,0.000,0.000,0.056
41.343,0.000,0.000,0.056
41.360,0.000,0.000,0.056
41.377,0.000,0.000,0.056
41.377,-0.008,0.000,0.056
41.394,0.000,0.000,0.056
41.411,-0.008,0.000,0.064
41.428,0.000,0.000,0.056
41.445,0.000,0.000,0.056
41.462,-0.008,0.000,0.064
41.462,0.000,0.000,0.064
41.478,-0.008,0.000,0.056
41.512,-0.008,0.000,0.064
41.512,0.000,0.000,0.056
41.529,0.000,0.000,0.056
41.529,0.000,0.000,0.056
41.563,0.000,0.000,0.056
41.580,0.000,0.000,0.056
41.597,0.000,0.000,0.056
41.597,0.000,0.000,0.064
41.614,0.000,0.000,0.064
41.631,0.000,0.000,0.056
41.648,0.000,0.000,0.056
41.665,0.000,0.000,0.056
41.682,0.000,0.000,0.064
41.682,0.000,0.000,0.056
41.698,0.000,0.000,0.056
41.715,0.000,0.000,0.056
41.749,-0.008,0.000,0.056
41.732,0.000,0.000,0.064
41.766,-0.008,0.000,0.064
41.783,0.000,0.000,0.056
41.783,0.000,0.000,0.056
41.800,0.000,0.000,0.064
41.817,0.000,0.000,0.056
41.834,0.000,0.000,0.064
41.851,-0.008,0.000,0.056
41.851,0.000,0.000,0.056
41.868,0.000,0.000,0.056
41.885,0.000,0.000,0.056
41.902,0.000,0.000,0.064
41.918,0.000,0.000,0.056
41.918,0.000,0.000,0.056
41.935,0.000,0.000,0.056
41.952,0.000,0.000,0.064
41.969,0.000,0.000,0.056
41.969,0.000,0.000,0.064
42.003,0.000,0.000,0.056
42.020,0.000,0.000,0.064
42.020,0.000,0.000,0.056
42.037,0.000,0.000,0.056
42.054,0.000,0.000,0.064
42.054,0.000,0.000,0.064
42.071,-0.008,0.000,0.056
42.088,0.000,0.000,0.064
42.105,0.000,0.000,0.064
42.122,0.000,0.000,0.064
42.122,0.000,0.000,0.056
42.138,0.000,0.000,0.056
42.155,0.000,0.000,0.064
42.172,0.000,0.000,0.056
42.189,0.000,0.000,0.056
42.206,0.000,0.000,0.056
42.206,0.000,0.000,0.064
42.223,0.000,0.000,0.064
42.240,0.000,0.000,0.064
42.257,0.000,0.000,0.064
42.257,0.000,0.000,0.064
42.274,0.000,0.000,0.056
42.274,0.000,0.000,0.056
42.291,0.000,0.000,0.056
42.325,0.000,0.000,0.056
42.325,-0.008,0.000,0.056
42.342,0.000,0.000,0.056
42.358,0.000,0.000,0.056
42.375,0.000,0.000,0.064
42.375,0.000,0.000,0.056
42.392,0.000,0.000,0.064
42.409,0.000,0.000,0.064
42.409,0.000,0.000,0.056
42.426,0.000,0.000,0.056
42.443,0.000,0.000,0.056
42.460,0.000,0.000,0.064
42.460,0.000,0.000,0.056
42.494,-0.008,0.000,0.064
42.494,0.000,0.000,0.056
42.511,0.000,0.000,0.056
42.511,0.000,0.000,0.056
42.528,0.000,0.000,0.064
42.528,0.000,0.000,0.064
42.545,0.000,0.000,0.064
42.578,0.000,0.000,0.056
42.578,0.000,0.000,0.056
42.595,-0.008,0.000,0.056
42.595,0.000,0.000,0.064
42.612,0.000,0.000,0.064
42.629,-0.008,0.000,0.056
42.646,0.000,0.000,0.064
42.646,0.000,0.000,0.064
42.663,0.000,0.000,0.056
42.680,0.000,0.000,0.064
42.680,0.000,0.000,0.056
42.697,-0.008,0.000,0.064
42.714,0.000,0.000,0.056
42.714,0.000,0.000,0.064
42.731,0.000,0.000,0.056
42.748,0.000,0.000,0.064
42.748,0.000,0.000,0.056
42.765,0.000,0.000,0.056
42.782,0.000,0.000,0.056
42.782,-0.008,0.000,0.056
42.798,0.000,0.000,0.056
42.815,0.000,0.000,0.064
42.815,0.000,0.000,0.064
42.832,0.000,0.000,0.064
42.849,-0.008,0.000,0.064
42.849,0.000,0.000,0.064
42.866,-0.008,0.000,0.056
42.883,0.000,0.000,0.056
42.900,0.000,0.000,0.064
42.900,0.000,0.000,0.056
42.917,0.000,0.000,0.056
42.934,0.000,0.000,0.056
42.951,0.000,0.000,0.064
42.951,0.000,0.000,0.056
42.951,-0.008,0.000,0.064
42.985,0.000,0.000,0.064
42.985,0.000,0.000,0.056
43.002,-0.008,0.000,0.056
43.018,0.000,0.000,0.056
43.018,0.000,0.000,0.064
43.035,0.000,0.000,0.056
43.035,0.000,0.000,0.056
43.052,0.000,0.000,0.064
43.052,0.000,0.000,0.056
43.069,-0.008,0.000,0.064
43.086,0.000,0.000,0.056
43.103,-0.008,0.000,0.064
43.103,-0.008,0.000,0.073
43.120,0.000,0.000,0.056
43.120,0.000,0.000,0.056
43.137,0.000,0.000,0.064
43.154,0.000,0.000,0.064
43.154,0.000,0.000,0.064
43.154,-0.008,0.000,0.064
43.188,0.000,0.000,0.064
43.188,0.000,0.000,0.064
43.205,0.000,0.000,0.056
43.205,0.000,0.000,0.064
43.222,0.000,0.000,0.064
43.238,0.000,0.000,0.064
43.255,0.000,0.000,0.064
43.272,0.000,0.000,0.064
43.272,0.000,0.000,0.064
43.272,-0.008,0.000,0.056
43.289,-0.008,0.000,0.064
43.306,-0.008,0.000,0.056
43.323,0.000,0.000,0.056
43.323,-0.008,0.000,0.056
43.340,-0.008,0.000,0.064
43.340,-0.008,0.000,0.064
43.357,0.000,0.000,0.056
43.357,0.000,0.000,0.064
43.374,-0.008,0.000,0.056
43.391,0.000,0.000,0.056
43.391,0.000,0.000,0.056
43.408,0.000,0.000,0.056
43.425,0.000,0.000,0.064
43.408,0.000,0.000,0.064
43.425,-0.008,0.000,0.056
43.442,0.000,0.000,0.064
43.458,0.000,0.000,0.056
43.475,0.000,0.000,0.064
43.475,0.000,0.000,0.056
43.492,0.000,0.000,0.064
43.492,-0.008,0.000,0.064
43.509,0.000,0.000,0.056
43.509,-0.008,0.000,0.064
43.526,0.000,0.000,0.064
43.526,0.000,0.000,0.064
43.543,0.000,0.000,0.056
43.560,0.000,0.000,0.056
43.560,-0.008,0.000,0.056
43.577,0.000,0.000,0.064
43.577,0.000,0.000,0.064
43.594,0.000,0.000,0.064
43.594,-0.008,0.000,0.064
43.611,0.000,0.000,0.056
43.628,0.000,0.000,0.064
43.645,0.000,0.000,0.056
43.645,0.000,0.000,0.056
43.662,0.000,0.000,0.064
43.662,0.000,0.000,0.056
43.662,0.000,0.000,0.064
43.695,0.000,0.000,0.064
43.678,0.000,0.000,0.064
43.695,-0.008,0.000,0.056
43.712,-0.008,0.000,0.064
43.729,0.000,0.000,0.064
43.729,0.000,0.000,0.056
43.746,-0.008,0.000,0.064
43.746,-0.008,0.000,0.064
43.746,0.000,0.000,0.064
43.780,0.000,0.000,0.064
43.780,-0.008,0.000,0.056
43.797,0.000,0.000,0.064
43.797,0.000,0.000,0.056
43.797,0.000,0.000,0.056
43.814,0.000,0.000,0.064
43.831,0.000,0.000,0.064
43.831,0.000,0.000,0.064
43.831,0.000,0.000,0.064
43.848,0.000,0.000,0.064
43.848,0.000,0.000,0.064
43.865,-0.008,0.000,0.073
43.848,0.000,0.000,0.064
43.831,0.000,0.000,0.064
43.831,-0.008,0.000,0.064
43.814,-0.008,0.000,0.064
43.814,-0.008,0.000,0.064
43.797,0.000,0.000,0.056
43.797,-0.008,0.000,0.064
43.780,-0.008,0.000,0.064
43.780,-0.008,0.000,0.064
43.763,0.000,0.000,0.064
43.763,-0.008,0.000,0.064
43.746,0.000,0.000,0.064
43.746,-0.008,0.000,0.064
43.729,0.000,0.000,0.056
43.729,0.000,0.000,0.064
43.712,-0.008,0.000,0.064
43.695,-0.008,0.000,0.056
43.695,0.000,0.000,0.064
43.695,0.000,0.000,0.064
43.678,0.000,0.000,0.073
43.662,0.000,0.000,0.056
43.662,-0.008,0.000,0.064
43.662,0.000,0.000,0.064
43.645,-0.008,0.000,0.064
43.628,0.000,0.000,0.064
43.628,-0.008,0.000,0.064
43.611,0.000,0.000,0.056
43.611,-0.008,0.000,0.064
43.611,0.000,0.000,0.056
43.594,-0.008,0.000,0.064
43.594,-0.008,0.000,0.064
43.577,-0.008,0.000,0.064
43.577,0.000,0.000,0.064
43.560,-0.008,0.000,0.056
43.560,0.000,0.000,0.064
43.543,-0.008,0.000,0.064
43.543,0.000,0.000,0.064
43.526,-0.008,0.000,0.064
43.526,-0.008,0.000,0.064
43.509,-0.008,0.000,0.064
43.492,-0.008,0.000,0.056
43.492,-0.008,0.000,0.064
43.492,0.000,0.000,0.064
43.492,-0.008,0.000,0.064
43.475,0.000,0.000,0.056
43.458,-0.008,0.000,0.064
43.458,-0.008,0.000,0.064
43.458,-0.008,0.000,0.064
43.442,0.000,0.000,0.056
43.442,0.000,0.000,0.064
43.425,-0.008,0.000,0.064
43.442,-0.008,0.000,0.064
43.408,0.000,0.000,0.056
43.408,0.000,0.000,0.064
43.391,-0.008,0.000,0.064
43.391,0.000,0.000,0.073
43.374,-0.008,0.000,0.064
43.374,-0.008,0.000,0.064
43.374,-0.008,0.000,0.064
43.357,-0.008,0.000,0.064
43.357,-0.008,0.000,0.064
43.340,0.000,0.000,0.064
43.340,-0.008,0.000,0.064
43.323,-0.008,0.000,0.064
43.323,-0.008,0.000,0.064
43.306,-0.008,0.000,0.064
43.289,0.000,0.000,0.064
43.306,0.000,0.000,0.064
43.272,-0.008,0.000,0.056
43.272,-0.008,0.000,0.056
43.272,0.000,0.000,0.064
43.255,0.000,0.000,0.056
43.272,-0.008,0.000,0.064
43.238,-0.008,0.000,0.064
43.238,-0.008,0.000,0.064
43.238,0.000,0.000,0.064
43.222,0.000,0.000,0.064
43.222,-0.008,0.000,0.056
43.222,0.000,0.000,0.064
43.154,-0.016,0.000,0.064
43.052,-0.016,0.000,0.064
42.934,-0.016,0.000,0.056
42.815,-0.016,0.000,0.056
42.714,-0.016,0.000,0.064
42.595,-0.016,0.000,0.056
42.477,-0.016,0.000,0.064
42.375,-0.016,0.000,0.056
42.257,-0.016,0.000,0.064
42.138,-0.016,0.000,0.056
42.037,-0.016,0.000,0.064
41.918,-0.016,0.000,0.056
41.817,-0.016,0.000,0.064
41.715,-0.016,0.000,0.056
41.597,-0.016,0.000,0.056
41.495,-0.016,0.000,0.056
41.394,-0.016,0.000,0.056
41.275,-0.016,0.000,0.056
41.174,-0.008,0.000,0.056
41.140,-0.008,0.000,0.056
41.140,-0.008,0.000,0.056
41.140,0.000,0.000,0.056
41.123,0.000,0.000,0.056
41.123,-0.008,0.000,0.056
41.123,-0.008,0.000,0.064
41.106,0.000,0.000,0.056
41.106,-0.008,0.000,0.056
41.089,-0.008,0.000,0.056
41.089,-0.008,0.000,0.056
41.038,-0.008,0.000,0.056
40.937,-0.016,0.000,0.056
40.835,-0.016,0.000,0.056
40.717,-0.016,0.000,0.056
40.615,-0.016,0.000,0.056
40.497,-0.016,0.000,0.056
40.412,-0.016,0.000,0.056
40.294,-0.016,0.000,0.056
40.192,-0.016,0.000,0.056
40.108,-0.016,0.000,0.056
40.006,-0.016,0.000,0.056
39.888,-0.008,0.000,0.056
39.786,-0.016,0.000,0.056
39.668,-0.016,0.000,0.056
39.583,-0.016,0.000,0.056
39.482,-0.016,0.000,0.056
39.380,-0.016,0.000,0.056
39.278,-0.016,0.000,0.056
39.177,-0.016,0.000,0.056
39.075,-0.016,0.000,0.056
38.974,-0.016,0.000,0.056
38.855,-0.016,0.000,0.056
38.754,-0.008,0.000,0.056
38.669,-0.016,0.000,0.056
38.568,-0.016,0.000,0.056
38.466,-0.016,0.000,0.056
38.365,-0.016,0.000,0.048
38.280,-0.016,0.000,0.056
38.178,-0.016,0.000,0.056
38.077,-0.016,0.000,0.056
37.992,-0.016,0.000,0.056
37.874,-0.016,0.000,0.056
37.772,-0.016,0.000,0.056
37.705,-0.016,0.000,0.056
37.586,-0.016,0.000,0.056
37.485,-0.008,0.000,0.056
37.400,-0.008,0.000,0.048
37.315,-0.016,0.000,0.056
37.214,-0.016,0.000,0.048
37.112,-0.016,0.000,0.048
37.028,-0.016,0.000,0.056
36.926,-0.016,0.000,0.056
36.825,-0.016,0.000,0.056
36.740,-0.016,0.000,0.056
36.638,-0.016,0.000,0.048
36.554,-0.016,0.000,0.048
36.452,-0.016,0.000,0.048
36.368,-0.016,0.000,0.056
36.266,-0.016,0.000,0.048
36.182,-0.016,0.000,0.048
36.097,-0.008,0.000,0.056
35.995,-0.008,0.000,0.048
35.894,-0.008,0.000,0.048
35.809,-0.016,0.000,0.048
35.725,-0.008,0.000,0.048
35.623,-0.016,0.000,0.056
35.538,-0.016,0.000,0.056
35.454,-0.016,0.000,0.048
35.352,-0.016,0.000,0.048
35.268,-0.016,0.000,0.048
35.183,-0.008,0.000,0.048
35.082,-0.008,0.000,0.048
34.997,-0.016,0.000,0.048
34.912,-0.016,0.000,0.040
34.828,-0.016,0.000,0.048
34.726,-0.016,0.000,0.048
34.642,-0.016,0.000,0.056
34.557,-0.016,0.000,0.064
34.455,-0.016,0.000,0.064
34.371,-0.016,0.000,0.064
34.286,-0.016,0.000,0.064
34.202,-0.016,0.000,0.064
34.100,-0.016,0.000,0.064
34.032,-0.016,0.000,0.064
33.948,-0.016,0.000,0.064
33.863,-0.016,0.000,0.064
33.762,-0.016,0.000,0.064
33.677,-0.016,0.000,0.064
33.660,-0.008,0.000,0.056
33.660,-0.008,0.000,0.064
33.660,0.000,0.000,0.056
33.643,-0.008,0.000,0.064
33.660,0.000,0.000,0.064
33.643,-0.008,0.000,0.056
33.643,-0.008,0.000,0.064
33.660,-0.008,0.000,0.056
33.643,-0.008,0.000,0.056
33.643,-0.008,0.000,0.056
33.643,-0.008,0.000,0.056
33.643,0.000,0.000,0.056
33.643,0.000,0.000,0.064
33.643,-0.008,0.000,0.064
33.643,-0.008,0.000,0.064
33.626,-0.008,0.000,0.056
33.643,0.000,0.000,0.064
33.558,-0.016,0.000,0.064
33.457,-0.016,0.000,0.064
33.389,-0.016,0.000,0.056
33.288,-0.016,0.000,0.064
33.220,-0.016,0.000,0.056
33.118,-0.016,0.000,0.056
33.034,-0.016,0.000,0.064
32.966,-0.016,0.000,0.056
32.865,-0.016,0.000,0.064
32.780,-0.016,0.000,0.056
32.712,-0.008,0.000,0.056
32.628,-0.016,0.000,0.064
32.526,-0.008,0.000,0.056
32.458,-0.016,0.000,0.056
32.374,-0.016,0.000,0.064
32.289,-0.016,0.000,0.064
32.205,-0.016,0.000,0.056
32.120,-0.016,0.000,0.064
32.052,-0.016,0.000,0.064
31.968,-0.016,0.000,0.056
31.883,-0.016,0.000,0.056
31.798,-0.008,0.000,0.064
31.714,-0.016,0.000,0.056
31.646,-0.016,0.000,0.056
31.545,-0.016,0.000,0.056
31.477,-0.016,0.000,0.056
31.392,-0.008,0.000,0.056
31.308,-0.016,0.000,0.056
31.240,-0.016,0.000,0.056
31.155,-0.016,0.000,0.056
31.071,-0.008,0.000,0.056
31.003,-0.008,0.000,0.056
30.918,-0.016,0.000,0.064
30.834,-0.016,0.000,0.056
30.766,-0.016,0.000,0.056
30.682,-0.016,0.000,0.056
30.597,-0.016,0.000,0.056
30.529,-0.016,0.000,0.056
30.462,-0.008,0.000,0.056
30.360,-0.016,0.000,0.056
30.292,-0.016,0.000,0.056
30.208,-0.008,0.000,0.056
30.140,-0.008,0.000,0.056
30.055,-0.008,0.000,0.056
29.988,-0.016,0.000,0.056
29.903,-0.016,0.000,0.056
29.835,-0.016,0.000,0.056
29.751,-0.016,0.000,0.056
29.683,-0.016,0.000,0.056
29.615,-0.016,0.000,0.056
29.531,-0.016,0.000,0.056
29.446,-0.016,0.000,0.056
29.378,-0.016,0.000,0.056
29.311,-0.016,0.000,0.056
29.226,-0.016,0.000,0.056
29.158,-0.008,0.000,0.056
29.091,-0.016,0.000,0.056
29.006,-0.016,0.000,0.048
28.938,-0.016,0.000,0.056
28.854,-0.008,0.000,0.056
28.786,-0.008,0.000,0.056
28.718,-0.016,0.000,0.056
28.651,-0.016,0.000,0.056
28.566,-0.016,0.000,0.056
28.498,-0.016,0.000,0.056
28.431,-0.008,0.000,0.056
28.363,-0.008,0.000,0.056
28.295,-0.016,0.000,0.056
28.211,-0.016,0.000,0.056
28.143,-0.008,0.000,0.056
28.075,-0.016,0.000,0.048
27.991,-0.008,0.000,0.056
27.923,-0.016,0.000,0.056
27.855,-0.008,0.000,0.056
27.788,-0.016,0.000,0.056
27.720,-0.016,0.000,0.056
27.652,-0.008,0.000,0.048
27.568,-0.016,0.000,0.056
27.517,-0.008,0.000,0.056
27.432,-0.016,0.000,0.048
27.365,-0.016,0.000,0.056
27.297,-0.008,0.000,0.056
27.229,-0.008,0.000,0.056
27.162,-0.008,0.000,0.048
27.077,-0.008,0.000,0.048
27.026,-0.016,0.000,0.048
26.958,-0.016,0.000,0.056
26.891,-0.008,0.000,0.048
26.823,-0.016,0.000,0.048
26.738,-0.008,0.000,0.048
26.688,-0.016,0.000,0.048
26.603,-0.008,0.000,0.048
26.552,-0.016,0.000,0.048
26.485,-0.008,0.000,0.048
26.400,-0.016,0.000,0.048
26.349,-0.016,0.000,0.048
26.282,-0.016,0.000,0.048
26.214,-0.016,0.000,0.048
26.146,-0.008,0.000,0.048
26.078,-0.008,0.000,0.048
26.011,-0.008,0.000,0.048
25.943,-0.008,0.000,0.048
25.858,-0.008,0.000,0.048
25.808,-0.008,0.000,0.048
25.740,-0.016,0.000,0.056
25.689,-0.016,0.000,0.048
25.622,-0.016,0.000,0.048
25.537,-0.008,0.000,0.048
25.486,-0.008,0.000,0.048
25.418,-0.008,0.000,0.048
25.351,-0.016,0.000,0.048
25.283,-0.016,0.000,0.048
25.232,-0.016,0.000,0.048
25.165,-0.008,0.000,0.040
25.097,-0.016,0.000,0.048
25.029,-0.016,0.000,0.048
24.978,-0.016,0.000,0.048
24.911,-0.008,0.000,0.048
24.843,-0.008,0.000,0.048
24.775,-0.016,0.000,0.048
24.708,-0.016,0.000,0.048
24.657,-0.016,0.000,0.048
24.589,-0.008,0.000,0.048
24.522,-0.008,0.000,0.040
24.471,-0.008,0.000,0.048
24.403,-0.008,0.000,0.048
24.335,-0.008,0.000,0.040
24.285,-0.008,0.000,0.040
24.217,-0.016,0.000,0.048
24.149,-0.008,0.000,0.048
24.098,-0.016,0.000,0.040
24.031,-0.016,0.000,0.048
23.963,-0.008,0.000,0.048
23.912,-0.016,0.000,0.040
23.862,-0.008,0.000,0.048
23.794,-0.016,0.000,0.048
23.726,-0.008,0.000,0.040
23.675,-0.008,0.000,0.040
23.608,-0.008,0.000,0.040
23.540,-0.008,0.000,0.040
23.489,-0.016,0.000,0.048
23.422,-0.008,0.000,0.040
23.371,-0.008,0.000,0.040
23.320,-0.016,0.000,0.040
23.252,-0.008,0.000,0.040
23.185,-0.016,0.000,0.040
23.134,-0.008,0.000,0.040
23.066,-0.008,0.000,0.040
23.015,-0.008,0.000,0.040
22.965,-0.016,0.000,0.040
22.897,-0.008,0.000,0.040
22.846,-0.008,0.000,0.040
22.795,-0.008,0.000,0.040
22.711,-0.008,0.000,0.040
22.677,-0.008,0.000,0.040
22.609,-0.016,0.000,0.040
22.558,-0.008,0.000,0.048
22.491,-0.008,0.000,0.040
22.440,-0.008,0.000,0.040
22.389,-0.008,0.000,0.040
22.322,-0.008,0.000,0.040
22.271,-0.016,0.000,0.048
22.220,-0.016,0.000,0.040
22.152,-0.016,0.000,0.048
22.102,-0.008,0.000,0.040
22.034,-0.008,0.000,0.040
21.983,-0.008,0.000,0.040
21.932,-0.016,0.000,0.040
21.865,-0.008,0.000,0.040
21.814,-0.008,0.000,0.040
21.763,-0.008,0.000,0.040
21.712,-0.016,0.000,0.040
21.662,-0.016,0.000,0.040
21.594,-0.008,0.000,0.040
21.543,-0.008,0.000,0.040
21.492,-0.008,0.000,0.040
21.425,-0.008,0.000,0.040
21.374,-0.016,0.000,0.040
21.323,-0.016,0.000,0.040
21.255,-0.008,0.000,0.040
21.222,-0.008,0.000,0.040
21.154,-0.008,0.000,0.040
21.103,-0.008,0.000,0.040
21.052,-0.016,0.000,0.040
21.002,-0.008,0.000,0.040
20.951,-0.008,0.000,0.040
20.900,-0.008,0.000,0.040
20.832,-0.008,0.000,0.040
20.782,-0.016,0.000,0.040
20.731,-0.008,0.000,0.040
20.680,-0.008,0.000,0.032
20.629,-0.008,0.000,0.040
20.578,-0.008,0.000,0.040
20.528,-0.008,0.000,0.040
20.477,-0.016,0.000,0.040
20.426,-0.008,0.000,0.040
20.375,-0.008,0.000,0.040
20.325,-0.008,0.000,0.040
20.257,-0.008,0.000,0.040
20.206,-0.016,0.000,0.032
20.155,-0.008,0.000,0.040
20.122,-0.008,0.000,0.040
20.054,-0.008,0.000,0.040
20.003,-0.016,0.000,0.032
19.952,-0.008,0.000,0.040
19.902,-0.008,0.000,0.032
19.851,-0.016,0.000,0.040
19.800,-0.008,0.000,0.040
19.749,-0.016,0.000,0.032
19.698,-0.008,0.000,0.032
19.665,-0.008,0.000,0.040
19.597,-0.008,0.000,0.040
19.546,-0.008,0.000,0.040
19.512,-0.008,0.000,0.032
19.462,-0.016,0.000,0.040
19.394,-0.008,0.000,0.032
19.360,-0.008,0.000,0.040
19.360,0.000,0.000,0.032
19.360,-0.008,0.000,0.040
19.360,0.000,0.000,0.040
19.360,-0.008,0.000,0.040
19.360,-0.008,0.000,0.032
19.360,-0.008,0.000,0.032
19.360,-0.008,0.000,0.040
19.360,0.000,0.000,0.032
19.360,-0.008,0.000,0.032
19.377,-0.008,0.000,0.032
19.343,-0.016,0.000,0.040
19.292,-0.008,0.000,0.040
19.242,-0.016,0.000,0.040
19.208,-0.008,0.000,0.040
19.140,-0.008,0.000,0.032
19.106,-0.008,0.000,0.040
19.038,-0.008,0.000,0.032
19.005,-0.008,0.000,0.032
18.954,-0.008,0.000,0.032
18.903,-0.008,0.000,0.040
18.852,-0.008,0.000,0.040
18.802,-0.008,0.000,0.040
18.751,-0.008,0.000,0.032
18.700,-0.008,0.000,0.032
18.666,-0.016,0.000,0.040
18.615,-0.008,0.000,0.032
18.565,-0.008,0.000,0.032
18.514,-0.008,0.000,0.040
18.480,-0.016,0.000,0.040
18.412,-0.008,0.000,0.032
18.378,-0.016,0.000,0.040
18.328,-0.016,0.000,0.040
18.277,-0.008,0.000,0.032
18.226,-0.008,0.000,0.040
18.175,-0.008,0.000,0.032
18.142,-0.016,0.000,0.032
18.091,-0.016,0.000,0.040
18.040,-0.008,0.000,0.032
18.006,-0.008,0.000,0.024
17.955,-0.016,0.000,0.032
17.905,-0.016,0.000,0.032
17.854,-0.008,0.000,0.032
17.820,-0.008,0.000,0.032
17.752,-0.008,0.000,0.032
17.718,-0.008,0.000,0.032
17.735,-0.008,0.000,0.032
17.735,-0.008,0.000,0.032
17.735,-0.008,0.000,0.032
17.735,-0.008,0.000,0.024
17.735,-0.008,0.000,0.032
17.735,0.000,0.000,0.032
17.735,0.000,0.000,0.040
17.735,-0.008,0.000,0.032
17.718,-0.008,0.000,0.032
17.735,0.000,0.000,0.032
17.735,0.000,0.000,0.040
17.735,0.000,0.000,0.024
17.735,-0.008,0.000,0.032
17.735,0.000,0.000,0.032
17.735,-0.008,0.000,0.032
17.735,-0.008,0.000,0.032
17.735,-0.008,0.000,0.032
17.735,-0.008,0.000,0.032
17.718,-0.008,0.000,0.024
17.735,0.000,0.000,0.032
17.718,-0.008,0.000,0.032
17.735,-0.008,0.000,0.024
17.718,-0.008,0.000,0.024
17.735,0.000,0.000,0.032
17.718,0.000,0.000,0.032
17.718,-0.008,0.000,0.032
17.718,-0.008,0.000,0.024
17.718,-0.008,0.000,0.032
17.718,-0.008,0.000,0.024
17.718,-0.008,0.000,0.032
17.718,-0.008,0.000,0.032
17.718,0.000,0.000,0.032
17.718,0.000,0.000,0.032
17.718,-0.008,0.000,0.032
17.718,0.000,0.000,0.032
17.718,-0.008,0.000,0.032
17.718,-0.008,0.000,0.032
17.718,-0.008,0.000,0.032
17.718,0.000,0.000,0.032
17.718,-0.008,0.000,0.024
17.718,-0.008,0.000,0.032
17.718,-0.008,0.000,0.032
17.718,-0.008,0.000,0.032
17.718,0.000,0.000,0.032
17.718,-0.008,0.000,0.032
17.718,-0.008,0.000,0.032
17.718,-0.008,0.000,0.032
17.718,-0.008,0.000,0.032
17.718,-0.008,0.000,0.032
17.702,-0.008,0.000,0.032
17.718,0.000,0.000,0.032
17.702,0.000,0.000,0.032
17.702,0.000,0.000,0.032
17.718,0.000,0.000,0.032
17.702,-0.008,0.000,0.032
17.702,-0.008,0.000,0.032
17.702,0.000,0.000,0.032
17.702,-0.008,0.000,0.032
17.702,0.000,0.000,0.032
17.702,-0.008,0.000,0.032
17.702,-0.008,0.000,0.032
17.702,-0.008,0.000,0.032
17.685,-0.008,0.000,0.032
17.685,0.000,0.000,0.032
17.685,0.000,0.000,0.032
17.685,0.000,0.000,0.032
17.702,0.000,0.000,0.032
17.685,-0.008,0.000,0.032
17.685,0.000,0.000,0.032
17.685,-0.008,0.000,0.032
17.685,-0.008,0.000,0.032
17.702,-0.008,0.000,0.032
17.685,-0.008,0.000,0.024
17.685,-0.008,0.000,0.040
17.685,-0.008,0.000,0.024
17.685,0.000,0.000,0.032
17.685,-0.008,0.000,0.032
17.685,-0.008,0.000,0.032
17.685,0.000,0.000,0.032
17.685,0.000,0.000,0.032
17.685,-0.008,0.000,0.032
17.685,-0.008,0.000,0.032
17.668,-0.008,0.000,0.024
17.685,0.000,0.000,0.032
17.668,-0.008,0.000,0.032
17.668,-0.008,0.000,0.032
17.668,0.000,0.000,0.032
17.668,-0.008,0.000,0.032
17.668,0.000,0.000,0.032
17.668,0.000,0.000,0.032
17.668,-0.008,0.000,0.032
17.668,0.000,0.000,0.024
17.651,0.000,0.000,0.032
17.668,-0.008,0.000,0.032
17.668,-0.008,0.000,0.032
17.668,-0.008,0.000,0.032
17.668,-0.008,0.000,0.032
17.651,-0.008,0.000,0.032
17.651,-0.008,0.000,0.024
17.651,-0.008,0.000,0.040
17.651,0.000,0.000,0.040
17.651,-0.008,0.000,0.032
17.651,-0.008,0.000,0.032
17.651,0.000,0.000,0.032
17.651,0.000,0.000,0.032
17.651,-0.008,0.000,0.024
17.651,-0.008,0.000,0.032
17.651,-0.008,0.000,0.032
17.634,0.000,0.000,0.032
17.651,-0.008,0.000,0.040
17.651,-0.008,0.000,0.032
17.651,0.000,0.000,0.032
17.634,0.000,0.000,0.032
17.634,0.000,0.000,0.024
17.634,-0.008,0.000,0.032
17.634,-0.008,0.000,0.024
17.634,-0.008,0.000,0.032
17.634,0.000,0.000,0.024
17.634,-0.008,0.000,0.032
17.634,0.000,0.000,0.032
17.634,0.000,0.000,0.032
17.617,-0.008,0.000,0.032
17.617,-0.008,0.000,0.032
17.617,-0.008,0.000,0.032
17.617,-0.008,0.000,0.032
17.617,-0.008,0.000,0.032
17.634,-0.008,0.000,0.032
17.617,0.000,0.000,0.032
17.617,0.000,0.000,0.024
17.617,0.000,0.000,0.032
17.617,0.000,0.000,0.032
17.617,-0.008,0.000,0.032
17.617,-0.008,0.000,0.032
17.600,0.000,0.000,0.032
17.617,0.000,0.000,0.032
17.617,-0.008,0.000,0.040
17.617,-0.008,0.000,0.032
17.617,-0.008,0.000,0.032
17.617,-0.008,0.000,0.032
17.600,-0.008,0.000,0.024
17.600,-0.008,0.000,0.032
17.600,-0.008,0.000,0.032
17.600,-0.008,0.000,0.032
17.600,0.000,0.000,0.032
17.600,-0.008,0.000,0.032
17.600,0.000,0.000,0.032
17.600,-0.008,0.000,0.032
17.600,-0.008,0.000,0.032
17.600,-0.008,0.000,0.024
17.583,0.000,0.000,0.032
17.600,-0.008,0.000,0.032
17.600,-0.008,0.000,0.032
17.583,-0.008,0.000,0.032
17.583,-0.008,0.000,0.040
17.583,-0.008,0.000,0.032
17.583,0.000,0.000,0.040
17.583,-0.008,0.000,0.032
17.583,-0.008,0.000,0.032
17.566,0.000,0.000,0.032
17.583,-0.008,0.000,0.032
17.583,-0.008,0.000,0.032
17.583,-0.008,0.000,0.032
17.566,-0.008,0.000,0.024
17.566,-0.008,0.000,0.032
17.566,-0.008,0.000,0.032
17.566,-0.008,0.000,0.032
