VHi,IHi,VLo,ILo,dIHi
2.44369,-0.00161,0,0.00322,
2.44708,-0.00645,0,0.00967,-0.00484
2.43692,0.00322,0,0.00645,0.00967
2.43692,-0.00322,0,0.01128,-0.00644
2.44708,-0.00322,0,0.01612,0
2.44031,0.00322,0,0.01289,0.00644
2.45046,0.00161,0,0.01289,-0.00161
2.44369,0.00322,0,0.01451,0.00161
2.44031,-0.00484,0,0.01289,-0.00806
2.43692,0,0,0.00806,0.00484
2.44031,-0.00322,0,0.00967,-0.00322
2.44031,0,0,0.01451,0.00322
2.43692,-0.00806,0,0.00967,-0.00806
2.43692,0.00161,0,0.01451,0.00967
2.44031,0.00322,0,0.01128,0.00161
2.43692,0.00161,0,0.01612,-0.00161
2.44031,-0.00645,0,0.00967,-0.00806
2.44369,-0.00322,0,0.01128,0.00323
2.43692,-0.00161,0,0.01773,0.00161
2.44031,-0.00161,0,0.01128,0
2.45385,0,0,0.01289,0.00161
2.44369,-0.00161,0,0.00967,-0.00161
2.44369,0,0,0.01128,0.00161
2.44031,0,0,0.01289,0
2.44369,-0.00161,0,0.01451,-0.00161
2.43692,-0.00484,0,0.00806,-0.00323
2.44369,-0.00161,0,0.00645,0.00323
2.44708,-0.00161,0,0.01612,0
2.43354,0.00161,0,0.01289,0.00322
2.44031,-0.00484,0,0.00645,-0.00645
2.44369,0.00322,0,0.00967,0.00806
2.44031,0,0,0.01773,-0.00322
2.43354,-0.00484,0,0.01289,-0.00484
2.43692,0.00322,0,0.01289,0.00806
2.44369,-0.00161,0,0.01128,-0.00483
2.44031,0,0,0.00967,0.00161
2.44369,-0.00322,0,0.00322,-0.00322
2.44031,0.00161,0,0.02095,0.00483
2.45046,0.00161,0,0.01451,0
2.44031,-0.00806,0,0.01289,-0.00967
2.44369,0.00161,0,0.00967,0.00967
2.43692,-0.00322,0,0.01128,-0.00483
2.44031,-0.00161,0,0.00322,0.00161
2.44031,0.00161,0,0.00806,0.00322
2.52492,0.01128,0,0.00967,0.00967
2.64,0.00645,0,0.00484,-0.00483
2.76523,0.00806,0,0.01128,0.00161
2.88031,0.00967,0,0.01612,0.00161
2.99877,0.01128,0,0.01612,0.00161
3.11385,0.00967,0,0.01612,-0.00161
3.23908,0.00967,0,0.01612,0
3.35415,0.00484,0,0.01289,-0.00483
3.47938,0.00806,0,0.01451,0.00322
3.58431,0.00806,0,0.00322,0
3.70615,0.00967,0,0.01773,0.00161
3.82123,0.00967,0,0.01773,0
3.93969,0.00806,0,0.01128,-0.00161
4.05138,0.00806,0,0.01773,0
4.16308,0.01128,0,0.01773,0.00322
4.28492,0.00967,0,0.01289,-0.00161
4.4,0.00645,0,0.01612,-0.00322
4.51846,0.00967,0,0.01773,0.00322
4.63354,0.00645,0,0.01934,-0.00322
4.74185,0.01289,0,0.01289,0.00644
4.85354,0.00967,0,0.01612,-0.00322
4.96523,0.00967,0,0.01612,0
5.07354,0.00967,0,0.01934,0
5.18862,0.00806,0,0.01451,-0.00161
5.30369,0.00806,0,0.01451,0
5.41538,0.00806,0,0.01612,0
5.51354,0.00806,0,0.01612,0
5.62862,0.01451,0,0.01612,0.00645
5.74031,0.01128,0,0.02095,-0.00323
5.852,0.00967,0,0.01612,-0.00161
5.95692,0.00967,0,0.01773,0
6.06523,0.00806,0,0.02095,-0.00161
6.17692,0.00967,0,0.02256,0.00161
6.27846,0.00806,0,0.01773,-0.00161
6.39354,0.00645,0,0.01773,-0.00161
6.49846,0.00806,0,0.02095,0.00161
6.6,0.00645,0,0.01451,-0.00161
6.71169,0.00484,0,0.01773,-0.00161
6.82338,0.01289,0,0.01773,0.00805
6.92492,0.00967,0,0.02095,-0.00322
7.03662,0.01128,0,0.02095,0.00161
7.14154,0.00967,0,0.02418,-0.00161
7.24308,0.01128,0,0.02256,0.00161
7.34462,0.00484,0,0.01934,-0.00644
7.45631,0.01128,0,0.02095,0.00644
7.56123,0.00806,0,0.02256,-0.00322
7.66277,0.01289,0,0.02095,0.00483
7.75754,0.00967,0,0.02256,-0.00322
7.87262,0.00967,0,0.02579,0
7.97754,0.00967,0,0.02256,0
8.07569,0.00967,0,0.02095,0
8.17723,0.00484,0,0.02418,-0.00483
8.28215,0.00806,0,0.02579,0.00322
8.38369,0.00484,0,0.02256,-0.00322
8.48523,0.01128,0,0.02418,0.00644
8.58,0.00967,0,0.0274,-0.00161
8.68831,0.00806,0,0.02256,-0.00161
8.78985,0.00806,0,0.01773,0
8.89477,0.00484,0,0.02256,-0.00322
8.98954,0.00806,0,0.02256,0.00322
9.09108,0.00484,0,0.02256,-0.00322
9.196,0.00484,0,0.02418,0
9.29077,0.00806,0,0.02256,0.00322
9.39231,0.01128,0,0.0274,0.00322
9.49723,0.00967,0,0.02256,-0.00161
9.58523,0.00806,0,0.02418,-0.00161
9.69015,0.00806,0,0.02418,0
9.78831,0.00967,0,0.02256,0.00161
9.87969,0.00484,0,0.02418,-0.00483
9.98123,0.00967,0,0.02579,0.00483
10.076,0.00484,0,0.02256,-0.00483
10.17415,0.00967,0,0.02256,0.00483
10.27231,0.00645,0,0.02256,-0.00322
10.37046,0.00967,0,0.0274,0.00322
10.45846,0.00967,0,0.02579,0
10.55662,0.00645,0,0.02579,-0.00322
10.65815,0.01128,0,0.02095,0.00483
10.74954,0.00645,0,0.0274,-0.00483
10.83754,0.00806,0,0.02418,0.00161
10.94585,0.00484,0,0.03062,-0.00322
11.03723,0.00645,0,0.02418,0.00161
11.13539,0.00806,0,0.0274,0.00161
11.23354,0.00806,0,0.02901,0
11.32154,0.00967,0,0.01934,0.00161
11.41631,0.00806,0,0.02579,-0.00161
11.49754,0.00967,0,0.03062,0.00161
11.60246,0.00967,0,0.03062,0
11.69723,0.01128,0,0.0274,0.00161
11.78185,0.00806,0,0.02901,-0.00322
11.87662,0.01128,0,0.02901,0.00322
11.968,0.00967,0,0.02901,-0.00161
12.05939,0.00645,0,0.02418,-0.00322
12.15077,0.01128,0,0.02418,0.00483
12.25231,0.00806,0,0.02901,-0.00322
12.34031,0.00806,0,0.02901,0
12.42154,0.00967,0,0.03062,0.00161
12.52308,0.00806,0,0.02418,-0.00161
12.61108,0.00806,0,0.02901,0
12.69231,0.00806,0,0.02901,0
12.79385,0.00967,0,0.03385,0.00161
12.87846,0.00484,0,0.03223,-0.00483
12.96646,0.00645,0,0.03062,0.00161
13.06462,0.01128,0,0.02901,0.00483
13.13908,0.00484,0,0.02901,-0.00644
13.22708,0.00645,0,0.02901,0.00161
13.32523,0.00967,0,0.03062,0.00322
13.40646,0.00322,0,0.03062,-0.00645
13.49785,0.00645,0,0.03385,0.00323
13.58585,0.00484,0,0.02901,-0.00161
13.67723,0.00806,0,0.02579,0.00322
13.76185,0.00806,0,0.0274,0
13.83969,0.00806,0,0.03062,0
13.93446,0.00484,0,0.03062,-0.00322
14.01908,0.00806,0,0.03385,0.00322
14.11046,0.00645,0,0.0274,-0.00161
14.19846,0.00967,0,0.03385,0.00322
14.27969,0.00484,0,0.03223,-0.00483
14.36769,0.00967,0,0.03223,0.00483
14.45231,0.00806,0,0.03062,-0.00161
14.53354,0.00645,0,0.03546,-0.00161
14.62154,0.00806,0,0.03062,0.00161
14.70615,0.00806,0,0.03223,0
14.79077,0.00967,0,0.03062,0.00161
14.87539,0.00967,0,0.03546,0
14.96339,0.00967,0,0.03546,0
15.04123,0.00645,0,0.03223,-0.00322
15.12585,0.00484,0,0.03546,-0.00161
15.20369,0.00806,0,0.03062,0.00322
15.28831,0.00645,0,0.03062,-0.00161
15.37969,0.00645,0,0.03062,0
15.45754,0.00967,0,0.03385,0.00322
15.53877,0.00806,0,0.03223,-0.00161
15.62339,0.00645,0,0.03223,-0.00161
15.70462,0.00967,0,0.03385,0.00322
15.78585,0.00645,0,0.03385,-0.00322
15.86369,0.01128,0,0.03385,0.00483
15.95169,0.00484,0,0.03546,-0.00644
16.03292,0.00967,0,0.03868,0.00483
16.10739,0.00645,0,0.03062,-0.00322
16.18862,0.00645,0,0.03062,0
16.26646,0.00806,0,0.03385,0.00161
16.35446,0.00645,0,0.03223,-0.00161
16.43569,0.00967,0,0.03223,0.00322
16.51354,0.00645,0,0.03223,-0.00322
16.59138,0.00967,0,0.03707,0.00322
16.66246,0.00806,0,0.03223,-0.00161
16.75385,0.00806,0,0.03546,0
16.81816,0.00645,0,0.03707,-0.00161
16.90954,0.00967,0,0.03707,0.00322
16.984,0.00967,0,0.03223,0
17.06185,0.00322,0,0.03868,-0.00645
17.14985,0.00806,0,0.03546,0.00484
17.22769,0.00806,0,0.03707,0
17.30892,0.00806,0,0.03546,0
17.38338,0.00806,0,0.03546,0
17.45446,0.00806,0,0.03546,0
17.53231,0.00806,0,0.03223,0
17.60677,0.00645,0,0.03546,-0.00161
17.688,0.00806,0,0.03385,0.00161
17.76585,0.01128,0,0.04029,0.00322
17.83692,0.00806,0,0.03546,-0.00322
17.91815,0.00645,0,0.03868,-0.00161
17.98923,0.00645,0,0.03546,0
18.07046,0.00806,0,0.03707,0.00161
18.14154,0.00484,0,0.03707,-0.00322
18.21262,0.00645,0,0.03707,0.00161
18.29385,0.00967,0,0.03546,0.00322
18.36831,0.00967,0,0.03868,0
18.44616,0.00806,0,0.03707,-0.00161
18.51385,0.00806,0,0.03707,0
18.59169,0.00484,0,0.03546,-0.00322
18.67631,0.00806,0,0.03868,0.00322
18.744,0.00645,0,0.03546,-0.00161
18.81508,0.00484,0,0.03707,-0.00161
18.88615,0.00967,0,0.03546,0.00483
18.95046,0.00806,0,0.03707,-0.00161
19.03508,0.01128,0,0.03546,0.00322
19.11292,0.00484,0,0.0419,-0.00644
19.17723,0.00806,0,0.03868,0.00322
19.25508,0.00967,0,0.03868,0.00161
19.32277,0.00645,0,0.0419,-0.00322
19.39385,0.00967,0,0.03868,0.00322
19.47846,0.00322,0,0.03707,-0.00645
19.54277,0.00484,0,0.04029,0.00162
19.61046,0.00484,0,0.03546,0
19.68831,0.00806,0,0.04029,0.00322
19.76277,0.00322,0,0.04029,-0.00484
19.82369,0.00806,0,0.03707,0.00484
19.89477,0.00967,0,0.04029,0.00161
19.96585,0.00645,0,0.03385,-0.00322
20.04369,0.00806,0,0.03546,0.00161
20.10462,0.00806,0,0.03868,0
20.17569,0.00645,0,0.04029,-0.00161
20.24677,0.00645,0,0.04029,0
20.31446,0.00484,0,0.03868,-0.00161
20.38554,0.00645,0,0.04029,0.00161
20.46,0.00806,0,0.04029,0.00161
20.52769,0.00806,0,0.03868,0
20.59877,0.00806,0,0.03868,0
20.66646,0.00806,0,0.03868,0
20.724,0.00645,0,0.0419,-0.00161
20.80523,0.00484,0,0.03868,-0.00161
20.86954,0.00806,0,0.04029,0.00322
20.93723,0.00645,0,0.03707,-0.00161
21.00831,0.00484,0,0.03868,-0.00161
21.08277,0.00322,0,0.04029,-0.00162
21.14031,0.00806,0,0.04029,0.00484
21.208,0.00484,0,0.03868,-0.00322
21.27231,0.00806,0,0.03868,0.00322
21.34339,0.00806,0,0.03707,0
21.41108,0.00806,0,0.04352,0
21.47877,0.00484,0,0.03868,-0.00322
21.54308,0.00806,0,0.04029,0.00322
21.61754,0.00484,0,0.04029,-0.00322
21.67508,0.00645,0,0.0419,0.00161
21.73939,0.00806,0,0.0419,0.00161
21.80369,0.00645,0,0.04352,-0.00161
21.87139,0.00645,0,0.03707,0
21.93569,0.00645,0,0.04352,0
22.01354,0.00484,0,0.04352,-0.00161
22.06769,0.00967,0,0.04674,0.00483
22.132,0.00322,0,0.03868,-0.00645
22.19631,0.00484,0,0.03868,0.00162
22.264,0.00645,0,0.04352,0.00161
22.32492,0.00484,0,0.04352,-0.00161
22.396,0.00967,0,0.04996,0.00483
22.46369,0.00806,0,0.0419,-0.00161
22.52123,0.00645,0,0.04029,-0.00161
22.57539,0.00806,0,0.04674,0.00161
22.64985,0.00161,0,0.04029,-0.00645
22.71754,0.00645,0,0.04674,0.00484
22.77169,0.00322,0,0.0419,-0.00323
22.83939,0.00645,0,0.04674,0.00323
22.90708,0.00484,0,0.0419,-0.00161
22.97816,0.00484,0,0.0419,0
23.02216,0.00806,0,0.0419,0.00322
23.09662,0.00806,0,0.04352,0
23.16092,0.00322,0,0.04029,-0.00484
23.22185,0.00806,0,0.04835,0.00484
23.28277,0.00806,0,0.04996,0
23.35046,0.00645,0,0.04029,-0.00161
23.39785,0.00322,0,0.04513,-0.00323
23.46215,0.00484,0,0.04352,0.00162
23.52308,0.00967,0,0.04835,0.00483
23.58739,0.00806,0,0.04352,-0.00161
23.64831,-0.00161,0,0.0419,-0.00967
23.70923,0.00645,0,0.04674,0.00806
23.77015,0.00806,0,0.04352,0.00161
23.83108,0.00484,0,0.0419,-0.00322
23.892,0.00645,0,0.04835,0.00161
23.96308,0.00645,0,0.04513,0
24.00708,0.00645,0,0.04352,0
24.07139,0.00645,0,0.04352,0
24.13569,0.00967,0,0.05319,0.00322
24.18985,0.00645,0,0.0419,-0.00322
24.25077,0.00484,0,0.04835,-0.00161
24.30492,0.00806,0,0.04835,0.00322
24.36585,0.00645,0,0.0419,-0.00161
24.42339,0.00484,0,0.04674,-0.00161
24.48431,0.00322,0,0.04513,-0.00162
24.54185,0.00806,0,0.05158,0.00484
24.60277,0.00484,0,0.04674,-0.00322
24.66031,0,0,0.05158,-0.00484
24.71108,0.00322,0,0.04674,0.00322
24.77538,0.00645,0,0.05319,0.00323
24.83631,0.00322,0,0.04029,-0.00323
24.904,0.00484,0,0.04674,0.00162
24.96492,0.00322,0,0.04835,-0.00162
25.01569,0.00645,0,0.04996,0.00323
25.06985,0.00484,0,0.04674,-0.00161
25.13077,0.00484,0,0.04996,0
25.18831,0.00484,0,0.0419,0
25.24585,0.00484,0,0.04352,0
25.3,0.00484,0,0.04352,0
25.35415,0.00645,0,0.04996,0.00161
25.41508,0.00322,0,0.04674,-0.00323
25.46585,0.00806,0,0.04352,0.00484
25.52677,0.00484,0,0.05158,-0.00322
25.58092,0.00484,0,0.04835,0
25.63169,0.00806,0,0.05158,0.00322
25.68246,0.00967,0,0.04513,0.00161
25.74677,0.00484,0,0.05319,-0.00483
25.80092,0.00484,0,0.04674,0
25.86185,0.00322,0,0.04835,-0.00162
25.91262,0.00484,0,0.04835,0.00162
25.96677,0.00645,0,0.05158,0.00161
26.02092,0.00322,0,0.04029,-0.00323
26.08185,0.00645,0,0.04674,0.00323
26.13939,0.00322,0,0.05158,-0.00323
26.19016,0.00322,0,0.04996,0
26.24431,0.00161,0,0.04996,-0.00161
26.30185,0.00645,0,0.05158,0.00484
26.35262,0.00806,0,0.04835,0.00161
26.40339,0.00322,0,0.05158,-0.00484
26.45415,0.00322,0,0.05319,0
26.51846,0.00806,0,0.04996,0.00484
26.55908,0.00484,0,0.0548,-0.00322
26.61662,0.00806,0,0.05158,0.00322
26.66739,0.00484,0,0.05319,-0.00322
26.73169,0,0,0.04352,-0.00484
26.77569,0.00967,0,0.04996,0.00967
26.83662,0.00484,0,0.04674,-0.00483
26.89077,0.00161,0,0.04513,-0.00323
26.93477,0.00645,0,0.05802,0.00484
26.99231,0.00645,0,0.05158,0
27.04646,0.00806,0,0.05319,0.00161
27.09046,0.00484,0,0.0548,-0.00322
27.14123,0.00806,0,0.05319,0.00322
27.20215,0.00484,0,0.0548,-0.00322
27.24954,0.00484,0,0.04835,0
27.30031,0.00322,0,0.05158,-0.00162
27.34769,0.00322,0,0.04996,0
27.40185,0.00484,0,0.05319,0.00162
27.456,0.00322,0,0.04996,-0.00162
27.50339,0.00645,0,0.05963,0.00323
27.55416,0.00484,0,0.05802,-0.00161
27.61169,0.00484,0,0.05158,0
27.65908,0.00161,0,0.0548,-0.00323
27.70308,0.00645,0,0.04835,0.00484
27.75385,0.00484,0,0.0548,-0.00161
27.80462,0.00645,0,0.05319,0.00161
27.85877,0.00967,0,0.05641,0.00322
27.90615,0.00322,0,0.04513,-0.00645
27.95692,0,0,0.05158,-0.00322
28.00431,0.00322,0,0.05158,0.00322
28.05508,0.00322,0,0.0548,0
28.10246,0.00484,0,0.04996,0.00162
28.14308,0.00645,0,0.05158,0.00161
28.19385,0.00806,0,0.0548,0.00161
28.25816,0.00484,0,0.04674,-0.00322
28.29877,0.00484,0,0.0548,0
28.34277,0.00161,0,0.0548,-0.00323
28.40031,0.00484,0,0.05641,0.00323
28.44769,0.00484,0,0.05319,0
28.49169,0.00806,0,0.0548,0.00322
28.54585,0.00161,0,0.05319,-0.00645
28.58985,0.00484,0,0.05802,0.00323
28.63385,-0.00161,0,0.05158,-0.00645
28.68462,0.00484,0,0.05802,0.00645
28.73539,0.00161,0,0.05319,-0.00323
28.776,0.00322,0,0.04835,0.00161
28.83354,0.00484,0,0.05641,0.00162
28.87077,0.00484,0,0.05802,0
28.91477,0.00806,0,0.0548,0.00322
28.96554,0.00322,0,0.05319,-0.00484
29.00616,0.00806,0,0.06125,0.00484
29.06708,0.00161,0,0.05158,-0.00645
29.11446,0.00484,0,0.05158,0.00323
29.15846,0.00484,0,0.0548,0
29.19569,0.00806,0,0.0548,0.00322
29.24985,0.00484,0,0.05641,-0.00322
29.29385,0.00484,0,0.05963,0
29.33785,0.00484,0,0.04835,0
29.38862,0.00484,0,0.05641,0
29.42585,-0.00161,0,0.05319,-0.00645
29.48339,0.00322,0,0.05963,0.00483
29.524,0.00484,0,0.04996,0.00162
29.57477,0.00645,0,0.0548,0.00161
29.60862,0,0,0.05802,-0.00645
29.65939,0.00484,0,0.06125,0.00484
29.71016,0.00484,0,0.05641,0
29.75077,0.00322,0,0.05319,-0.00162
29.79139,0.00322,0,0.05641,0
29.84216,0.00322,0,0.06286,0
29.87938,0.00484,0,0.04835,0.00162
29.93015,0.00645,0,0.05319,0.00161
29.97754,0.00484,0,0.06125,-0.00161
30.01477,0.00484,0,0.0548,0
30.05539,0.00484,0,0.05963,0
30.11292,0.00484,0,0.06125,0
30.15016,0.00484,0,0.06125,0
30.19415,0.00484,0,0.05802,0
30.23477,0.00161,0,0.05802,-0.00323
30.28554,0.00806,0,0.05963,0.00645
30.32615,0.00322,0,0.06125,-0.00484
30.36677,0.00161,0,0.05963,-0.00161
30.41077,0.00322,0,0.05963,0.00161
30.45139,0.00645,0,0.05641,0.00323
30.49539,0.00484,0,0.05802,-0.00161
30.54277,0.00322,0,0.05641,-0.00162
30.58339,0,0,0.05802,-0.00322
30.61723,0.00484,0,0.05802,0.00484
30.66123,0.00484,0,0.06125,0
30.70185,0.00484,0,0.05963,0
30.75262,0.00161,0,0.06286,-0.00323
30.79662,0.00322,0,0.0548,0.00161
30.844,0.00484,0,0.05802,0.00162
30.87446,0,0,0.05963,-0.00484
30.92185,0.00806,0,0.06125,0.00806
30.95231,-0.00645,0,0.05641,-0.01451
30.94216,-0.00161,0,0.05963,0.00484
30.932,-0.00161,0,0.05963,0
30.92185,-0.00161,0,0.06125,0
30.90831,0.00322,0,0.05963,0.00483
30.90154,-0.00161,0,0.05802,-0.00483
30.90154,-0.00322,0,0.05802,-0.00161
30.89477,-0.00322,0,0.05963,0
30.888,-0.00322,0,0.05802,0
30.87108,-0.00645,0,0.05963,-0.00323
30.87108,0,0,0.05963,0.00645
30.87108,-0.00322,0,0.06125,-0.00322
30.85415,-0.00322,0,0.05963,0
30.85415,-0.00161,0,0.05319,0.00161
30.84062,-0.00322,0,0.06125,-0.00161
30.844,0,0,0.05641,0.00322
30.82369,0.00322,0,0.05963,0.00322
30.81693,0.00161,0,0.06125,-0.00161
30.81354,0.00161,0,0.05802,0
30.80677,0,0,0.05802,-0.00161
30.8,-0.00322,0,0.05641,-0.00322
30.79662,0.00322,0,0.06125,0.00644
30.78308,-0.00484,0,0.05802,-0.00806
30.77631,0.00161,0,0.05963,0.00645
30.77631,0,0,0.05802,-0.00161
30.76616,-0.00161,0,0.05963,-0.00161
30.76616,-0.00161,0,0.05963,0
30.76277,-0.00645,0,0.05802,-0.00484
30.75262,-0.00322,0,0.06125,0.00323
30.73908,-0.00484,0,0.05963,-0.00162
30.72892,-0.00484,0,0.05641,0
30.73231,-0.00322,0,0.05963,0.00162
30.72554,-0.00322,0,0.05802,0
30.71539,0,0,0.05963,0.00322
30.71539,0,0,0.06125,0
30.70523,-0.00161,0,0.05802,-0.00161
30.69508,-0.00645,0,0.06125,-0.00484
30.69169,-0.00484,0,0.05802,0.00161
30.68831,0,0,0.05963,0.00484
30.67477,-0.00322,0,0.05963,-0.00322
30.67139,0,0,0.06125,0.00322
30.66123,-0.00322,0,0.05641,-0.00322
30.66123,0,0,0.05963,0.00322
30.65785,-0.00322,0,0.05963,-0.00322
30.65446,-0.00484,0,0.05963,-0.00162
30.64431,-0.00484,0,0.05802,0
30.63416,0,0,0.06286,0.00484
30.63754,0.00322,0,0.05963,0.00322
30.62739,-0.00322,0,0.05641,-0.00644
30.62062,0.00161,0,0.05963,0.00483
30.62062,0,0,0.05641,-0.00161
30.60369,0,0,0.05963,0
30.59692,0,0,0.05641,0
30.59692,-0.00322,0,0.05963,-0.00322
30.59015,0,0,0.06125,0.00322
30.58677,-0.00322,0,0.05963,-0.00322
30.58339,-0.00161,0,0.05963,0.00161
30.57323,0.00161,0,0.0548,0.00322
30.56646,0,0,0.05963,-0.00161
30.55631,0.00161,0,0.05319,0.00161
30.56308,-0.00322,0,0.05802,-0.00483
30.55631,-0.00484,0,0.06125,-0.00162
30.53939,-0.00484,0,0.05802,0
30.536,0,0,0.05641,0.00484
30.53262,0.00322,0,0.05641,0.00322
30.52923,0,0,0.05641,-0.00322
30.52246,-0.00806,0,0.05641,-0.00806
30.51231,0,0,0.0548,0.00806
30.51231,0.00161,0,0.0548,0.00161
30.51231,0.00322,0,0.05641,0.00161
30.49877,-0.00161,0,0.06125,-0.00483
30.49877,-0.00322,0,0.0548,-0.00161
30.48862,-0.00484,0,0.05641,-0.00162
30.47846,-0.00322,0,0.05802,0.00162
30.48185,-0.00161,0,0.05802,0.00161
30.46831,0,0,0.06125,0.00161
30.47169,0.00161,0,0.05641,0.00161
30.46154,-0.00161,0,0.05641,-0.00322
30.45815,-0.00484,0,0.05802,-0.00323
30.45477,0,0,0.05802,0.00484
30.448,-0.00322,0,0.05641,-0.00322
30.44123,-0.00645,0,0.0548,-0.00323
30.44123,0,0,0.06286,0.00645
30.42431,0.00322,0,0.04996,0.00322
30.42431,-0.00161,0,0.05319,-0.00483
30.42093,-0.00322,0,0.05641,-0.00161
30.41416,0.00322,0,0.05802,0.00644
30.41754,-0.00161,0,0.05158,-0.00483
30.40062,-0.00484,0,0.05963,-0.00323
30.40062,-0.00322,0,0.05802,0.00162
30.40062,-0.00161,0,0.05641,0.00161
30.38708,-0.00322,0,0.0548,-0.00161
30.38708,-0.00322,0,0.05641,0
30.37692,-0.00484,0,0.05802,-0.00162
30.37354,-0.00484,0,0.05963,0
30.36,0.00161,0,0.04996,0.00645
30.36677,-0.00161,0,0.0548,-0.00322
30.36339,0,0,0.05158,0.00161
30.34985,0,0,0.05963,0
30.35662,0,0,0.05802,0
30.33969,-0.00161,0,0.05963,-0.00161
30.33631,-0.00484,0,0.05802,-0.00323
30.33292,-0.00322,0,0.05641,0.00162
30.33631,-0.00161,0,0.05641,0.00161
30.31939,-0.00161,0,0.05963,0
30.316,-0.00322,0,0.0548,-0.00161
30.30585,0,0,0.05802,0.00322
30.30246,0.00161,0,0.05641,0.00161
30.29908,-0.00161,0,0.05963,-0.00322
30.28893,-0.00322,0,0.05963,-0.00161
30.29908,0.00161,0,0.05802,0.00483
30.28893,0,0,0.06125,-0.00161
30.28893,-0.00322,0,0.05319,-0.00322
30.27877,-0.00322,0,0.05641,0
30.26523,-0.00484,0,0.05963,-0.00162
30.26185,-0.00161,0,0.06125,0.00323
30.26185,0,0,0.06125,0.00161
30.26185,0,0,0.05641,0
30.24831,0.00484,0,0.05641,0.00484
30.24492,-0.00322,0,0.05963,-0.00806
30.23139,-0.00161,0,0.06125,0.00161
30.23139,0,0,0.05963,0.00161
30.22462,-0.00322,0,0.05802,-0.00322
30.228,0.00322,0,0.06125,0.00644
30.22123,-0.00161,0,0.05641,-0.00483
30.21108,0.00322,0,0.04835,0.00483
30.21785,-0.00645,0,0.05158,-0.00967
30.20769,-0.00161,0,0.06286,0.00484
30.19754,-0.00161,0,0.05802,0
30.19077,0,0,0.05963,0.00161
30.18739,-0.00484,0,0.05963,-0.00484
30.184,-0.00322,0,0.05802,0.00162
30.18062,-0.00161,0,0.05802,0.00161
30.17385,0.00161,0,0.05641,0.00322
30.17385,0,0,0.05802,-0.00161
30.16708,-0.00484,0,0.05802,-0.00484
30.16031,-0.00484,0,0.05802,0
30.16369,0,0,0.06125,0.00484
30.15354,0,0,0.05802,0
30.15693,-0.00161,0,0.05641,-0.00161
30.14339,0.00322,0,0.05641,0.00483
30.13662,0.00322,0,0.0548,0
30.12985,-0.00322,0,0.0548,-0.00644
30.13323,-0.00161,0,0.05802,0.00161
30.13323,-0.00322,0,0.05641,-0.00161
30.12646,0.00161,0,0.05802,0.00483
30.11631,-0.00161,0,0.05641,-0.00322
30.10616,-0.00322,0,0.05641,-0.00161
30.10277,-0.00322,0,0.05641,0
30.096,-0.00322,0,0.0548,0
30.096,-0.00161,0,0.05802,0.00161
30.09939,0.00161,0,0.0548,0.00322
30.08246,-0.00484,0,0.05641,-0.00645
30.07569,-0.00161,0,0.05641,0.00323
30.09262,0.00161,0,0.05802,0.00322
30.06554,-0.00322,0,0.05319,-0.00483
30.06554,-0.00161,0,0.05802,0.00161
30.06215,-0.00161,0,0.05963,0
30.06215,-0.00161,0,0.05319,0
30.052,-0.00484,0,0.0548,-0.00323
30.04862,-0.00322,0,0.05802,0.00162
30.04862,0.00161,0,0.05641,0.00483
30.03846,-0.00806,0,0.05641,-0.00967
30.03508,-0.00484,0,0.0548,0.00322
30.02831,-0.00161,0,0.05319,0.00323
30.02831,-0.00322,0,0.0548,-0.00161
30.02831,-0.00484,0,0.05641,-0.00162
29.97077,-0.00806,0,0.06125,-0.00322
29.88277,-0.01128,0,0.05802,-0.00322
29.79815,-0.00806,0,0.05641,0.00322
29.72031,-0.00806,0,0.05319,0
29.64923,-0.01289,0,0.05319,-0.00483
29.57139,-0.00484,0,0.05319,0.00805
29.49354,-0.00806,0,0.05963,-0.00322
29.40554,-0.00484,0,0.05319,0.00322
29.33785,-0.00806,0,0.05319,-0.00322
29.24646,-0.01128,0,0.05641,-0.00322
29.17539,-0.01128,0,0.05641,0
29.10092,-0.00967,0,0.05641,0.00161
29.02985,-0.00806,0,0.05641,0.00161
28.94185,-0.00806,0,0.05158,0
28.86739,-0.00806,0,0.05802,0
28.79292,-0.00806,0,0.0548,0
28.72185,-0.00806,0,0.05319,0
28.63723,-0.00645,0,0.0548,0.00161
28.56615,-0.01128,0,0.05319,-0.00483
28.49846,-0.00967,0,0.05641,0.00161
28.45785,-0.00322,0,0.05319,0.00645
28.44431,-0.00322,0,0.05802,0
28.44092,-0.00645,0,0.05319,-0.00323
28.43415,-0.00322,0,0.05158,0.00323
28.43754,-0.00806,0,0.0548,-0.00484
28.35969,-0.00967,0,0.04996,-0.00161
28.28523,-0.00645,0,0.05158,0.00322
28.20062,-0.00806,0,0.05158,-0.00161
28.13293,-0.00806,0,0.04996,0
28.05508,-0.00484,0,0.0419,0.00322
27.99077,-0.01128,0,0.04996,-0.00644
27.90954,-0.00645,0,0.05158,0.00483
27.83846,-0.00484,0,0.05641,0.00161
27.764,-0.00806,0,0.04835,-0.00322
27.70308,-0.01128,0,0.04835,-0.00322
27.61508,-0.00645,0,0.05158,0.00483
27.55077,-0.00645,0,0.05641,0
27.47631,-0.00806,0,0.05802,-0.00161
27.40523,-0.00806,0,0.0548,0
27.34092,-0.00967,0,0.05319,-0.00161
27.26985,-0.00806,0,0.05158,0.00161
27.19538,-0.00645,0,0.0548,0.00161
27.11754,-0.00645,0,0.05319,0
27.04646,-0.00645,0,0.05319,0
26.97539,-0.00645,0,0.05158,0
26.90431,-0.00806,0,0.0548,-0.00161
26.83662,-0.00645,0,0.05158,0.00161
26.76554,-0.00484,0,0.05641,0.00161
26.70123,-0.00645,0,0.04674,-0.00161
26.62339,-0.00645,0,0.05319,0
26.55569,-0.00806,0,0.04352,-0.00161
26.488,-0.00967,0,0.04513,-0.00161
26.42031,-0.00484,0,0.05158,0.00483
26.36277,-0.01128,0,0.04352,-0.00644
26.27815,-0.00806,0,0.04835,0.00322
26.22062,-0.00806,0,0.04835,0
26.14954,-0.00645,0,0.04996,0.00161
26.07846,-0.00645,0,0.04996,0
26.01415,-0.00645,0,0.0548,0
25.94308,-0.00645,0,0.05158,0
25.872,-0.00484,0,0.05158,0.00161
25.80431,-0.00645,0,0.04996,-0.00161
25.73662,-0.00967,0,0.04352,-0.00322
25.66892,-0.00645,0,0.04835,0.00322
25.59446,-0.00645,0,0.04513,0
25.54031,-0.01289,0,0.04674,-0.00644
25.46923,-0.00806,0,0.04674,0.00483
25.40154,-0.00806,0,0.04352,0
25.33723,-0.00967,0,0.04029,-0.00161
25.27292,-0.00645,0,0.0548,0.00322
25.20862,-0.00967,0,0.0419,-0.00322
25.14092,-0.00806,0,0.04835,0.00161
25.08,-0.00645,0,0.05158,0.00161
25.00892,-0.00645,0,0.04513,0
24.94462,-0.00645,0,0.04513,0
24.87692,-0.01128,0,0.0419,-0.00483
24.80585,-0.00645,0,0.05158,0.00483
24.74492,-0.00645,0,0.04513,0
24.68062,-0.00806,0,0.04996,-0.00161
24.61969,-0.00806,0,0.04513,0
24.55539,-0.00645,0,0.04996,0.00161
24.49785,-0.00806,0,0.04513,-0.00161
24.43692,-0.00806,0,0.04674,0
24.36246,-0.00806,0,0.04513,0
24.30831,-0.00645,0,0.04996,0.00161
24.25077,-0.01128,0,0.0419,-0.00483
24.17631,-0.01128,0,0.04029,0
24.12554,-0.00484,0,0.04674,0.00644
24.05785,-0.00484,0,0.04513,0
23.98677,-0.00645,0,0.04352,-0.00161
23.92246,-0.00806,0,0.04352,-0.00161
23.87169,-0.00484,0,0.0419,0.00322
23.81077,-0.00484,0,0.04674,0
23.74308,-0.00484,0,0.04352,0
23.68554,-0.00645,0,0.04674,-0.00161
23.61785,-0.00806,0,0.04513,-0.00161
23.56031,-0.00484,0,0.04674,0.00322
23.48923,-0.00484,0,0.04513,0
23.43169,-0.00645,0,0.04352,-0.00161
23.37077,-0.00806,0,0.04352,-0.00161
23.31662,-0.00484,0,0.04029,0.00322
23.25908,-0.00645,0,0.04513,-0.00161
23.18123,-0.00645,0,0.0419,0
23.13723,-0.00645,0,0.04513,0
23.08308,-0.00645,0,0.04029,0
23.012,-0.00806,0,0.03868,-0.00161
22.94769,-0.00645,0,0.0419,0.00161
22.89692,-0.00484,0,0.04674,0.00161
22.83262,-0.00967,0,0.04352,-0.00483
22.77846,-0.00484,0,0.0419,0.00483
22.71416,-0.00967,0,0.04513,-0.00483
22.66339,-0.00645,0,0.03868,0.00322
22.59569,-0.00484,0,0.04513,0.00161
22.54154,-0.00645,0,0.04352,-0.00161
22.48062,-0.00645,0,0.04352,0
22.42308,-0.01128,0,0.03868,-0.00483
22.36215,-0.00806,0,0.0419,0.00322
22.29785,-0.00806,0,0.03868,0
22.24708,-0.00645,0,0.04674,0.00161
22.19292,-0.00645,0,0.04513,0
22.12862,-0.00484,0,0.04513,0.00161
22.08123,-0.00645,0,0.04835,-0.00161
22.02031,-0.00645,0,0.03707,0
21.96277,-0.00645,0,0.04996,0
21.90523,-0.00967,0,0.03868,-0.00322
21.84431,-0.00967,0,0.03868,0
21.79354,-0.00806,0,0.04352,0.00161
21.736,-0.00645,0,0.0419,0.00161
21.67846,-0.00645,0,0.0419,0
21.62769,-0.00645,0,0.04513,0
21.56339,-0.00806,0,0.04029,-0.00161
21.50923,-0.00484,0,0.04352,0.00322
21.45169,-0.00645,0,0.04029,-0.00161
21.39416,-0.00806,0,0.04513,-0.00161
21.34339,-0.00645,0,0.04029,0.00161
21.28923,-0.00484,0,0.03707,0.00161
21.23169,-0.01128,0,0.03868,-0.00644
21.18092,-0.00645,0,0.04352,0.00483
21.12339,0,0,0.03868,0.00645
21.07262,-0.00484,0,0.04352,-0.00484
21.01846,-0.00322,0,0.0419,0.00162
20.96092,-0.00322,0,0.04029,0
20.91015,-0.00806,0,0.04029,-0.00484
20.85262,-0.00645,0,0.0419,0.00161
20.79846,-0.00322,0,0.03707,0.00323
20.74431,-0.00484,0,0.04513,-0.00162
20.68339,-0.00645,0,0.04029,-0.00161
20.63939,-0.00645,0,0.04029,0
20.57846,-0.00484,0,0.04352,0.00161
20.53446,-0.01128,0,0.03868,-0.00644
20.48031,-0.00645,0,0.04352,0.00483
20.42277,-0.00484,0,0.04029,0.00161
20.37539,-0.00645,0,0.03868,-0.00161
20.31446,-0.00806,0,0.03707,-0.00161
20.26369,-0.00645,0,0.04029,0.00161
20.20954,-0.00645,0,0.0419,0
20.15877,-0.00645,0,0.03707,0
20.10462,-0.00484,0,0.04029,0.00161
20.05723,-0.00484,0,0.03868,0
20.00308,-0.00645,0,0.03707,-0.00161
19.95231,-0.00645,0,0.03546,0
19.89139,-0.00645,0,0.0419,0
19.85077,-0.00161,0,0.03868,0.00484
19.79662,-0.00645,0,0.03707,-0.00484
19.74923,-0.00967,0,0.03868,-0.00322
19.69508,-0.00645,0,0.03707,0.00322
19.64769,-0.00645,0,0.03868,0
19.59354,-0.00806,0,0.04352,-0.00161
19.54277,-0.00484,0,0.03546,0.00322
19.48862,-0.01128,0,0.03546,-0.00644
19.44123,-0.00806,0,0.03868,0.00322
19.38031,-0.00645,0,0.03707,0.00161
19.33969,-0.00484,0,0.04029,0.00161
19.28892,-0.00645,0,0.04029,-0.00161
19.24154,-0.00806,0,0.03546,-0.00161
19.14677,0.00161,0,0.03707,0.00967
19.08585,-0.00645,0,0.03385,-0.00806
19.04185,-0.00806,0,0.03546,-0.00161
18.99108,-0.00645,0,0.03546,0.00161
18.94369,-0.00967,0,0.03707,-0.00322
18.89292,-0.00484,0,0.03868,0.00483
18.84216,-0.00645,0,0.03707,-0.00161
18.80154,-0.00806,0,0.03707,-0.00161
18.75077,-0.00322,0,0.03385,0.00484
18.7,-0.00806,0,0.03223,-0.00484
18.64585,-0.00967,0,0.03707,-0.00161
18.60185,-0.00322,0,0.03546,0.00645
18.55446,-0.00322,0,0.03546,0
18.50708,-0.00484,0,0.03385,-0.00162
18.46308,-0.00322,0,0.03707,0.00162
18.40892,-0.00645,0,0.03546,-0.00323
18.36492,-0.00484,0,0.03546,0.00161
18.31077,-0.00645,0,0.03707,-0.00161
18.26,-0.00806,0,0.03546,-0.00161
18.21939,-0.00484,0,0.03385,0.00322
18.172,-0.00484,0,0.03868,0
18.128,-0.00645,0,0.03546,-0.00161
18.07046,-0.00484,0,0.03707,0.00161
18.03323,-0.00967,0,0.03707,-0.00483
17.97908,-0.00645,0,0.03546,0.00322
17.93846,-0.00161,0,0.03707,0.00484
17.88769,-0.00645,0,0.03385,-0.00484
17.84369,-0.00484,0,0.03546,0.00161
17.79631,-0.00806,0,0.03868,-0.00322
17.75908,-0.00967,0,0.03546,-0.00161
17.70831,-0.00484,0,0.03546,0.00483
17.65754,-0.00484,0,0.03546,0
17.61692,-0.00806,0,0.03546,-0.00322
17.56615,-0.00645,0,0.03223,0.00161
17.52215,0,0,0.03546,0.00645
17.47816,0,0,0.03546,0
17.42739,-0.00645,0,0.03385,-0.00645
17.38677,-0.00645,0,0.03707,0
17.34616,-0.00645,0,0.03707,0
17.28523,-0.00967,0,0.03223,-0.00322
17.25138,-0.00645,0,0.03707,0.00322
17.21077,-0.00484,0,0.03707,0.00161
17.14985,-0.00806,0,0.03546,-0.00322
17.11262,-0.00645,0,0.03546,0.00161
17.072,-0.00484,0,0.03546,0.00161
17.02123,0.00161,0,0.03707,0.00645
16.984,-0.00806,0,0.03385,-0.00967
16.94,-0.00322,0,0.03546,0.00484
16.88585,0.00161,0,0.03385,0.00483
16.84862,-0.00645,0,0.03223,-0.00806
16.80462,-0.00645,0,0.03707,0
16.76062,-0.00322,0,0.03707,0.00323
16.71323,-0.00484,0,0.03546,-0.00162
16.676,-0.00806,0,0.03223,-0.00322
16.632,-0.00645,0,0.03546,0.00161
16.588,-0.00645,0,0.03546,0
16.544,-0.00484,0,0.03707,0.00161
16.51015,-0.00161,0,0.03223,0.00323
16.45938,-0.00484,0,0.03546,-0.00323
16.412,-0.00322,0,0.03546,0.00162
16.37139,-0.00484,0,0.03223,-0.00162
16.33077,-0.00645,0,0.03546,-0.00161
16.28677,-0.00645,0,0.03546,0
16.24615,-0.00645,0,0.03385,0
16.20554,-0.00322,0,0.03868,0.00323
16.16154,-0.00806,0,0.03385,-0.00484
16.11415,-0.00806,0,0.03546,0
16.07692,-0.00322,0,0.03385,0.00484
16.03631,0,0,0.03546,0.00322
15.98892,-0.00322,0,0.03546,-0.00322
15.94831,0,0,0.03385,0.00322
15.90092,-0.00322,0,0.03385,-0.00322
15.87046,-0.00645,0,0.03546,-0.00323
15.82308,0,0,0.03062,0.00645
15.78585,-0.00322,0,0.02901,-0.00322
15.74185,-0.00322,0,0.03385,0
15.70123,-0.00484,0,0.03707,-0.00162
15.66062,-0.00484,0,0.03707,0
15.62339,-0.00806,0,0.03223,-0.00322
15.576,0.00161,0,0.03385,0.00967
15.53877,0.00161,0,0.03062,0
15.49477,-0.00806,0,0.02256,-0.00967
15.45754,0,0,0.03546,0.00806
15.41692,-0.00484,0,0.03223,-0.00484
15.37631,-0.00484,0,0.03385,0
15.33569,-0.00645,0,0.03223,-0.00161
15.29508,-0.00645,0,0.03385,0
15.25108,-0.00484,0,0.03223,0.00161
15.21385,-0.00161,0,0.04029,0.00323
15.18338,-0.00484,0,0.03062,-0.00323
15.13939,-0.00484,0,0.03223,0
15.08862,-0.00645,0,0.03707,-0.00161
15.05815,-0.00484,0,0.03062,0.00161
15.02092,-0.00645,0,0.03385,-0.00161
14.97692,-0.00484,0,0.03385,0.00161
14.94308,-0.00484,0,0.03385,0
14.90923,-0.00645,0,0.03385,-0.00161
14.85508,-0.00645,0,0.03546,0
14.82462,-0.00322,0,0.03385,0.00323
14.78062,-0.00161,0,0.03223,0.00161
14.74677,-0.00645,0,0.03546,-0.00484
14.70615,-0.00484,0,0.03385,0.00161
14.66892,-0.00645,0,0.03223,-0.00161
14.62492,-0.00645,0,0.03385,0
14.59446,-0.00484,0,0.03546,0.00161
14.55046,-0.00806,0,0.03385,-0.00322
14.51662,-0.00322,0,0.03062,0.00484
14.46923,-0.00322,0,0.03385,0
14.44215,-0.00967,0,0.02901,-0.00645
14.41169,-0.00645,0,0.03385,0.00322
14.36769,-0.00322,0,0.03062,0.00323
14.32369,-0.01128,0,0.03223,-0.00806
14.29323,-0.00322,0,0.03707,0.00806
14.25262,-0.00645,0,0.03223,-0.00323
14.20862,-0.00645,0,0.03223,0
14.17815,0,0,0.03062,0.00645
14.13754,-0.00645,0,0.03062,-0.00645
14.10708,-0.01128,0,0.03223,-0.00483
14.06646,-0.00161,0,0.03062,0.00967
14.03262,-0.00322,0,0.03062,-0.00161
13.992,0.00161,0,0.03546,0.00483
13.95477,-0.00322,0,0.03062,-0.00483
13.93108,-0.00161,0,0.03223,0.00161
13.88031,0,0,0.03062,0.00161
13.84308,-0.00645,0,0.02901,-0.00645
13.80923,-0.00645,0,0.03062,0
13.77538,-0.00484,0,0.02901,0.00161
13.73815,-0.00645,0,0.03062,-0.00161
13.69415,-0.00645,0,0.03385,0
13.67046,-0.00484,0,0.03385,0.00161
13.63323,-0.00806,0,0.03385,-0.00322
13.596,-0.00645,0,0.03385,0.00161
13.55539,-0.00645,0,0.03223,0
13.52831,-0.00322,0,0.03385,0.00323
13.49108,-0.00484,0,0.03062,-0.00162
13.43692,-0.00967,0,0.03385,-0.00483
13.42,0.00322,0,0.03546,0.01289
13.37938,-0.00645,0,0.0274,-0.00967
13.33877,-0.00645,0,0.02901,0
13.30492,-0.00806,0,0.03223,-0.00161
13.28123,-0.00484,0,0.02901,0.00322
13.23723,-0.00484,0,0.02901,0
13.2,-0.00645,0,0.03223,-0.00161
13.16954,-0.00484,0,0.03223,0.00161
13.13231,0,0,0.03062,0.00484
13.10185,-0.00484,0,0.03062,-0.00484
13.06462,-0.00484,0,0.03062,0
13.03754,-0.00322,0,0.02901,0.00162
13.00369,-0.00322,0,0.02579,0
12.96308,0,0,0.03385,0.00322
12.92585,-0.00806,0,0.0274,-0.00806
12.89877,-0.00484,0,0.03385,0.00322
12.85815,-0.00806,0,0.02579,-0.00322
12.82431,-0.00322,0,0.02579,0.00484
12.79385,-0.00322,0,0.02901,0
12.76,-0.00322,0,0.03062,0
12.72615,-0.00967,0,0.03062,-0.00645
12.69231,-0.00161,0,0.03062,0.00806
12.65846,-0.00484,0,0.03223,-0.00323
12.628,-0.00161,0,0.03062,0.00323
12.58739,-0.00322,0,0.02901,-0.00161
12.55354,-0.00484,0,0.03062,-0.00162
12.52646,-0.00484,0,0.03062,0
12.496,-0.00322,0,0.02418,0.00162
12.46215,-0.00484,0,0.03385,-0.00162
12.42154,-0.00806,0,0.03062,-0.00322
12.39108,-0.00484,0,0.02901,0.00322
12.36062,-0.00322,0,0.03062,0.00162
12.32339,-0.00484,0,0.03223,-0.00162
12.29631,-0.00645,0,0.03062,-0.00161
12.26585,-0.00322,0,0.03223,0.00323
12.232,-0.00322,0,0.03062,0
12.19815,0,0,0.03385,0.00322
12.17108,-0.00161,0,0.02579,-0.00161
12.17108,-0.00322,0,0.02901,-0.00161
12.16431,-0.00484,0,0.02418,-0.00162
12.17446,0,0,0.02901,0.00484
12.17108,-0.00161,0,0.02579,-0.00161
12.17108,0,0,0.0274,0.00161
12.17446,-0.00322,0,0.03223,-0.00322
12.17446,-0.00161,0,0.0274,0.00161
12.17108,-0.00161,0,0.0274,0
12.16769,-0.00967,0,0.03062,-0.00806
12.13385,-0.00161,0,0.02901,0.00806
12.10338,0.00322,0,0.02901,0.00483
12.06954,-0.00484,0,0.0274,-0.00806
12.03569,-0.00322,0,0.03062,0.00162
12.00862,0,0,0.02901,0.00322
11.97139,-0.00806,0,0.03223,-0.00806
11.94092,-0.00322,0,0.02901,0.00484
11.91385,-0.00322,0,0.02901,0
11.87662,-0.00645,0,0.02901,-0.00323
11.83939,-0.00806,0,0.03062,-0.00161
11.81569,-0.00484,0,0.02418,0.00322
11.77846,0,0,0.02256,0.00484
11.75815,0,0,0.03062,0
11.72431,-0.00322,0,0.03385,-0.00322
11.69046,-0.00322,0,0.02256,0
11.67015,0,0,0.02901,0.00322
11.66339,-0.00322,0,0.03062,-0.00322
11.66339,-0.00484,0,0.02579,-0.00162
11.66677,-0.00322,0,0.02579,0.00162
11.67015,-0.00484,0,0.02901,-0.00162
11.67015,-0.00322,0,0.02901,0.00162
11.67015,-0.00161,0,0.0274,0.00161
11.67015,0.00161,0,0.02579,0.00322
11.67015,0,0,0.03223,-0.00161
11.66677,-0.00161,0,0.0274,-0.00161
11.67015,0.00322,0,0.03062,0.00483
11.67015,-0.00645,0,0.0274,-0.00967
11.67354,-0.00484,0,0.03062,0.00161
11.66677,-0.00645,0,0.02901,-0.00161
11.67015,-0.00645,0,0.03062,0
11.66339,-0.00806,0,0.02579,-0.00161
11.66677,-0.00484,0,0.02901,0.00322
11.66339,-0.00484,0,0.02579,0
11.66339,-0.00322,0,0.0274,0.00162
11.66339,0.00161,0,0.02418,0.00483
11.66677,0.00161,0,0.02579,0
11.66339,0.00322,0,0.03062,0.00161
11.66339,0.00161,0,0.03062,-0.00161
11.66,-0.00322,0,0.02418,-0.00483
11.66,0,0,0.02418,0.00322
11.66677,0.00161,0,0.02256,0.00161
11.66,0.00322,0,0.0274,0.00161
11.67015,0.00322,0,0.02256,0
11.66677,0.00484,0,0.0274,0.00162
11.66,-0.00806,0,0.03062,-0.0129
11.66,0.00161,0,0.03062,0.00967
11.66677,0.00161,0,0.0274,0
11.66339,-0.00161,0,0.02901,-0.00322
11.65662,-0.00322,0,0.02256,-0.00161
11.65323,0.00161,0,0.02901,0.00483
11.65662,-0.00322,0,0.02418,-0.00483
11.64985,-0.00806,0,0.02901,-0.00484
11.64985,0,0,0.02256,0.00806
11.66677,0.00161,0,0.02901,0.00161
11.64985,-0.00322,0,0.02901,-0.00483
11.64985,-0.00322,0,0.0274,0
11.66,-0.00484,0,0.02256,-0.00162
11.65323,-0.00161,0,0.02418,0.00323
11.64985,0.00161,0,0.02256,0.00322
11.66339,0.00161,0,0.02579,0
11.65323,-0.00322,0,0.02418,-0.00483
11.64646,-0.00161,0,0.02901,0.00161
11.64308,-0.00484,0,0.02901,-0.00323
11.64646,-0.00161,0,0.02579,0.00323
11.64985,-0.00322,0,0.02579,-0.00161
11.64308,-0.00161,0,0.02418,0.00161
11.64308,-0.00645,0,0.02579,-0.00484
11.64646,-0.00322,0,0.02579,0.00323
11.64985,-0.00161,0,0.02418,0.00161
11.63969,-0.00161,0,0.0274,0
11.64646,-0.00322,0,0.03385,-0.00161
11.64308,-0.00161,0,0.0274,0.00161
11.64308,-0.00161,0,0.02256,0
11.64308,-0.00322,0,0.02901,-0.00161
11.63969,0,0,0.02579,0.00322
11.63292,0.00161,0,0.0274,0.00161
11.63631,-0.00161,0,0.03062,-0.00322
11.63969,-0.00484,0,0.03223,-0.00323
11.63292,-0.00484,0,0.02418,0
11.63631,-0.00161,0,0.02418,0.00323
11.64308,0.00161,0,0.02579,0.00322
11.63292,-0.00484,0,0.0274,-0.00645
11.63631,-0.00484,0,0.0274,0
11.63969,-0.00484,0,0.02256,0
11.63631,0,0,0.02579,0.00484
11.62954,0,0,0.03385,0
11.62954,-0.00484,0,0.02579,-0.00484
11.62615,0.00484,0,0.02418,0.00968
11.63969,-0.00322,0,0.02579,-0.00806
11.62615,0,0,0.02418,0.00322
11.63292,0.00161,0,0.02418,0.00161
11.62615,-0.00484,0,0.02418,-0.00645
11.62615,0.00161,0,0.02579,0.00645
11.62954,0.00161,0,0.02579,0
11.62277,0,0,0.02579,-0.00161
11.61938,-0.00161,0,0.02418,-0.00161
11.62277,0,0,0.02095,0.00161
11.62277,-0.00161,0,0.02901,-0.00161
11.62615,0.00161,0,0.02418,0.00322
11.61262,0,0,0.02579,-0.00161
11.61262,-0.00484,0,0.02418,-0.00484
11.61262,-0.00645,0,0.0274,-0.00161
11.61262,-0.00484,0,0.0274,0.00161
11.62277,0,0,0.02418,0.00484
11.616,-0.00645,0,0.0274,-0.00645
11.60923,0,0,0.0274,0.00645
11.60923,0,0,0.02418,0
11.60923,0,0,0.02256,0
11.60923,0,0,0.02901,0
11.60585,-0.00322,0,0.0274,-0.00322
11.60923,-0.00161,0,0.0274,0.00161
11.60585,-0.00161,0,0.0274,0
11.60585,-0.00161,0,0.02579,0
11.60585,-0.00484,0,0.02579,-0.00323
11.60585,-0.00161,0,0.02579,0.00323
11.59908,-0.00645,0,0.02095,-0.00484
11.60923,0.00161,0,0.02418,0.00806
11.60246,-0.00484,0,0.02256,-0.00645
11.59908,0.00161,0,0.02901,0.00645
11.60585,-0.00322,0,0.02256,-0.00483
11.59569,-0.00161,0,0.02256,0.00161
11.59569,0.00161,0,0.02095,0.00322
11.59569,-0.00484,0,0.0274,-0.00645
11.59908,-0.00161,0,0.02579,0.00323
11.59569,-0.00806,0,0.02418,-0.00645
11.59908,-0.00806,0,0.02095,0
11.59569,0,0,0.02579,0.00806
11.59908,-0.00645,0,0.0274,-0.00645
11.59231,0.00322,0,0.02579,0.00967
11.59569,0.00322,0,0.03062,0
11.59569,0,0,0.02256,-0.00322
11.59231,-0.00806,0,0.0274,-0.00806
11.58892,-0.00161,0,0.0274,0.00645
11.58215,0.00161,0,0.03385,0.00322
11.58892,-0.00161,0,0.02256,-0.00322
11.58892,0.00161,0,0.02256,0.00322
11.58892,-0.00322,0,0.0274,-0.00483
11.58554,0.00322,0,0.02095,0.00644
11.58892,-0.00161,0,0.02418,-0.00483
11.58554,0,0,0.01934,0.00161
11.59231,0,0,0.02901,0
11.56862,-0.00161,0,0.02579,-0.00161
11.57539,-0.00161,0,0.02418,0
11.57877,-0.00161,0,0.02256,0
11.57539,0,0,0.02256,0.00161
11.58215,-0.00161,0,0.02901,-0.00161
11.57877,-0.00322,0,0.02418,-0.00161
11.572,0.00161,0,0.02579,0.00483
11.57539,0.00322,0,0.02095,0.00161
11.57539,0,0,0.02901,-0.00322
11.56862,-0.00806,0,0.02579,-0.00806
11.57539,-0.00161,0,0.02579,0.00645
11.56523,-0.00322,0,0.02579,-0.00161
11.56523,0,0,0.02579,0.00322
11.572,0,0,0.0274,0
11.56523,-0.00322,0,0.02901,-0.00322
11.56185,0.00161,0,0.02256,0.00483
11.56523,-0.00645,0,0.0274,-0.00806
11.56185,0,0,0.02579,0.00645
11.56523,0.00161,0,0.02579,0.00161
11.56523,-0.00484,0,0.02418,-0.00645
11.55846,-0.00484,0,0.02256,0
11.56862,-0.00322,0,0.02418,0.00162
11.56523,0,0,0.02579,0.00322
11.55169,-0.00645,0,0.02901,-0.00645
11.55846,-0.00645,0,0.0274,0
11.55846,-0.00484,0,0.02418,0.00161
11.54492,-0.00322,0,0.02901,0.00162
11.56185,0,0,0.02579,0.00322
11.55508,-0.00161,0,0.02256,-0.00161
11.56523,0.00322,0,0.0274,0.00483
11.55508,0.00161,0,0.02256,-0.00161
11.54831,-0.00484,0,0.02901,-0.00645
11.55508,-0.00322,0,0.02418,0.00162
11.55169,-0.00161,0,0.02418,0.00161
11.54492,-0.00645,0,0.02095,-0.00484
11.54492,-0.00645,0,0.02579,0
11.54831,-0.00645,0,0.0274,0
11.54154,0,0,0.01934,0.00645
11.53815,-0.00645,0,0.03223,-0.00645
