../Core/Inc/PCBs/SBC_func.c:33:8:get_V_Hi	16	static
../Core/Inc/PCBs/SBC_func.c:37:9:get_I_Hi	16	static
../Core/Inc/PCBs/SBC_func.c:41:9:get_V_Lo	16	static
../Core/Inc/PCBs/SBC_func.c:45:9:get_I_Lo	16	static
../Core/Inc/PCBs/SBC_func.c:49:8:enable_PWM	8	static
../Core/Inc/PCBs/SBC_func.c:53:8:disable_PWM	8	static
