^C:\USERS\NATASHA\DOCUMENTS\FAKS\OBJEKTNO PROGRAMIRANJE\VJEZBA 1\PROJECT1\PROJECT1\X64\DEBUG\ZAD1.OBJ|C:\USERS\NATASHA\DOCUMENTS\FAKS\OBJEKTNO PROGRAMIRANJE\VJEZBA 1\PROJECT1\PROJECT1\X64\DEBUG\ZAD2.OBJ|C:\USERS\NATASHA\DOCUMENTS\FAKS\OBJEKTNO PROGRAMIRANJE\VJEZBA 1\PROJECT1\PROJECT1\X64\DEBUG\ZAD3.OBJ|C:\USERS\NATASHA\DOCUMENTS\FAKS\OBJEKTNO PROGRAMIRANJE\VJEZBA 1\PROJECT1\PROJECT1\X64\DEBUG\ZAD4.OBJ|C:\USERS\NATASHA\DOCUMENTS\FAKS\OBJEKTNO PROGRAMIRANJE\VJEZBA 1\PROJECT1\PROJECT1\X64\DEBUG\ZAD5.OBJ|C:\USERS\NATASHA\DOCUMENTS\FAKS\OBJEKTNO PROGRAMIRANJE\VJEZBA 1\PROJECT1\PROJECT1\X64\DEBUG\ZAD6.OBJ
C:\PROGRAM FILES (X86)\WINDOWS KITS\10\LIB\10.0.19041.0\UM\X64\KERNEL32.LIB
C:\PROGRAM FILES (X86)\WINDOWS KITS\10\LIB\10.0.19041.0\UM\X64\USER32.LIB
C:\PROGRAM FILES (X86)\WINDOWS KITS\10\LIB\10.0.19041.0\UM\X64\GDI32.LIB
C:\PROGRAM FILES (X86)\WINDOWS KITS\10\LIB\10.0.19041.0\UM\X64\WINSPOOL.LIB
C:\PROGRAM FILES (X86)\WINDOWS KITS\10\LIB\10.0.19041.0\UM\X64\COMDLG32.LIB
C:\PROGRAM FILES (X86)\WINDOWS KITS\10\LIB\10.0.19041.0\UM\X64\ADVAPI32.LIB
C:\PROGRAM FILES (X86)\WINDOWS KITS\10\LIB\10.0.19041.0\UM\X64\SHELL32.LIB
C:\PROGRAM FILES (X86)\WINDOWS KITS\10\LIB\10.0.19041.0\UM\X64\OLE32.LIB
C:\PROGRAM FILES (X86)\WINDOWS KITS\10\LIB\10.0.19041.0\UM\X64\OLEAUT32.LIB
C:\PROGRAM FILES (X86)\WINDOWS KITS\10\LIB\10.0.19041.0\UM\X64\UUID.LIB
C:\PROGRAM FILES (X86)\WINDOWS KITS\10\LIB\10.0.19041.0\UM\X64\ODBC32.LIB
C:\PROGRAM FILES (X86)\WINDOWS KITS\10\LIB\10.0.19041.0\UM\X64\ODBCCP32.LIB
C:\USERS\NATASHA\DOCUMENTS\FAKS\OBJEKTNO PROGRAMIRANJE\VJEZBA 1\PROJECT1\PROJECT1\X64\DEBUG\ZAD1.OBJ
C:\USERS\NATASHA\DOCUMENTS\FAKS\OBJEKTNO PROGRAMIRANJE\VJEZBA 1\PROJECT1\PROJECT1\X64\DEBUG\ZAD2.OBJ
C:\USERS\NATASHA\DOCUMENTS\FAKS\OBJEKTNO PROGRAMIRANJE\VJEZBA 1\PROJECT1\PROJECT1\X64\DEBUG\ZAD3.OBJ
C:\USERS\NATASHA\DOCUMENTS\FAKS\OBJEKTNO PROGRAMIRANJE\VJEZBA 1\PROJECT1\PROJECT1\X64\DEBUG\ZAD4.OBJ
C:\USERS\NATASHA\DOCUMENTS\FAKS\OBJEKTNO PROGRAMIRANJE\VJEZBA 1\PROJECT1\PROJECT1\X64\DEBUG\ZAD5.OBJ
C:\USERS\NATASHA\DOCUMENTS\FAKS\OBJEKTNO PROGRAMIRANJE\VJEZBA 1\PROJECT1\PROJECT1\X64\DEBUG\ZAD6.OBJ
C:\USERS\NATASHA\DOCUMENTS\FAKS\OBJEKTNO PROGRAMIRANJE\VJEZBA 1\PROJECT1\PROJECT1\X64\DEBUG\PROJECT1.ILK
C:\WINDOWS\SYSTEM32\TZRES.DLL
C:\WINDOWS\GLOBALIZATION\SORTING\SORTDEFAULT.NLS
D:\PROGRAMIRANJE\VISUAL STUDIO\VC\TOOLS\MSVC\14.33.31629\LIB\X64\MSVCPRTD.LIB
D:\PROGRAMIRANJE\VISUAL STUDIO\VC\TOOLS\MSVC\14.33.31629\LIB\X64\MSVCRTD.LIB
D:\PROGRAMIRANJE\VISUAL STUDIO\VC\TOOLS\MSVC\14.33.31629\LIB\X64\OLDNAMES.LIB
D:\PROGRAMIRANJE\VISUAL STUDIO\VC\TOOLS\MSVC\14.33.31629\LIB\X64\VCRUNTIMED.LIB
C:\PROGRAM FILES (X86)\WINDOWS KITS\10\LIB\10.0.19041.0\UCRT\X64\UCRTD.LIB
C:\USERS\NATASHA\DOCUMENTS\FAKS\OBJEKTNO PROGRAMIRANJE\VJEZBA 1\PROJECT1\PROJECT1\X64\DEBUG\VC143.PDB
