Division,WeightClassKg,Place,Name,Team,BodyweightKg,Best3SquatKg,Best3BenchKg,Best3DeadliftKg,TotalKg,Equipment,Event,Sex,BirthDate
Girls,56.02,1,Isabel Martinez,Anahuac,54.43,47.63,34.02,61.23,142.88,Single-ply,SBD,F,
Girls,67.36,1,Haylee Bertrand,Kirbyville,60.78,81.65,36.29,90.72,208.65,Single-ply,SBD,F,
Girls,100.02,1,Grace Willis,Kirbyville,92.08,133.81,56.7,122.47,312.98,Single-ply,SBD,F,
Girls,100.02,2,Bianca Aguilar,Hull-Daisetta,99.34,92.99,56.7,97.52,247.21,Single-ply,SBD,F,
Girls,117.71,1,Sarah Taylor,Hull-Daisetta,109.77,102.06,49.9,104.33,256.28,Single-ply,SBD,F,
