Name,Place,Division,Sex,Equipment,State,WeightClassKg,BodyweightKg,Age,Best3SquatKg,Squat4Kg,Best3BenchKg,Bench4Kg,Best3DeadliftKg,Deadlift4Kg,TotalKg,Event
Melissa Brunkal,DQ,Juniors 16-17,F,Raw,CA,52,50.21,16,72.5,,-45,,102.5,,,SBD
Jedda Moua,1,Juniors 13-15,F,Raw,CA,60,56.52,14,72.5,,32.5,,72.5,,177.5,SBD
Viviana Avila,1,Juniors 16-17,F,Raw,CA,67.5,64.77,17,85,,37.5,,97.5,,220,SBD
Tatiana Gallegos,1,Juniors 18-19,F,Raw,CA,67.5,60.96,18,117.5,,55,,137.5,,310,SBD
Cynthia Leu,1,Juniors 20-23,F,Raw,CA,67.5,60.87,22,127.5,,62.5,,152.5,,342.5,SBD
Paola Padilla,1,Open,F,Raw,CA,60,58.24,30,55,,40,,80,,175,SBD
Erika Hipwell,1,Open,F,Raw,CA,67.5,67.13,26,115,,82.5,,155,,352.5,SBD
Falon Gallipeau,2,Open,F,Raw,CA,67.5,61.14,27,110,,72.5,,145,,327.5,SBD
Tina Truong,3,Open,F,Raw,CA,67.5,63.09,27,120,,55,,145,,320,SBD
Tatiana Gallegos,4,Open,F,Raw,CA,67.5,60.96,18,117.5,,55,,137.5,,310,SBD
Nita Horton,5,Open,F,Raw,CA,67.5,67.31,30,95,,55,,132.5,,282.5,SBD
Deziree Slusher,6,Open,F,Raw,CA,67.5,66.50,34,57.5,,45,,97.5,,200,SBD
Mary Case,1,Masters 60-64,F,Raw,CA,75,71.26,60,105,,77.5,,127.5,,310,SBD
Philip Vang,1,Juniors 18-19,M,Raw,CA,52,49.26,18,125,,87.5,,140,,352.5,SBD
Adam Xiong,1,Juniors 16-17,M,Raw,CA,56,54.52,17,112.5,,82.5,,152.5,,347.5,SBD
Seyonn Chin,1,Juniors 20-23,M,Raw,CA,56,55.88,21,130,,100,,187.5,,417.5,SBD
Joshua Vang,1,Juniors 16-17,M,Raw,CA,60,59.15,16,102.5,,70,,137.5,,310,SBD
James Young,1,Juniors 18-19,M,Raw,CA,60,56.79,19,97.5,,70,,125,,292.5,SBD
Wallson Xiong,1,Juniors 18-19,M,Raw,CA,67.5,64.36,18,132.5,,90,,182.5,,405,SBD
Galen King,DQ,Juniors 18-19,M,Raw,CA,67.5,66.04,19,140,,-100,,185,,,SBD
Joe Seiden,1,Juniors 20-23,M,Raw,CA,67.5,67.40,22,190,,135,,225,,550,SBD
Josh Moore,1,Juniors 20-23,M,Raw,CA,75,72.80,23,182.5,,150,,227.5,,560,SBD
Chad Kumabe,2,Juniors 20-23,M,Raw,CA,75,73.12,20,160,,112.5,,237.5,,510,SBD
Nathan Morace,1,Juniors 20-23,M,Raw,CA,82.5,79.06,22,220,,142.5,,227.5,,590,SBD
Tanner Shephard,1,Juniors 20-23,M,Raw,CA,90,89.63,20,185,,137.5,,242.5,,565,SBD
Francisco Pacheco,1,Juniors 13-15,M,Raw,CA,100,98.70,15,152.5,,115,,185,,452.5,SBD
Bobby Vang,1,Juniors 16-17,M,Raw,CA,110,103.60,17,137.5,,85,,170,,392.5,SBD
Mason Merilles,1,Juniors 18-19,M,Raw,CA,110,107.50,19,262.5,,150,,285,,697.5,SBD
Michael Lucero,2,Juniors 18-19,M,Raw,CA,110,103.78,19,200,,145,,225,,570,SBD
David Aguayo,1,Open,M,Raw,CA,60,58.01,27,92.5,,82.5,,150,,325,SBD
Joe Seiden,1,Open,M,Raw,CA,67.5,67.40,22,190,,135,,225,,550,SBD
Brandon Collar,1,Open,M,Raw,NV,75,74.93,29,147.5,,137.5,,202.5,,487.5,SBD
Eric Santos,2,Open,M,Raw,CA,75,72.44,25,145,,107.5,,190,,442.5,SBD
Emmauel Adeagbo,1,Open,M,Raw,CA,82.5,82.10,27,242.5,,150,,287.5,,680,SBD
Stephen Young,2,Open,M,Raw,CA,82.5,82.10,34,165,,122.5,,212.5,,500,SBD
Gevorg Minasyan,3,Open,M,Raw,CA,82.5,80.92,25,147.5,,120,,212.5,,480,SBD
Gustavo Corona,4,Open,M,Raw,OR,82.5,82.19,33,152.5,,105,,160,,417.5,SBD
Jeff Justo,1,Open,M,Raw,CA,90,89.99,27,275,,145,,280,,700,SBD
Mike Galindo,2,Open,M,Raw,CA,90,89.18,28,212.5,,175,,257.5,,645,SBD
Matthew Council,3,Open,M,Raw,CA,90,89.99,26,232.5,,147.5,,257.5,,637.5,SBD
Russell Bartholomew,4,Open,M,Raw,CA,90,86.55,26,197.5,,127.5,,227.5,,552.5,SBD
Alex Campbell #1,5,Open,M,Raw,CA,90,89.54,33,182.5,,160,,170,,512.5,SBD
Jovani Lechadores,1,Open,M,Raw,CA,100,95.62,25,237.5,,192.5,,275,,705,SBD
Eugene Chuvyrov,2,Open,M,Raw,CA,100,98.75,38,210,,162.5,,260,,632.5,SBD
Tim Hartley,3,Open,M,Raw,CA,100,90.54,25,207.5,,125,,257.5,,590,SBD
Steve Hartley,1,Open,M,Raw,CA,110,107.37,23,215,,157.5,,272.5,,645,SBD
Jessie Ablang,1,Open,M,Raw,CA,125,123.83,34,280,,205,,300,,785,SBD
Joey Tango,2,Open,M,Raw,CA,125,121.43,28,300,,165,,305,,770,SBD
Javier Garcia Jr,3,Open,M,Raw,CA,125,116.39,24,260,,185,,290,,735,SBD
Michael Carter,1,Open,M,Raw,CA,140+,177.94,33,335,,202.5,,327.5,,865,SBD
Mary Case,1,Open,F,Wraps,CA,75,71.26,60,105,,77.5,,127.5,,310,SBD
Robertson Yang,1,Juniors 18-19,M,Wraps,CA,67.5,63.78,18,165,,77.5,,180,,422.5,SBD
Jarred Allen,1,Juniors 20-23,M,Wraps,CA,75,74.84,21,192.5,,127.5,,210,,530,SBD
Manuel Pina,DQ,Juniors 20-23,M,Wraps,CA,75,73.66,22,-172.5,,147.5,,182.5,,,SBD
Tony Mai #2,1,Open,M,Wraps,CA,90,89.54,28,265,,115,,265,,645,SBD
Bill Newman,1,Open,M,Wraps,CA,140,135.81,30,335,,220,,332.5,,887.5,SBD
Robert Dicochea,1,Open,M,Wraps,CA,140+,149.64,27,320,,185,,292.5,,797.5,SBD
Adam Huerta,1,Submasters 35-39,M,Wraps,CA,125,120.20,38,237.5,,200,,245,,682.5,SBD
Cory Scholtes,1,Masters 50-54,M,Wraps,CA,75,72.26,52,85,,50,,137.5,,272.5,SBD
David Case,1,Masters 60-64,M,Wraps,CA,100,99.97,64,105,,82.5,,162.5,,350,SBD
Darren Monahan,1,Masters 45-49,M,Wraps,CA,125,122.92,49,272.5,,200,,265,,737.5,SBD
Bill McEwen,1,Masters 60-64,M,Wraps,CA,125,115.62,60,160,,117.5,,195,,472.5,SBD
Rae Stewart,1,Masters 50-54,M,Wraps,CA,140,137.12,51,227.5,,152.5,,270,,650,SBD
Thomas Truong,1,Juniors 20-23,M,Single-ply,CA,75,73.66,22,165,167.5,117.5,,237.5,242.5,520,SBD
Raphael Nguyen,1,Juniors 20-23,M,Single-ply,CA,82.5,80.33,22,155,,127.5,,235,,517.5,SBD
Thomas Truong,1,Open,M,Single-ply,CA,75,73.66,22,165,,117.5,,237.5,,520,SBD
Thomas Hussey,1,Open,M,Single-ply,NV,82.5,81.83,35,227.5,,142.5,,227.5,,597.5,SBD
Raphael Nguyen,2,Open,M,Single-ply,CA,82.5,80.33,22,155,,127.5,,235,,517.5,SBD
Thomas Hussey,1,Submasters 35-39,M,Single-ply,NV,82.5,81.83,35,227.5,,142.5,,227.5,,597.5,SBD
Jordan De Avila,1,Juniors 13-15,M,Raw,CA,52,48.53,14,,,50,,,,50,B
Rio Bettinelli,1,Juniors 18-19,M,Raw,CA,75,72.53,19,,,107.5,,,,107.5,B
Nathaniel Andrade,1,Juniors 20-23,M,Raw,CA,75,74.57,21,,,157.5,,,,157.5,B
Aaron Sheiman,1,Open,M,Raw,CA,90,88.22,31,,,110,,,,110,B
Dennis Reneau,1,Open,M,Raw,CA,110,110.00,42,,,212.5,,,,212.5,B
Don Ehasz,2,Open,M,Raw,CA,110,107.23,29,,,160,,,,160,B
Dennis Reneau,1,Masters 40-44,M,Raw,CA,110,110.00,42,,,212.5,,,,212.5,B
Brett Deeds,1,Masters 40-44,M,Raw,CA,125,117.57,44,,,165,,,,165,B
Thomas Truong,1,Juniors 20-23,M,Single-ply,CA,75,73.66,22,,,117.5,,,,117.5,B
Raphael Nguyen,1,Juniors 20-23,M,Single-ply,CA,82.5,80.33,22,,,127.5,,,,127.5,B
Roger Kunz,1,Masters 70-74,M,Single-ply,CA,100,94.44,74,,,112.5,115,,,112.5,B
Victor Bernazzani,1,Masters 55-59,M,Single-ply,CA,110,104.42,56,,,170,,,,170,B
Kim Maslana,1,Open,F,Multi-ply,CA,56,54.70,52,,,60,62.5,,,60,B
Janine Jadallah,1,Open,F,Multi-ply,CA,67.5,64.68,49,,,87.5,88,,,87.5,B
Kim Maslana,1,Masters 50-54,F,Multi-ply,CA,56,54.70,52,,,60,62.5,,,60,B
Janine Jadallah,1,Masters 45-49,F,Multi-ply,CA,67.5,64.68,49,,,87.5,88,,,87.5,B
Tayah Basped,1,Juniors 13-15,F,Raw,CA,67.5,63.59,14,,,,,125,,125,D
Nita Horton,1,Open,F,Raw,CA,67.5,67.31,30,,,,,132.5,,132.5,D
Maria Dwyer,1,Submasters 35-39,F,Raw,CA,60,59.06,38,,,,,110,,110,D
Tracey Basped,1,Submasters 35-39,F,Raw,CA,90+,119.84,38,,,,,142.5,,142.5,D
Jordan De Avila,1,Juniors 13-15,M,Raw,CA,52,48.53,14,,,,,110,,110,D
Aaron Sheiman,1,Open,M,Raw,CA,90,88.22,31,,,,,192.5,,192.5,D
Brett Deeds,1,Masters 40-44,M,Raw,CA,125,117.57,44,,,,,237.5,,237.5,D
Rae Stewart,1,Masters 50-54,M,Raw,CA,140,137.12,51,,,,,270,,270,D
Thomas Truong,1,Juniors 20-23,M,Single-ply,CA,75,73.66,22,,,,,237.5,242.5,237.5,D
Raphael Nguyen,1,Juniors 20-23,M,Single-ply,CA,82.5,80.33,22,,,,,235,,235,D
Kim Maslana,1,Open,F,Multi-ply,CA,56,54.70,52,,,,,85,92.5,85,D
Janine Jadallah,1,Open,F,Multi-ply,CA,67.5,64.68,49,,,,,147.5,,147.5,D
Kim Maslana,1,Masters 50-54,F,Multi-ply,CA,56,54.70,52,,,,,85,92.5,85,D
Janine Jadallah,1,Masters 45-49,F,Multi-ply,CA,67.5,64.68,49,,,,,147.5,,147.5,D
