Division,WeightClassKg,Place,Name,Team,BodyweightKg,Best3SquatKg,Best3BenchKg,Best3DeadliftKg,TotalKg,Equipment,Event,Sex,BirthDate
Boys,51.71,1,Cooper Schiller,Rogers,50.3,127.01,65.77,129.27,322.05,Single-ply,SBD,M,
Boys,55.79,1,Keegan Mantanona,Salado,54.61,127.01,72.57,129.27,328.85,Single-ply,SBD,M,
Boys,55.79,2,Matthew Woddall,Holland,55.57,86.18,47.63,102.06,235.87,Single-ply,SBD,M,
Boys,59.87,1,Alex Vargas,Rogers,58.65,154.22,95.25,140.61,390.09,Single-ply,SBD,M,
Boys,67.13,1,Bryan Thuy,Rogers,66.77,176.9,86.18,163.29,426.38,Single-ply,SBD,M,
Boys,67.13,2,Kye Hayes,Salado,65.77,147.42,97.52,156.49,401.43,Single-ply,SBD,M,
Boys,67.13,3,Seth Jayaprabhu,Holland,63.46,156.49,77.11,163.29,396.89,Single-ply,SBD,M,
Boys,67.13,4,Edgar de la Torre,Holland,65.23,138.35,72.57,163.29,374.21,Single-ply,SBD,M,
Boys,67.13,5,Byson Taylor,Holland,60.46,142.88,81.65,147.42,371.95,Single-ply,SBD,M,
Boys,74.84,1,John Hill,Rogers,74.12,201.85,111.13,201.85,514.83,Single-ply,SBD,M,
Boys,74.84,2,Braydon Sumners,Salado,73.75,158.76,115.67,156.49,430.91,Single-ply,SBD,M,
Boys,74.84,3,Aydin Keating,Salado,70.94,158.76,92.99,172.37,424.11,Single-ply,SBD,M,
Boys,82.1,1,Cooper Carroll,Salado,79.33,204.12,104.33,195.04,503.49,Single-ply,SBD,M,
Boys,82.1,2,Albert Martinez,Holland,78.65,172.37,99.79,174.63,446.79,Single-ply,SBD,M,
Boys,82.1,3,Cooper Scott,Salado,76.25,167.83,111.13,163.29,442.25,Single-ply,SBD,M,
Boys,89.81,1,Jayten Burt,Salado,89.18,195.04,124.74,185.97,505.76,Single-ply,SBD,M,
Boys,89.81,2,Waylon Padeleski,Salado,83.64,190.51,122.47,183.7,496.68,Single-ply,SBD,M,
Boys,89.81,3,Josh Whisenhunt,Holland,83.46,195.04,122.47,163.29,480.81,Single-ply,SBD,M,
Boys,89.81,4,Colton Cargill,Holland,83.46,181.44,104.33,192.78,478.54,Single-ply,SBD,M,
Boys,89.81,5,Javier Hernandez,Holland,84.5,156.49,102.06,170.1,428.64,Single-ply,SBD,M,
Boys,89.81,6,Cavahn Wilson,Salado,85.68,151.95,102.06,156.49,410.5,Single-ply,SBD,M,
Boys,89.81,7,Luke Hutka,Holland,89.04,154.22,92.99,161.03,408.23,Single-ply,SBD,M,
Boys,99.79,1,Mason Davis,Rogers,94.76,249.48,140.61,215.46,605.55,Single-ply,SBD,M,
Boys,99.79,2,Aiden Wilson,Salado,93.89,242.67,131.54,226.8,601.01,Single-ply,SBD,M,
Boys,99.79,3,Blake Volk,Salado,91.94,204.12,129.27,188.24,521.63,Single-ply,SBD,M,
Boys,99.79,4,Dray McLane,Salado,97.84,199.58,113.4,195.04,508.02,Single-ply,SBD,M,
Boys,99.79,5,Rj Dolgener,Rogers,98.84,188.24,108.86,185.97,483.08,Single-ply,SBD,M,
Boys,99.79,6,Ethan Mann,Holland,89.95,195.04,97.52,174.63,467.2,Single-ply,SBD,M,
Boys,99.79,7,Jaime Reyna,Rogers,90.08,185.97,99.79,170.1,455.86,Single-ply,SBD,M,
Boys,99.79,DQ,Ethan Hohhertz,Holland,92.22,149.69,,136.08,,Single-ply,SBD,M,
Boys,109.77,1,Garrett Combs,Salado,106,176.9,113.4,176.9,467.2,Single-ply,SBD,M,
Boys,124.74,1,Avery Womack,Salado,117.89,272.16,163.29,217.72,653.17,Single-ply,SBD,M,
Boys,124.74,2,Kade Hayes,Salado,113.76,188.24,122.47,158.76,469.47,Single-ply,SBD,M,
Boys,124.74,3,Tyler Shelton,Rogers,113.62,188.24,102.06,174.63,464.93,Single-ply,SBD,M,
Boys,124.74,4,Ethan Glenn,Rogers,113.53,142.88,68.04,124.74,335.66,Single-ply,SBD,M,
Boys,139.71,1,Marshall Mays,Holland,136.71,249.48,154.22,231.33,635.03,Single-ply,SBD,M,
Boys,139.71,2,Gavyn Keyser,Salado,130.14,244.94,167.83,217.72,630.49,Single-ply,SBD,M,
Boys,139.71+,1,Tre'Vay Brown,Holland,144.38,181.44,113.4,156.49,451.32,Single-ply,SBD,M,
Boys,,NS,Jc Chaney,Holland,,,,,,Single-ply,SBD,M,
Boys,,NS,Ryland Woods,Salado,,,,,,Single-ply,SBD,M,
Boys,,NS,Dillion Combs,Salado,,,,,,Single-ply,SBD,M,
