Name,Division,BodyweightKg,WeightClassKg,Sex,BirthYear,Squat1Kg,Squat2Kg,Squat3Kg,Best3SquatKg,Bench1Kg,Bench2Kg,Bench3Kg,Best3BenchKg,Deadlift1Kg,Deadlift2Kg,Deadlift3Kg,Best3DeadliftKg,TotalKg,Place,Event,Equipment,BirthDate
Lisa Tran #1,Juniors,54.7,57,F,1999,90,100,-110,100,52.5,57.5,60,60,130,140,147.5,147.5,307.5,1,SBD,Raw,
Viola Jokudu,Juniors,68.7,69,F,1999,100,110,115,115,65,70,75,75,130,140,-150,140,330,1,SBD,Raw,
Lea Anne Wardle,Juniors,68.9,69,F,1998,100,105,110,110,55,60,62.5,62.5,105,115,125,125,297.5,2,SBD,Raw,
Sarah Hlaing,Open,43.35,47,F,1997,75,82.5,87.5,87.5,37.5,42.5,45,45,100,107.5,115,115,247.5,1,SBD,Raw,
Jessica Haddad,Open,62.4,63,F,1987,120,-132.5,135,135,60,67.5,70,70,140,150,155,155,360,1,SBD,Raw,
Emily Lai,Open,62.25,63,F,1992,125,-135,-135,125,60,65,-67.5,65,130,140,145,145,335,2,SBD,Raw,
Patricia Pereira-Boustany,Open,59.2,63,F,1984,85,95,100,100,-45,47.5,50,50,120,130,140,140,290,3,SBD,Raw,
Suji Jeon,Open,68.05,69,F,1995,100,110,120,120,45,50,52.5,52.5,110,120,130,130,302.5,1,SBD,Raw,
Najat Khoury,Open,146.3,84+,F,1982,160,170,180,180,80,87.5,93,93,160,175,190,190,463,1,SBD,Raw,
Kara King,M2,56.65,57,F,1970,92.5,103,,103,60,62.5,65,65,115,125,133,133,301,1,SBD,Raw,
Brooke Bailey,M2,73.85,76,F,1970,70,80,87.5,87.5,50,60,65,65,80,92.5,102.5,102.5,255,1,SBD,Raw,
Christian Nguyen,Juniors,58.75,59,M,2001,140,150,155,155,75,80,82.5,82.5,165,175,182.5,182.5,420,1,SBD,Raw,
Anthony Hoang,Sub-Juniors,73,74,M,2003,120,135,152.5,152.5,75,87.5,-100,87.5,175,185,-195,185,425,1,SBD,Raw,
Benjamin Ou Yang,Sub-Juniors,69.75,74,M,2004,127.5,135,140,140,85,92.5,-100,92.5,-175,175,190,190,422.5,2,SBD,Raw,
Jeffrey Lin #1,Sub-Juniors,72.5,74,M,2003,25,,,25,40,,,40,75,-90,,75,140,3,SBD,Raw,
Lenex Lu,Juniors,73.35,74,M,2000,175,180,200,200,117.5,122.5,132.5,132.5,217.5,230,-240,230,562.5,1,SBD,Raw,
Matthew Armstrong,Juniors,72.75,74,M,2000,170,180,190,190,100,107.5,-112.5,107.5,207.5,215,222.5,222.5,520,2,SBD,Raw,
Ryan Wu,Juniors,73.05,74,M,2000,170,182.5,-190,182.5,115,125,130,130,205,-215,,205,517.5,3,SBD,Raw,
Tony Mai #1,Juniors,72.35,74,M,1999,160,172.5,180,180,95,102.5,107.5,107.5,190,207.5,215,215,502.5,4,SBD,Raw,
Anthony Badra,Juniors,73.15,74,M,2000,147.5,155,160,160,92.5,97.5,102.5,102.5,152.5,162.5,167.5,167.5,430,5,SBD,Raw,
Tan Thong Jason Vo,Juniors,73.4,74,M,1998,115,127.5,140,140,85,90,92.5,92.5,-180,180,190,190,422.5,6,SBD,Raw,
Nicholas Christodoulou,Juniors,73,74,M,1998,120,,,120,90,,,90,170,-180,,170,380,7,SBD,Raw,
Raymond Prasetya,Open,65.1,66,M,1997,140,-150,-150,140,85,90,95,95,185,197.5,210,210,445,1,SBD,Raw,
Hussien Alaouie,Juniors,82.73,83,M,1998,235,247.5,-257.5,247.5,165,175,-182.5,175,257.5,272.5,-282.5,272.5,695,1,SBD,Raw,
Josh Johnstone,Juniors,81.15,83,M,2000,207.5,215,,215,127.5,135,140,140,250,-265,265,265,620,2,SBD,Raw,
Dylan Pham,Juniors,78.8,83,M,2002,140,150,160,160,90,95,100,100,180,190,200,200,460,3,SBD,Raw,
Ewen Belgrove,Juniors,92.8,93,M,2000,290,300,,300,160,170.5,,170.5,240,-255,-255,240,710.5,1,SBD,Raw,
Andrew Stevenson,Juniors,91.5,93,M,1999,160,180,200,200,90,97.5,105,105,160,182.5,202.5,202.5,507.5,2,SBD,Raw,
Michael Walsh,Open,70.85,74,M,1992,150,157.5,167.5,167.5,110,117.5,125,125,210,217.5,225,225,517.5,1,SBD,Raw,
Tait Brown,Open,67.5,74,M,1989,145,155,165,165,95,105,110,110,150,165,175,175,450,2,SBD,Raw,
Nealan Vettivelu,Open,72.2,74,M,1993,140,150,160,160,70,77.5,85,85,165,177.5,190,190,435,3,SBD,Raw,
Jacob Mose,Open,82.75,83,M,1991,220,232.5,,232.5,137.5,147.5,152.5,152.5,230,245,262.5,262.5,647.5,1,SBD,Raw,
Blake Moore,Open,82.3,83,M,1995,195,210,-220,210,125,132.5,137.5,137.5,220,235,245,245,592.5,2,SBD,Raw,
Angus McDonald,Open,82.1,83,M,1996,185,197.5,-205,197.5,115,120,125,125,210,220,227.5,227.5,550,3,SBD,Raw,
Tai Uong,Open,82.05,83,M,1994,170,180,-190,180,115,122.5,130,130,210,220,230,230,540,4,SBD,Raw,
Laurence Nguyen,Open,92.5,93,M,1988,200,210,220,220,105,115,125,125,220,-240,240,240,585,1,SBD,Raw,
Zak Bosco,Open,91.8,93,M,1995,175,190,195,195,130,137.5,140,140,200,215,222.5,222.5,557.5,2,SBD,Raw,
Stacey Borlas,Open,91.85,93,M,1992,175,190,200,200,107.5,117.5,120,120,207.5,220,230,230,550,3,SBD,Raw,
Kenan Ozdemir,Open,90.8,93,M,1998,-180,185,192.5,192.5,105,115,120,120,180,192.5,202.5,202.5,515,4,SBD,Raw,
Thulani Gapara,Open,103,105,M,1986,200,210,220,220,142.5,150,155,155,245,260,275,275,650,1,SBD,Raw,
Ben Hidalgo,Open,101.25,105,M,1992,200,210,220,220,130,135,142.5,142.5,240,260,275,275,637.5,2,SBD,Raw,
Zachariah van Camp,Open,98.6,105,M,1992,175,187.5,195,195,120,127.5,132.5,132.5,220,237.5,245,245,572.5,3,SBD,Raw,
Nick Belgrove,M2,91.5,93,M,1969,120,-130,130,130,110,120,-125,120,180,190,-195,190,440,1,SBD,Raw,
Andrew Caltabiano,Open,123.55,120+,M,1981,,,,,210,-220,230,230,,,,,230,1,B,Raw,
