Division,WeightClassKg,Place,Name,Team,BodyweightKg,Best3SquatKg,Best3BenchKg,Best3DeadliftKg,TotalKg,Equipment,Event,Sex
Girls,44.23,1,Mari Lopez,Corpus Christi West Oso,41.82,122.47,52.16,140.61,315.25,Single-ply,SBD,F
Girls,44.23,2,Gabby Zarate,San Diego,44.09,111.13,49.9,117.93,278.96,Single-ply,SBD,F
Girls,44.23,3,Amber Gallegos,San Diego,42.46,102.06,45.36,104.33,251.74,Single-ply,SBD,F
Girls,44.23,4,Savannah Sandoval,Santa Gertrudis Academy,43.27,90.72,47.63,102.06,240.4,Single-ply,SBD,F
Girls,44.23,5,Jessica Gallegos,Laredo Johnson,43.82,90.72,47.63,102.06,240.4,Single-ply,SBD,F
Girls,44.23,6,Gabby Garza,Corpus Christi Tuloso-Midway,43.64,81.65,38.56,102.06,222.26,Single-ply,SBD,F
Girls,44.23,7,Vielka Rivera,Zapata,44.09,79.38,36.29,102.06,217.72,Single-ply,SBD,F
Girls,44.23,8,Alexis Benavides,Alice,41.55,83.91,36.29,88.45,208.65,Single-ply,SBD,F
Girls,44.23,9,Lari Contreras,San Diego,42.64,97.52,31.75,79.38,208.65,Single-ply,SBD,F
Girls,44.23,DQ,Myndi Garcia,Corpus Christi Tuloso-Midway,44.09,104.33,,,,Single-ply,SBD,F
Girls,47.85,1,Bri Hernandez,Corpus Christi West Oso,46.99,136.08,65.77,136.08,337.93,Single-ply,SBD,F
Girls,47.85,2,Reina de la Paz,Santa Gertrudis Academy,47.08,120.2,58.97,122.47,301.64,Single-ply,SBD,F
Girls,47.85,3,Mariah Alaniz,Freer,47.81,124.74,52.16,120.2,297.1,Single-ply,SBD,F
Girls,47.85,4,Stephany Villarreal,Zapata,47.26,106.59,70.31,117.93,294.84,Single-ply,SBD,F
Girls,47.85,5,Nyelli Garza,Hebbronville,47.26,104.33,47.63,129.27,281.23,Single-ply,SBD,F
Girls,47.85,6,Ashley Rios,Corpus Christi Tuloso-Midway,47.63,99.79,45.36,113.4,258.55,Single-ply,SBD,F
Girls,47.85,7,Ayssa Hinojosa,Hebbronville,47.67,102.06,36.29,120.2,258.55,Single-ply,SBD,F
Girls,47.85,8,Savanna Sanchez,Benavides,46.72,95.25,40.82,115.67,251.74,Single-ply,SBD,F
Girls,47.85,9,Zarina Molina,Hebbronville,46.72,86.18,38.56,104.33,229.06,Single-ply,SBD,F
Girls,47.85,10,Abril Lazaro,Ingleside,47.08,92.99,38.56,83.91,215.46,Single-ply,SBD,F
Girls,47.85,11,Arianna Medellin,Hebbronville,47.63,77.11,29.48,74.84,181.44,Single-ply,SBD,F
Girls,47.85,12,Jessandra Ronje,Bishop,44.91,61.23,38.56,72.57,172.37,Single-ply,SBD,F
Girls,47.85,DQ,Priscilla Herrera,Laredo Cigarroa,44.81,,,,,Single-ply,SBD,F
Girls,47.85,DQ,Leslie Martinez,Laredo Martin,45,,,,,Single-ply,SBD,F
Girls,51.94,1,Mia Reyes,Corpus Christi Tuloso-Midway,51.53,161.03,65.77,147.42,374.21,Single-ply,SBD,F
Girls,51.94,2,Hope Davila,Corpus Christi Tuloso-Midway,51.26,161.03,61.23,145.15,367.41,Single-ply,SBD,F
Girls,51.94,3,Mireya Cantu,Hebbronville,51.75,120.2,61.23,108.86,290.3,Single-ply,SBD,F
Girls,51.94,4,Heather Rios,Corpus Christi London,51.35,104.33,49.9,111.13,265.35,Single-ply,SBD,F
Girls,51.94,5,Daniela Aguilar,Hebbronville,51.8,108.86,54.43,102.06,265.35,Single-ply,SBD,F
Girls,51.94,DQ,Jaqueline Arizola,Laredo Martin,51.62,,,,,Single-ply,SBD,F
Girls,51.94,DQ,María Rivera,Laredo Martin,48.99,,,,,Single-ply,SBD,F
Girls,51.94,DQ,Leisie Guerra,Laredo Martin,51.35,,,,,Single-ply,SBD,F
Girls,51.94,DQ,Dashane Atkinson,Hebbronville,51.44,115.67,63.5,,,Single-ply,SBD,F
Girls,56.02,1,Bailey Pastrano,San Diego,54.57,142.88,74.84,154.22,371.95,Single-ply,SBD,F
Girls,56.02,2,Madison Salinas,Hebbronville,55.93,133.81,68.04,145.15,347,Single-ply,SBD,F
Girls,56.02,3,Carolina Flores,Hebbronville,54.07,145.15,58.97,140.61,344.73,Single-ply,SBD,F
Girls,56.02,4,Caitlin Berry #1,Bishop,52.71,136.08,79.38,127.01,342.46,Single-ply,SBD,F
Girls,56.02,5,Makayla Salaiz,San Diego,55.52,140.61,61.23,140.61,342.46,Single-ply,SBD,F
Girls,56.02,6,Maryanna Gavilanes,Zapata,54.79,127.01,68.04,142.88,337.93,Single-ply,SBD,F
Girls,56.02,7,Zoey Cappleman,Ingleside,55.88,113.4,54.43,117.93,285.76,Single-ply,SBD,F
Girls,56.02,8,Emma Tovar,Orange Grove,53.07,124.74,54.43,104.33,283.5,Single-ply,SBD,F
Girls,56.02,9,Bethany Dorantes,Corpus Christi West Oso,51.98,95.25,45.36,113.4,254.01,Single-ply,SBD,F
Girls,56.02,10,Kyla Beard,Corpus Christi London,55.97,90.72,36.29,102.06,229.06,Single-ply,SBD,F
Girls,56.02,11,Aylin Saenz,Falfurrias,53.25,90.72,43.09,90.72,224.53,Single-ply,SBD,F
Girls,56.02,12,Haileylashay Bueno,Banquete,55.97,70.31,31.75,86.18,188.24,Single-ply,SBD,F
Girls,56.02,13,Asia Ngo,Orange Grove,55.52,117.93,,,117.93,Single-ply,S,F
Girls,56.02,DQ,Miranda DeLeon,Ingleside,55.97,,,,,Single-ply,SBD,F
Girls,60.1,1,Julianna Perez,Corpus Christi Tuloso-Midway,59.24,163.29,77.11,154.22,394.63,Single-ply,SBD,F
Girls,60.1,2,Raina Rivera,Bishop,59.33,136.08,70.31,131.54,337.93,Single-ply,SBD,F
Girls,60.1,3,Ashley Cuellar,Zapata,59.06,131.54,81.65,120.2,333.39,Single-ply,SBD,F
Girls,60.1,4,McKenzie O'Neal,Corpus Christi London,59.24,138.35,63.5,113.4,315.25,Single-ply,SBD,F
Girls,60.1,5,Jasmine Hernandez,Alice,58.97,124.74,54.43,127.01,306.17,Single-ply,SBD,F
Girls,60.1,6,Mea Villarreal,Mathis,59.6,113.4,68.04,124.74,306.17,Single-ply,SBD,F
Girls,60.1,7,Desori Garcia,Zapata,59.42,113.4,68.04,120.2,301.64,Single-ply,SBD,F
Girls,60.1,8,Madison Lopez,Hebbronville,60.01,127.01,47.63,115.67,290.3,Single-ply,SBD,F
Girls,60.1,9,Evelyn Guerra,Benavides,58.69,102.06,54.43,122.47,278.96,Single-ply,SBD,F
Girls,60.1,DQ,Bridget Gonzalez,Laredo Martin,59.96,,,,,Single-ply,SBD,F
Girls,67.36,1,Andrea Montes,Zapata,66.77,154.22,77.11,158.76,390.09,Single-ply,SBD,F
Girls,67.36,2,Miranda Reyes,Corpus Christi Tuloso-Midway,60.6,140.61,68.04,151.95,360.61,Single-ply,SBD,F
Girls,67.36,3,Alexia Cadena,San Diego,65.59,147.42,65.77,145.15,358.34,Single-ply,SBD,F
Girls,67.36,4,Evelyn Gonzalez,Laredo United,66.13,142.88,58.97,149.69,351.53,Single-ply,SBD,F
Girls,67.36,5,Cassandra Rangel,Corpus Christi West Oso,66.77,142.88,65.77,142.88,351.53,Single-ply,SBD,F
Girls,67.36,6,Jolynn Moreno,Hebbronville,65.77,149.69,61.23,122.47,333.39,Single-ply,SBD,F
Girls,67.36,7,Karina Guzman,Zapata,64.68,127.01,77.11,117.93,322.05,Single-ply,SBD,F
Girls,67.36,8,Courtney Lamontange,Corpus Christi Tuloso-Midway,64.41,113.4,63.5,140.61,317.51,Single-ply,SBD,F
Girls,67.36,9,Klarissa Gonzalez,Laredo Johnson,61.33,115.67,56.7,136.08,308.44,Single-ply,SBD,F
Girls,67.36,10,Sariana Trevinio,Corpus Christi West Oso,63.87,108.86,58.97,138.35,306.17,Single-ply,SBD,F
Girls,67.36,11,Kierra Duhart,Ingleside,66.22,124.74,52.16,129.27,306.17,Single-ply,SBD,F
Girls,67.36,12,Ashley Ramirez #2,Zapata,63.5,115.67,63.5,124.74,303.91,Single-ply,SBD,F
Girls,67.36,13,Lilly Baird,Santa Gertrudis Academy,63.5,117.93,52.16,104.33,274.42,Single-ply,SBD,F
Girls,67.36,14,Aylin Navarro,Ben Bolt-Palito Blanco,66.5,102.06,47.63,122.47,272.16,Single-ply,SBD,F
Girls,67.36,15,Sadie Lopez,Corpus Christi West Oso,66.5,102.06,49.9,117.93,269.89,Single-ply,SBD,F
Girls,67.36,16,Gabriella Garcia,Corpus Christi London,63.32,90.72,43.09,104.33,238.14,Single-ply,SBD,F
Girls,67.36,17,Selina Castillo,Santa Gertrudis Academy,65.68,83.91,47.63,106.59,238.14,Single-ply,SBD,F
Girls,67.36,18,Natalie Sanchez,Orange Grove,60.69,99.79,38.56,81.65,219.99,Single-ply,SBD,F
Girls,67.36,DQ,Eliana Carrillo,San Diego,65.86,156.49,72.57,,,Single-ply,SBD,F
Girls,75.07,1,Karina Avila,Hebbronville,74.89,181.44,81.65,163.29,426.38,Single-ply,SBD,F
Girls,75.07,2,Mercedes Rodriguez,San Diego,72.48,170.1,70.31,149.69,390.09,Single-ply,SBD,F
Girls,75.07,3,Allyson Rangel,Freer,74.48,154.22,65.77,151.95,371.95,Single-ply,SBD,F
Girls,75.07,4,Nadia Mercado,Mathis,68.86,120.2,63.5,149.69,333.39,Single-ply,SBD,F
Girls,75.07,5,Makayla Johnson,Santa Gertrudis Academy,74.93,120.2,61.23,117.93,299.37,Single-ply,SBD,F
Girls,75.07,6,Michelle Sanchez,Zapata,74.3,120.2,63.5,113.4,297.1,Single-ply,SBD,F
Girls,75.07,7,Jenae Pena,Ingleside,68.49,124.74,54.43,111.13,290.3,Single-ply,SBD,F
Girls,75.07,8,Aubrey Benavides,Santa Gertrudis Academy,70.22,108.86,45.36,99.79,254.01,Single-ply,SBD,F
Girls,75.07,9,Kassi Ramon,Banquete,67.59,99.79,49.9,102.06,251.74,Single-ply,SBD,F
Girls,75.07,10,Shakira Pena,Orange Grove,72.76,97.52,47.63,104.33,249.48,Single-ply,SBD,F
Girls,75.07,11,Gavriela Willingham,Banquete,73.21,90.72,52.16,106.59,249.48,Single-ply,SBD,F
Girls,75.07,DQ,Aleksandra Grove,Orange Grove,72.76,,,,,Single-ply,SBD,F
Girls,75.07,DQ,Kassidy Lee,Orange Grove,69.58,83.91,,,,Single-ply,SBD,F
Girls,75.07,DQ,Laressa Rodriguez,Santa Gertrudis Academy,74.39,72.57,,,,Single-ply,SBD,F
Girls,75.07,DQ,Kimberly Santos,Zapata,73.57,,,,,Single-ply,SBD,F
Girls,82.33,1,Alexis Gallegos,San Diego,80.1,201.85,102.06,161.03,464.93,Single-ply,SBD,F
Girls,82.33,2,Jackie Guerra,Alice,80.38,183.7,83.91,183.7,451.32,Single-ply,SBD,F
Girls,82.33,3,Veronica Benavides,Laredo United,77.29,163.29,81.65,163.29,408.23,Single-ply,SBD,F
Girls,82.33,4,Alexis Estringel,Alice,82.19,163.29,90.72,154.22,408.23,Single-ply,SBD,F
Girls,82.33,5,Brittney Stafford,Hebbronville,82.24,154.22,88.45,138.35,381.02,Single-ply,SBD,F
Girls,82.33,6,Brianna Guillen,San Diego,80.47,163.29,79.38,131.54,374.21,Single-ply,SBD,F
Girls,82.33,7,Rosita Robles,Zapata,81.28,156.49,68.04,147.42,371.95,Single-ply,SBD,F
Girls,82.33,8,Damaris Diaz,Mathis,81.19,136.08,77.11,140.61,353.8,Single-ply,SBD,F
Girls,82.33,9,Clariza Moreno,Freer,79.11,140.61,65.77,138.35,344.73,Single-ply,SBD,F
Girls,82.33,10,Marivell Perez,Mathis,82.24,129.27,74.84,131.54,335.66,Single-ply,SBD,F
Girls,82.33,11,Andrea Sanchez,Orange Grove,81.37,129.27,49.9,117.93,297.1,Single-ply,SBD,F
Girls,82.33,12,Zoe Urrea,Banquete,76.84,111.13,54.43,127.01,292.57,Single-ply,SBD,F
Girls,82.33,13,Emily Herrera,Bishop,75.3,115.67,43.09,108.86,267.62,Single-ply,SBD,F
Girls,82.33,DQ,Emily Ortiz,Orange Grove,81.56,,,,,Single-ply,SBD,F
Girls,82.33,DQ,Christine Carrillo,Laredo Cigarroa,75.93,,,,,Single-ply,SBD,F
Girls,82.33,DQ,Stephanie Estrada,Laredo Cigarroa,76.02,,,,,Single-ply,SBD,F
Girls,90.04,1,Harlie Guerra,Bishop,83.46,181.44,83.91,151.95,417.3,Single-ply,SBD,F
Girls,90.04,2,Abby Hernandez,San Diego,89.68,170.1,83.91,147.42,401.43,Single-ply,SBD,F
Girls,90.04,DQ,Alessandra Mejia,Laredo Cigarroa,88.27,124.74,68.04,,,Single-ply,SBD,F
Girls,90.04,DQ,Esmeralda Luna,Laredo Martin,82.83,,,,,Single-ply,SBD,F
Girls,90.04,DQ,Kaley Leal,Corpus Christi Tuloso-Midway,89.09,,,,,Single-ply,SBD,F
Girls,90.04,DQ,Pearl Garcia,San Diego,87.54,140.61,61.23,,,Single-ply,SBD,F
Girls,100.02,1,Julie Sepulveda,Alice,97.25,181.44,83.91,161.03,426.38,Single-ply,SBD,F
Girls,100.02,2,Marlayna Garcia,Zapata,98.52,170.1,74.84,172.37,417.3,Single-ply,SBD,F
Girls,100.02,3,Jackie Salazar,Ben Bolt-Palito Blanco,99.88,163.29,56.7,131.54,351.53,Single-ply,SBD,F
Girls,100.02,4,Abigail Vela,Bishop,94.71,142.88,74.84,131.54,349.27,Single-ply,SBD,F
Girls,100.02,5,Claudia Morales,Laredo Cigarroa,90.36,113.4,58.97,142.88,315.25,Single-ply,SBD,F
Girls,100.02,6,Jalynn Rodriguez,Ben Bolt-Palito Blanco,97.7,127.01,47.63,133.81,308.44,Single-ply,SBD,F
Girls,100.02,7,Sierra Caro,Falfurrias,98.79,61.23,92.99,61.23,215.46,Single-ply,SBD,F
Girls,100.02,DQ,Analydia Montes,Corpus Christi Tuloso-Midway,97.43,,,,,Single-ply,SBD,F
Girls,100.02,DQ,Marianna Majia,Laredo Cigarroa,96.71,,,,,Single-ply,SBD,F
Girls,100.02,DQ,Damaris Saldivar,Laredo United,94.8,,,,,Single-ply,SBD,F
Girls,100.02,DQ,Clarissa Vargasq,Orange Grove,91.17,,,,,Single-ply,SBD,F
Girls,100.02,DQ,Jennifer Lozano,Hebbronville,97.98,215.46,,,,Single-ply,SBD,F
Girls,117.71,1,Jeannie Flores,Orange Grove,110.77,183.7,90.72,181.44,455.86,Single-ply,SBD,F
Girls,117.71,2,Jodi Linscomb,Freer,106.68,174.63,65.77,142.88,383.29,Single-ply,SBD,F
Girls,117.71,3,Marissa Garcia,Alice,103.87,149.69,61.23,158.76,369.68,Single-ply,SBD,F
Girls,117.71,4,Mykayla Stehle,Ben Bolt-Palito Blanco,103.15,147.42,83.91,136.08,367.41,Single-ply,SBD,F
Girls,117.71,5,Kimberly Rivera,San Diego,115.85,156.49,52.16,138.35,347,Single-ply,SBD,F
Girls,117.71,6,Brianna Garay,Laredo Cigarroa,105.41,136.08,54.43,142.88,333.39,Single-ply,SBD,F
Girls,117.71,7,Ju-Lin Guajardo,Banquete,108.32,97.52,36.29,90.72,224.53,Single-ply,SBD,F
Girls,117.71,DQ,Hailey DeLeon,Alice,100.52,151.95,,,,Single-ply,SBD,F
Girls,117.71,DQ,Davae Martinez,Corpus Christi West Oso,106.87,,,,,Single-ply,SBD,F
Girls,117.71+,1,Raelene Chavez,Corpus Christi Tuloso-Midway,118.93,219.99,95.25,149.69,464.93,Single-ply,SBD,F
Girls,117.71+,2,Samantha Crisman,Santa Gertrudis Academy,120.47,145.15,95.25,136.08,376.48,Single-ply,SBD,F
Girls,117.71+,3,Shania Zapata,Benavides,118.84,158.76,68.04,140.61,367.41,Single-ply,SBD,F
Girls,117.71+,4,Bethany Gonzalez,Santa Gertrudis Academy,147.51,142.88,56.7,142.88,342.46,Single-ply,SBD,F
Girls,117.71+,DQ,Jameleht Gonzalez,Laredo Martin,122.11,,,,,Single-ply,SBD,F
