Name,Color
Aaron Ecton,america
Aaron Madriaga,red_to_yellow_to_green
Abdullah Faras,purple
Adam Leidigh,finland
AJ Renshaw,red bold
Albert Alvarado,red_to_white
Alberto Portillo,red
Alec Dorner,lightblue
Alessio Gheller,italy
Alexander Walters,gold
Alexis Sicherman,red bold
Alice Swift,rainbow
Allison Hind,red
Alywin Sensley,red
Amanda Kohatsu-Popoola,green
Amanda Wolff,green_to_gray
Amber Hansen,neongreen
Andre Miranda,orange_to_green
Andrew Herbert,purple
Armando Carreon,red
Arran Sullivan,red bold
Artie Miller,royalblue bold
Artur Mamedyarov,red bold
Ashleigh Campbell,lightblue
Ashley Contorno,purple_to_teal
Blake Parado,green
Bobby Morgan #2,red
Bob McClure,red
Bob Merkh,america
Boris Lerner,lightblue
Bradley Besson,forestgreen
Brady Stewart #1,america
Brandon Combess,royalblue
Brian Goldstein #1,rainbow
Brianne Barry,purple_to_green
Bridget Morgan,lightblue
Brittainy Chown,purple_to_teal
Brody Laybolt,royalblue
Bryan Hartsel,yellow
Carina Davis,pink
Carl Stevens,yellow stencil small-caps
Carlos Cristan,carlos italic
Carter Claflin,lightblue_to_white
Cat Hawkins,neongreen_to_white
Celia Gomez,lightblue
Chad Penson,red_to_white
Charles Binkley,small-caps america
Charlie Cheryl Ritchie,yellow bold
Charlie Hooson-Sykes,rainbow
Chloe Lansing,blue_to_lightblue
Chris Lentini #1,red_to_blue bold papyrus
Chris Lindsay #1,royalblue
Chris Meadows,red
Chrissy Castellano,lightpink
Christie Hoffmeyer,red_to_blue bold papyrus
Christopher Roberts,lightblue_to_purple
Christopher Young #1,bold red
Christy James-Moser,lightblue
Ciarra Hutton,turquoise
Cynthia Browning,limegreen
Dan Green,green
Daniel Morjal,chicago_bears
Daphne Zhang,red
Darcy Morrissey,rosered
Dave Baker,rainbow
David Balsdon #1,purple
David Jasiulewicz,royalblue
David Osborn #1,gold
David O'Sullivan #1,rainbow
David Patterson #1,america bold
Dean Wyatt,lightblue
Derek Forlini,red
Dominique Fisher #1,red
Dustin Sixkiller,america
Dylan Mayer,finland
Ed Anton,green
Ellen Seidel,lightblue
Emily Blastock,pink_to_yellow_to_purple
Erika Hipwell,red
Erika Stevens,red
Esther Lee,lightblue
Eugenia Tashquinth,red bold algerian
Fardin Ahmed,lightblue
Ferdinand Luis,lightblue comicsans
Garrett Fear,purple bold
Gemma Lucas,england
George LeBlanc,darkgreen
Gerren Short,blue_to_yellow
Glenn Kirkpatrick,mike_overkamp
Greg Nuckols,helvetica
Greg Simmons #1,royalblue
Hailie Slack,red_to_yellow
Halldór Jens Vilhjálmsson,small-caps iceland
Hannah Stephenson,red_to_white_to_red
Hannah Webb-Cameron,green
Harrison Stickelman,yellow
Heather Connor,watermelonpink
Isabella Martin,rainbow
Ivy Knight,yellow
Jacek Toczydlowski,blue_to_lightblue
Jack Crouse,royalblue bold
Jacob Winstead #1,blue_to_gold
Jake Aguilar,green
James Range,red
James Rowe,red_to_white
James Shannon,royalblue bold
James Skinner,lightblue
James Strickland #1,yellow
James Wakefield,strong_geelong_orange
Jamie Christenson,small-caps red
Jan Hendrik Becker,yellow
Jason Legrand,neongreen
Jawon Garrison,red
Jazmin Reyes,lightpink_to_darkpink
Jeana Jenkins,red_to_orange
Jeanne Murdock,pink_to_purple_to_blue
Jeanie Shellman,purple
Jeff Justo,bold
Jen Andrew,red bold
Jenn Rotsinger,rainbow
Jennessa Labbate,blue_to_green
Jennifer Luther-Thomas,watermelonpink
Jeremy Willis #1,red
Jeris Hall,royalblue bold comicsans
Jesica Swisher,red_to_white
Jesse Lanuevo,olivegreen
Jessica Brown #1,purple_to_green
Jessica Durden,royalblue_to_lightblue
Jessica Pippen,red
Jessica Rogers,green_to_white
Jetter Lewis,jetter_lewis
Joe Franklin,red_to_blue bold papyrus
Joe Sullivan,lightblue
John Davis #4,royalblue
John LaFlamme,bold
John Melone,lightblue
John Reynolds,purple
Jonathon Farill,america
Joseph Park,rainbow
Josh Day #1,royalblue segoiui
Josh Enmark,small-caps neongreen
Josh Sutelman,all_red_top_down
Josh Walker #1,red
Jo Whiteley,purple
Johan Frisk,johan_frisk fire_animation
Jordan Fender,america
Jordon Rothrock,blue_to_orange bold
Julius Erwin,lightblue
Justin Jackson #1,lightblue algerian
Kai Ma,rainbow
Kalle Räsänen,finland
Karen Barry,green bold
Karen Jiritano,lightblue
Kathryn Mohide,neongreen
Kathy Czukor,hotpink
Katie DeMartino,rainbow
K'Aunica Byrd,red_to_white_to_red
Kayden Weller,red
Kayla Anderson #1,purple_to_silver
Kei Kawamata,rainbow
Kellie Montalvan,lightblue
Kellin Lee,limegreen
Kelly Gibson Bateman,america
Kelly Grosos,yellow bold
Kerrie Montalvan,lightblue
Kirstie Armstead,pink_to_purple
Kris Lewis #1,rainbow
Kristen Bellon,purple
Kristen Robbins #1,lightblue
Kristy Hawkins,green
Krzysztof Tur,purple purple_fire_animation bold
Kylee Craig,lightpink
Kyle McKee,yellow
Kyle Phipps,solidyellow
Kyle Stewart,green
Lanisha Adams,rainbow
Lary McEwen,yellow
Laura Kelly,laura_kelly
Lee Male,purple_fire_animation bold
Leigh Estrada,turquoise
Leila Thexton,small-caps bold pink_to_purple_to_blue
Leonetta Richardson,yellow
Linda Arvey,lightpink purple_fire_animation bold
Lisa Tai,lightpink
Lucinda Lorne,red bold comicsans
Luke Graham,ireland
Lynch Beachboard,america
Lynette Brown,orange
Mariana Moreno-Cederberg,rainbow
Marguerite Jones,purple
Mary Allor,royalblue bold
Matt Pearce,small-caps letter-spacing-2 helvetica matt_gradient
Matthew Gray #1,pink_to_white_to_pink
Matthew Provin,small-caps lightazure
Mauricio Standley,red bold
Maxavier Jean-Philippe,redgold_anim bold
Meg Robertson,red
Michael Flynn #1,emeraldgreen
Michael Gentile,royalblue
Michael Petyak,lightblue
Michael Vessia,flash3
Michelle Leu,salmonpink
Michelle Rennick,red bold
Michelle Sothen,lightpink
Mike Overkamp,mike_overkamp
Mike Picozzi,red bold
Mike Schollbach,yellow
Nathan Kim,red_to_white
Nikki Merson,pink_to_white
Noémie Allabert,france
Nolan Thomason,red_to_blue bold papyrus
Ogden J Myklebust III,chartreuse_yellow
Patria Jimenez,millennial_pink_color_palette
Patrick Jeffries,america
Paul Jackson #1,royalblue
Peter Pantazopoulos,rainbow
Peter Spence,peter_spence
Phillip Lake,green
Ranson Lee,royalblue
Rachel Foster,blue_to_lightblue bold
Ray Jiminez,royalblue
Rebecca Bachman,limegreen_to_gray
Reyhan Roybal,rainbow
Rich Sadiv,red
Richard Fontenot,red bold
Rick Simmons,lightblue
Riley Presnell,purple
Rita McBain,red bold
Robert Knutsson,sweden bold
Robert Lane,green
Robert Simmons #1,rainbow
Rob Hall,rob_hall
Rob Lineker,neongreen
Robyn Turnbull,rainbow
Roman Mustaccio,neongreen
Ryan Jones #1,gold bold
Ryan Mathias,royalblue bold
Ryan O'Neill,rainbow bold
Ryan Rubio,orange
Sally French,pink_to_orange
Sally Perry,lightblue
Samantha Shinavier,pink_to_purple_to_blue
Samuel Vaia,red bold
Sarah Klein,opl_sbd
Sarah Wellberg,green
Sarah Wheal,lightblue
Sara Schiff,purple_to_green
Scott Neary,turquoise bold
Sean Breard,blue_to_lightblue
Sean Dewey,red_to_blue bold
Sean Stangl,blue_to_lightblue
Shadi Zahed,green
Shaun Davis #1,royalblue
Shawn Fante,red bold
Shelby Halligan,limegreen_to_green
Simon Daniel Oswald,cedar_brown
Spencer Key,orange
Stefanie Cohen,bold red
Steve Adams,blue_to_gunmetal
Steve Denison,lightblue
Susan Chambers,rainbow
Susan Salazar,lightblue
Suzanne Davis,benchteal bold
Tara Webber,green
Taylor Haney,red_to_purple
Tenaya Tuteur,turquoise_to_magenta scroll_gradient
Terri Ashley,purple
Tim Arnold,waterblue
Tim Daniel Konertz,dots_red
Tim Lease,america
TJ Dunsmoor,emeraldgreen
Tom Cencich,royalblue bold
Tom Kallas,red
Tommy O'Connor,ireland
Tracey Berg-Fulton,hotpink
Travis P. Rogers,gold
Treena Grevatt,purple_to_hotpink
Trevor Thompson,bold
Trystan Oakley,glow3
Tu Le #1,blue_to_yellow
Tyler Cummings,blue_to_white
Tyson Andrews,neongreen
Valerie Oliveira,tiger bold
Vanessa Ferla,teal_to_white
Vanessa Torres,pink_to_lightblue
Véronique Fradette,canada
Vincent Raia,red
Wendy McGirr,neongreen
Wilbert Rogers,red bold small-caps
William E Duncan,gold
William Hobbs #1,blue_to_lightblue
Yousef Afaneh,palestine bold
Yu Gui,red_to_yellow_to_red
Zachary Langdon,royalblue
Zachary Lockhart,red
Zachary Nathaniel Hall,royalblue
Zachary Voase,rainbow small-caps
Zahir Khudayarov,orange
Zsuzsanna Tóth,hotpink bold papyrus
