Place,Name,Sex,Event,Division,WeightClassKg,Equipment,BirthYear,State,BodyweightKg,Squat1Kg,Squat2Kg,Squat3Kg,Best3SquatKg,Bench1Kg,Bench2Kg,Bench3Kg,Best3BenchKg,Deadlift1Kg,Deadlift2Kg,Deadlift3Kg,Best3DeadliftKg,TotalKg,Age,BirthDate
1,Sabra Edwards,F,B,FR-M2,69,Raw,1965,NY,67.65,,,,,75,82.5,87.5,87.5,,,,,87.5,,
1,Robert Fish Jr,M,B,MR-M1,120,Raw,1975,NY,113.45,,,,,127.5,132.5,142.5,142.5,,,,,142.5,,
1,Eric Thomas,M,B,MR-T3,93,Raw,2002,NY,92.75,,,,,145,-152.5,-152.5,145.0,,,,,145,,
1,Marisa Acosta,F,SBD,FR-Jr,57,Raw,1997,NJ,56.35,95,102.5,105,105.0,52.5,57.5,60,60.0,115,125,132.5,132.5,297.5,,
1,Amanda Herdman,F,SBD,FR-Jr,76,Raw,1999,CT,72.85,127.5,137.5,150,150.0,72.5,80,85,85.0,142.5,157.5,170,170.0,405,,
1,Brooke Harrison,F,SBD,FR-Jr,84+,Raw,1998,NY,107.05,-122.5,-130,130,130.0,72.5,80,82.5,82.5,127.5,135,142.5,142.5,355,,
1,Astrid Girolamo,F,SBD,FR-M1,52,Raw,1981,NY,51.7,115,120,125,125.0,67.5,70,72.5,72.5,142.5,150,152.5,152.5,350,,
1,Jennifer Sauter,F,SBD,FR-M1,57,Raw,1979,NY,56.9,132.5,-137.5,-137.5,132.5,65,67.5,-70,67.5,-145,145,-152.5,145.0,345,,
2,Syndi Acampora,F,SBD,FR-M1,57,Raw,1979,NY,56.05,95,100,105,105.0,62.5,65,67.5,67.5,120,125,130,130.0,302.5,,
1,Amy Henges,F,SBD,FR-M1,84+,Raw,1981,NY,136.7,125,-137.5,140,140.0,60,65,70,70.0,160,175,185,185.0,395,,
2,Kerry Rudolph,F,SBD,FR-M1,84+,Raw,1977,NY,107.75,80,92.5,110,110.0,37.5,50,60,60.0,90,120,142.5,142.5,312.5,,
1,Danielle Liotta,F,SBD,FR-M2,63,Raw,1970,NY,61.75,65,-70,-75,65.0,35,-40,42.5,42.5,75,82.5,92.5,92.5,200,,
1,Robin Pugliese,F,SBD,FR-M2,69,Raw,1970,NY,68.1,87.5,95,100,100.0,47.5,-55,55,55.0,105,115,-125,115.0,270,,
2,Sonja Herbert,F,SBD,FR-M2,69,Raw,1968,NY,67.7,-47.5,47.5,57.5,57.5,35,37.5,-40,37.5,42.5,45,47.5,47.5,142.5,,
1,Kelly Gibson Bateman,F,SBD,FR-M2,76,Raw,1969,NY,75.4,127.5,-137.5,146.5,146.5,77.5,82.5,86,86.0,130,140,-151,140.0,372.5,,
2,Michelle Cornwell,F,SBD,FR-M2,76,Raw,1966,NY,74.75,90,-97.5,97.5,97.5,60,65,-67.5,65.0,130,-145,-145,130.0,292.5,,
1,Ruth Walker,F,SBD,FR-M3,52,Raw,1958,NY,50.6,47.5,50,55,55.0,35,-37.5,-37.5,35.0,80,85,-87.5,85.0,175,,
1,Leah Goldring,F,SBD,FR-O,47,Raw,1983,PA,46.75,117.5,125,-132.5,125.0,77.5,82.5,85.5,85.5,157.5,165,,165.0,375.5,,
1,Astrid Girolamo,F,SBD,FR-O,52,Raw,1981,NY,51.7,115,120,125,125.0,67.5,70,72.5,72.5,142.5,150,152.5,152.5,350,,
1,Jennifer Sauter,F,SBD,FR-O,57,Raw,1979,NY,56.9,132.5,-137.5,-137.5,132.5,65,67.5,-70,67.5,-145,145,-152.5,145.0,345,,
2,Victoria Mccarthy,F,SBD,FR-O,57,Raw,1987,NY,55.45,112.5,-120,125,125.0,57.5,62.5,67.5,67.5,117.5,127.5,-137.5,127.5,320,,
3,Syndi Acampora,F,SBD,FR-O,57,Raw,1979,NY,56.05,95,100,105,105.0,62.5,65,67.5,67.5,120,125,130,130.0,302.5,,
4,Marisa Acosta,F,SBD,FR-O,57,Raw,1997,NJ,56.35,95,102.5,105,105.0,52.5,57.5,60,60.0,115,125,132.5,132.5,297.5,,
1,Tressa Rhodes,F,SBD,FR-O,63,Raw,1995,NY,60.55,142.5,150,155,155.0,70,72.5,75,75.0,142.5,150,155,155.0,385,,
2,Jennifer Cooke,F,SBD,FR-O,63,Raw,1996,NY,59.5,-92.5,-92.5,92.5,92.5,-45,50,-52.5,50.0,120,125,127.5,127.5,270,,
1,Jenelle Ayala,F,SBD,FR-O,69,Raw,1991,NY,68.25,125,130,137.5,137.5,75,80,-85,80.0,130,137.5,145,145.0,362.5,,
2,Ashley Rios,F,SBD,FR-O,69,Raw,1989,NY,66.2,107.5,-112.5,115,115.0,65,70,72.5,72.5,127.5,132.5,145,145.0,332.5,,
3,Kasey Ryan,F,SBD,FR-O,69,Raw,1997,CT,68.15,-110,110,117.5,117.5,-60,60,62.5,62.5,127.5,132.5,140,140.0,320,,
4,Rachel Hyatt,F,SBD,FR-O,69,Raw,1997,NY,65.35,87.5,97.5,105,105.0,57.5,62.5,-65,62.5,130,137.5,-150,137.5,305,,
5,Olivia Anderson,F,SBD,FR-O,69,Raw,1996,CT,67.1,85,90,-97.5,90.0,60,65,-70,65.0,125,130,140,140.0,295,,
6,Robin Pugliese,F,SBD,FR-O,69,Raw,1970,NY,68.1,87.5,95,100,100.0,47.5,-55,55,55.0,105,115,-125,115.0,270,,
DQ,Lauren Hunt,F,SBD,FR-O,69,Raw,1994,CT,67.8,-137.5,-142.5,-142.5,,70,72.5,-75,72.5,147.5,152.5,-157.5,152.5,,,
1,Amanda Herdman,F,SBD,FR-O,76,Raw,1999,CT,72.85,127.5,137.5,150,150.0,72.5,80,85,85.0,142.5,157.5,170,170.0,405,,
1,Amy Henges,F,SBD,FR-O,84+,Raw,1981,NY,136.7,125,-137.5,140,140.0,60,65,70,70.0,160,175,185,185.0,395,,
2,Molly Emmons,F,SBD,FR-O,84+,Raw,1981,NY,93.7,-132.5,132.5,140,140.0,70,75,-82.5,75.0,162.5,172.5,-177.5,172.5,387.5,,
3,Kerry Rudolph,F,SBD,FR-O,84+,Raw,1977,NY,107.75,80,92.5,110,110.0,37.5,50,60,60.0,90,120,142.5,142.5,312.5,,
4,Amanda Sander,F,SBD,FR-O,84+,Raw,1992,NY,109.9,-97.5,100,-107.5,100.0,62.5,-65,-65,62.5,105,110,-117.5,110.0,272.5,,
1,Danica Acampora,F,SBD,FR-Y2,43,Raw,2010,NY,42.75,-55,55,57.5,57.5,-30,-30,30,30.0,55,60,-65,60.0,147.5,,
1,Keith Nautel,M,SBD,M-M2,93,Single-ply,1965,NY,85.9,205,215,230,230.0,-177.5,177.5,182.5,182.5,270,277.5,282.5,282.5,695,,
G,Dereck Vaquero-Rosas,M,SBD,MR-G,83,Raw,2004,NY,80.9,187.5,195,202.5,202.5,130,135,142.5,142.5,195,-207.5,207.5,207.5,552.5,,
1,Brian Lineback,M,SBD,MR-Jr,66,Raw,2000,NY,61.95,105,115,125,125.0,72.5,82.5,-90,82.5,137.5,152.5,165,165.0,372.5,,
1,Sadman Mishel,M,SBD,MR-Jr,74,Raw,1997,MA,73.6,170,182.5,195,195.0,97.5,105,110,110.0,-185,192.5,210,210.0,515,,
1,Michael Houle,M,SBD,MR-Jr,83,Raw,1998,CT,80.85,190,202.5,-220,202.5,115,120,-125,120.0,225,242.5,-250,242.5,565,,
2,Christian Vasiliev,M,SBD,MR-Jr,83,Raw,1999,NY,82.35,152.5,162.5,170,170.0,125,130,-137.5,130.0,187.5,197.5,202.5,202.5,502.5,,
1,Walter Schopf,M,SBD,MR-Jr,93,Raw,1997,NJ,90.55,202.5,212.5,-217.5,212.5,150,155,-157.5,155.0,250,267.5,-272.5,267.5,635,,
2,Dwight Burns,M,SBD,MR-Jr,93,Raw,1999,CT,88.55,180,195,205,205.0,125,-135,-137.5,125.0,225,227.5,272.5,272.5,602.5,,
3,Brian Santanelli,M,SBD,MR-Jr,93,Raw,1997,NY,86.1,160,172.5,185,185.0,120,-125,-125,120.0,175,192.5,207.5,207.5,512.5,,
1,Hamza Mudassar,M,SBD,MR-Jr,105,Raw,2000,NY,102.45,215,225,-232.5,225.0,125,135,140,140.0,250,265,-275,265.0,630,,
DQ,Nicolas Nardachone,M,SBD,MR-Jr,105,Raw,1997,NJ,102.9,182.5,-192.5,,182.5,-140,-140,,,227.5,,,227.5,,,
1,Kevin Chu #1,M,SBD,MR-Jr,120,Raw,1998,NY,111.95,220,232.5,245,245.0,155,-162.5,-162.5,155.0,285,305,320,320.0,720,,
2,Reggie Poulin,M,SBD,MR-Jr,120,Raw,2000,NY,118.8,242.5,-257.5,-257.5,242.5,137.5,-147.5,-147.5,137.5,232.5,245,252.5,252.5,632.5,,
3,Brendan Russo,M,SBD,MR-Jr,120,Raw,2000,NY,109.8,200,212.5,227.5,227.5,117.5,127.5,137.5,137.5,215,230,247.5,247.5,612.5,,
1,Matt Bilow,M,SBD,MR-M1,93,Raw,1979,NY,92.45,165,177.5,182.5,182.5,140,147.5,-150,147.5,-185,200,-210,200.0,530,,
1,Justin Engel,M,SBD,MR-M1,105,Raw,1979,MA,100.3,182.5,192.5,202.5,202.5,140,150,157.5,157.5,217.5,230,240,240.0,600,,
2,Brian Landsman,M,SBD,MR-M1,105,Raw,1979,NY,96.7,147.5,162.5,172.5,172.5,105,110,-112.5,110.0,190,197.5,207.5,207.5,490,,
3,Derek Metras,M,SBD,MR-M1,105,Raw,1978,MA,99.05,152.5,-167.5,-185,152.5,120,-130,,120.0,170,182.5,-197.5,182.5,455,,
1,Rob Ward #1,M,SBD,MR-M1,120+,Raw,1980,NY,146.95,300,320,341,341.0,170,-180,-180,170.0,270,285,-290,285.0,796,,
1,Ammon Shea,M,SBD,MR-M2,83,Raw,1970,NY,82.1,187.5,192.5,197.5,197.5,107.5,110,-112.5,110.0,190,197.5,202.5,202.5,510,,
2,Daniel Breton,M,SBD,MR-M2,83,Raw,1966,MA,82.9,167.5,177.5,187.5,187.5,100,105,-110,105.0,205,215,217.5,217.5,510,,
1,Terrance Wynne,M,SBD,MR-M3,83,Raw,1956,NY,79,-110,115,122.5,122.5,75,80,-87.5,80.0,150,-162.5,162.5,162.5,365,,
1,Richard Landry,M,SBD,MR-M4,105,Raw,1947,NY,99.5,132.5,142.5,-150,142.5,90,95,100,100.0,170,180,-182.5,180.0,422.5,,
2,James Davis,M,SBD,MR-M4,105,Raw,1949,NY,94.95,105,110,115,115.0,75,-85,85,85.0,152.5,157.5,160,160.0,360,,
DQ,Anton Leamer,M,SBD,MR-O,66,Raw,1988,NY,64.8,-165,165,172.5,172.5,95,102.5,-107.5,102.5,-175,-175,-175,,,,
1,Brian Nevin,M,SBD,MR-O,74,Raw,1987,NJ,73.85,-175,175,180,180.0,125,130,132.5,132.5,217.5,227.5,-232.5,227.5,540,,
2,Oren Gall,M,SBD,MR-O,74,Raw,1984,PA,71.1,167.5,175,177.5,177.5,115,-117.5,-117.5,115.0,200,210,-217.5,210.0,502.5,,
3,Kori Donath,M,SBD,MR-O,74,Raw,2003,NY,73,-155,165,172.5,172.5,95,102.5,-107.5,102.5,200,212.5,225,225.0,500,,
4,Alion Baxhellari,M,SBD,MR-O,74,Raw,2002,NY,70.7,160,162.5,-172.5,162.5,90,92.5,-100,92.5,192.5,200,-210,200.0,455,,
1,Derek Marsette,M,SBD,MR-O,83,Raw,1990,CT,78.15,180,195,205,205.0,140,-145,-150,140.0,235,247.5,-260,247.5,592.5,,
2,Steven Holler,M,SBD,MR-O,83,Raw,2001,NJ,78.15,-175,187.5,197.5,197.5,125,-130,-130,125.0,182.5,197.5,210,210.0,532.5,,
3,George Ondek,M,SBD,MR-O,83,Raw,1992,CT,82.45,155,165,-175,165.0,122.5,130,-137.5,130.0,195,207.5,220,220.0,515,,
4,Ammon Shea,M,SBD,MR-O,83,Raw,1970,NY,82.1,187.5,192.5,197.5,197.5,107.5,110,-112.5,110.0,190,197.5,202.5,202.5,510,,
5,Daniel Breton,M,SBD,MR-O,83,Raw,1966,MA,82.9,167.5,177.5,187.5,187.5,100,105,-110,105.0,205,215,217.5,217.5,510,,
1,Christopher Austin #1,M,SBD,MR-O,93,Raw,1989,NY,92.55,247.5,260,267.5,267.5,180,-190,-190,180.0,287.5,300,-305,300.0,747.5,,
2,Nicholas Trentanelli,M,SBD,MR-O,93,Raw,1996,NY,91.6,210,222.5,235,235.0,170,180,192.5,192.5,250,265,285,285.0,712.5,,
3,Walter Schopf,M,SBD,MR-O,93,Raw,1997,NJ,90.55,202.5,212.5,-217.5,212.5,150,155,-157.5,155.0,250,267.5,-272.5,267.5,635,,
4,Jeffrey Pagini,M,SBD,MR-O,93,Raw,1980,CT,91,165,177.5,190,190.0,122.5,130,-137.5,130.0,-220,227.5,247.5,247.5,567.5,,
5,Matt Bilow,M,SBD,MR-O,93,Raw,1979,NY,92.45,165,177.5,182.5,182.5,140,147.5,-150,147.5,-185,200,-210,200.0,530,,
1,Blain Smith,M,SBD,MR-O,105,Raw,1982,NY,98.9,180,190,200,200.0,100,110,-115,110.0,230,240,250,250.0,560,,
DQ,Nicolas Nardachone,M,SBD,MR-O,105,Raw,1997,NJ,102.9,182.5,-192.5,,182.5,-140,-140,,,227.5,,,227.5,,,
1,Jaime Turcios,M,SBD,MR-O,120,Raw,1990,NY,118.65,295,310,325,325.0,195,205,210,210.0,265,282.5,-297.5,282.5,817.5,,
2,Kevin Chu #1,M,SBD,MR-O,120,Raw,1998,NY,111.95,220,232.5,245,245.0,155,-162.5,-162.5,155.0,285,305,320,320.0,720,,
3,Bryce Pole-Merchant,M,SBD,MR-O,120,Raw,1998,NY,116.3,207.5,225,240,240.0,-147.5,157.5,-167.5,157.5,240,255,-257.5,255.0,652.5,,
4,Reggie Poulin,M,SBD,MR-O,120,Raw,2000,NY,118.8,242.5,-257.5,-257.5,242.5,137.5,-147.5,-147.5,137.5,232.5,245,252.5,252.5,632.5,,
1,Adrian Myers,M,SBD,MR-O,120+,Raw,1989,NY,129.25,295,310,322.5,322.5,157.5,175,-177.5,175.0,325,342.5,-347.5,342.5,840,,
2,Matthew Nelson,M,SBD,MR-O,120+,Raw,1982,NY,177.45,250,255,257.5,257.5,147.5,155,-160,155.0,242.5,252.5,265,265.0,677.5,,
1,Philip Noyes,M,SBD,MR-T1,83,Raw,2006,NY,75.55,92.5,100,-105,100.0,70,-77.5,,70.0,135,142.5,147.5,147.5,317.5,,
1,Sam Weisman,M,SBD,MR-T2,66,Raw,2003,NY,63.3,167.5,172.5,177.5,177.5,-115,120,-127.5,120.0,205,-212.5,-215,205.0,502.5,,
1,Kori Donath,M,SBD,MR-T2,74,Raw,2003,NY,73,-155,165,172.5,172.5,95,102.5,-107.5,102.5,200,212.5,225,225.0,500,,
2,William Ottenheimer,M,SBD,MR-T2,74,Raw,2003,NY,72.75,175,-185,-185,175.0,95,100,-107.5,100.0,210,215,-222.5,215.0,490,,
1,Adrian Cristian-Fernandez,M,SBD,MR-T2,83,Raw,2003,NY,82.8,160,167.5,182.5,182.5,100,-107.5,110,110.0,182.5,192.5,205,205.0,497.5,,
1,Matthew DiSunno,M,SBD,MR-T2,93,Raw,2003,NY,91.95,197.5,210,220,220.0,-132.5,132.5,140,140.0,217.5,232.5,240,240.0,600,,
2,Kai DeVoe-Talluto,M,SBD,MR-T2,93,Raw,2004,VT,86.45,182.5,190,197.5,197.5,135,145,-147.5,145.0,222.5,235,-245,235.0,577.5,,
1,Carson Labarre,M,SBD,MR-T2,105,Raw,2003,VT,103.85,207.5,220,230,230.0,132.5,142.5,150,150.0,252.5,265,275,275.0,655,,
2,Michael Silliman,M,SBD,MR-T2,105,Raw,2004,NY,102.1,160,170,180,180.0,110,115,-122.5,115.0,160,177.5,190,190.0,485,,
3,Ashton Thomas,M,SBD,MR-T2,105,Raw,2003,NY,99.1,120,140,-160,140.0,65,85,100,100.0,140,162.5,-185,162.5,402.5,,
1,Cameron Lee,M,SBD,MR-T3,74,Raw,2002,NY,73.45,212.5,220,-230,220.0,117.5,122.5,-125,122.5,200,-220,-220,200.0,542.5,,
1,Steven Holler,M,SBD,MR-T3,83,Raw,2001,NJ,78.15,-175,187.5,197.5,197.5,125,-130,-130,125.0,182.5,197.5,210,210.0,532.5,,
1,Anthony Strokach,M,SBD,MR-T3,93,Raw,2002,NY,92.3,220,230,235,235.0,110,120,125,125.0,240,-250,-250,240.0,600,,
1,Tyler Chesebrough,M,SBD,MR-Y2,74,Raw,2009,MD,68.45,70,75,80,80.0,40,43,47.5,47.5,75,85,94,94.0,221.5,,
1,Kelly Gibson Bateman,F,BD,FR-M2,76,Raw,1969,NY,75.4,,,,,77.5,82.5,86,86.0,130,140,-151,140.0,226,,
1,Raymond Miller,M,BD,MR-M2,105,Raw,1964,NY,93.3,,,,,85,90,95,95.0,122.5,130,137.5,137.5,232.5,,
