Name,BodyweightKg,WeightClassKg,Sex,Division,AgeRange,Best3SquatKg,Best3BenchKg,Best3DeadliftKg,TotalKg,Equipment,Event,Place
Jason Roy,,60,M,M-HS,,124.74,117.93,158.76,401.43,Single-ply,SBD,1
E Spoelstra,,67.5,M,M-HS,,108.86,81.65,163.29,353.8,Single-ply,SBD,1
J Chilafoe,,82.5,M,M-HS,,74.84,49.9,127.01,251.74,Single-ply,SBD,1
T Hobbs,,90,M,M-HS,,95.25,70.31,149.69,315.25,Single-ply,SBD,1
N Pino,,100,M,M-HS,,170.1,95.25,204.12,469.47,Single-ply,SBD,1
S Alberini,,100,M,M-HS,,161.03,95.25,170.1,426.38,Single-ply,SBD,2
E Lavoie,,110,M,M-HS,,158.76,104.33,181.44,444.52,Single-ply,SBD,1
J. Martin,,110,M,M-HS,,172.37,79.38,149.69,401.43,Single-ply,SBD,2
D. Levesque,,125,M,M-HS,,140.61,95.25,167.83,403.7,Single-ply,SBD,1
J. Richardson,,140+,M,M-HS,,181.44,124.74,192.78,498.95,Single-ply,SBD,1
Demetra Botseas,54.43,56,F,F-O,,111.13,65.77,136.08,312.98,Single-ply,SBD,1
B Steedm,53.98,56,F,F-O,,122.47,49.9,136.08,308.44,Single-ply,SBD,2
L Canha,50.35,52,F,F-O,,102.06,52.16,122.47,276.69,Single-ply,SBD,1
M. Dodge,50.35,52,F,F-O,,106.59,43.09,120.2,269.89,Single-ply,SBD,2
Sue Pike,59.42,60,F,F-O,,145.15,65.77,167.83,378.75,Single-ply,SBD,1
L Foley,61.23,67.5,F,F-O,,90.72,52.16,104.33,247.21,Single-ply,SBD,1
Marilyn Barba,88.9,90,F,F-O,,136.08,70.31,156.49,362.87,Single-ply,SBD,1
V Parson,71.21,75,F,F-O,,108.86,61.23,111.13,281.23,Single-ply,SBD,1
Dara Scott,62.14,67.5,F,F-M,,138.35,68.04,163.29,369.68,Single-ply,SBD,1
M. Moisis,49.9,52,F,F-M,,83.91,58.97,117.93,260.82,Single-ply,SBD,1
Marilyn Barba,88.9,90,F,F-M,,136.08,70.31,156.49,362.87,Single-ply,SBD,1
David Duval,54.43,56,M,M-SM,,181.44,113.4,181.44,476.27,Single-ply,SBD,1
Ray Houle,58.97,60,M,M-SM,,176.9,108.86,192.78,478.54,Single-ply,SBD,1
D. Dunham,108.86,110,M,M-SM,,240.4,167.83,172.37,580.6,Single-ply,SBD,1
D. Campbell #11,97.52,100,M,M-SM,,183.7,142.88,208.65,535.24,Single-ply,SBD,1
Andrew Christo,85.28,90,M,M-M,,210.92,138.35,231.33,580.6,Single-ply,SBD,1
Carl Allgeyer,87.09,90,M,M-M,,217.72,145.15,217.72,580.6,Single-ply,SBD,2
R. Karelitz,87.54,90,M,M-M,,199.58,154.22,204.12,557.92,Single-ply,SBD,3
W. Smith,85.28,90,M,M-M,,199.58,124.74,183.7,508.02,Single-ply,SBD,4
T. Weeks,109.77,110,M,M-M,,290.3,165.56,272.16,728.02,Single-ply,SBD,1
M. Burlage,97.98,100,M,M-M,,263.08,142.88,249.48,655.44,Single-ply,SBD,1
M. Rainey,108.41,110,M,M-M,,224.53,154.22,226.8,605.55,Single-ply,SBD,2
D. Reynolds,97.98,100,M,M-M,,233.6,149.69,61.23,444.52,Single-ply,SBD,2
S. Noel,95.71,100,M,M-M,,113.4,165.56,113.4,392.36,Single-ply,SBD,3
A Moisis,108.41,110,M,M-M,,102.06,124.74,181.44,408.23,Single-ply,SBD,3
Alan Rubin,92.99,100,M,M-GM,,183.7,156.49,226.8,566.99,Single-ply,SBD,1
D. Dwyer,69.4,75,M,M-GM,,142.88,65.77,174.63,383.29,Single-ply,SBD,1
B. Gullage,83.91,90,M,M-GM,,142.88,65.77,174.63,383.29,Single-ply,SBD,1
J Petrone,73.94,75,M,M-GM,,90.72,68.04,113.4,272.16,Single-ply,SBD,2
Sean Burns #4,,140+,M,M-SO,,99.79,77.11,129.27,306.17,Single-ply,SBD,2
Josh Sandborn,,140+,M,M-SO,,163.29,90.72,142.88,396.89,Single-ply,SBD,1
David Duval,54.43,56,M,M-O,,181.44,113.4,181.44,476.27,Single-ply,SBD,1
Ray Houle,58.97,60,M,M-O,,176.9,108.86,192.78,478.54,Single-ply,SBD,1
John Panteledes,,67.5,M,M-O,,215.46,138.35,201.85,555.65,Single-ply,SBD,1
D Geoffrey,,67.5,M,M-O,,179.17,108.86,176.9,464.93,Single-ply,SBD,2
Chris Mathieu,,75,M,M-O,,229.06,120.2,231.33,580.6,Single-ply,SBD,1
Brian Panteledes,,75,M,M-O,,215.46,127.01,226.8,569.26,Single-ply,SBD,2
David Falvo,,75,M,M-O,,165.56,113.4,244.94,523.9,Single-ply,SBD,3
A Molligi,,75,M,M-O,,181.44,113.4,222.26,517.1,Single-ply,SBD,4
S Dumont,,75,M,M-O,,199.58,120.2,197.31,517.1,Single-ply,SBD,5
J Ascani,,75,M,M-O,,192.78,120.2,204.12,517.1,Single-ply,SBD,6
B. Farmer,,75,M,M-O,,181.44,102.06,224.53,508.02,Single-ply,SBD,7
D. Brown,,75,M,M-O,,170.1,117.93,192.78,480.81,Single-ply,SBD,8
J. Mccormack,,75,M,M-O,,149.69,97.52,181.44,428.64,Single-ply,SBD,9
Daniel Dore,,82.5,M,M-O,,174.63,111.13,238.14,523.9,Single-ply,SBD,1
Dave Barham,,82.5,M,M-O,,181.44,113.4,192.78,487.61,Single-ply,SBD,2
D Laverriere,,82.5,M,M-O,,183.7,108.86,195.04,487.61,Single-ply,SBD,3
R McQueen,,82.5,M,M-O,,167.83,129.27,183.7,480.81,Single-ply,SBD,4
B Gamelin,,82.5,M,M-O,,138.35,102.06,158.76,399.16,Single-ply,SBD,5
David Haycock,,90,M,M-O,,204.12,131.54,229.06,564.72,Single-ply,SBD,1
David Audet,,100,M,M-O,,335.66,190.51,281.23,807.39,Single-ply,SBD,1
D. Bryson,,100,M,M-O,,240.4,163.29,240.4,644.1,Single-ply,SBD,2
J Gaeta,,100,M,M-O,,204.12,149.69,258.55,612.35,Single-ply,SBD,3
J Molligi,,100,M,M-O,,226.8,142.88,226.8,596.47,Single-ply,SBD,4
J Agnew,,100,M,M-O,,213.19,145.15,219.99,578.33,Single-ply,SBD,5
S Kapinski,,100,M,M-O,,206.38,129.27,219.99,555.65,Single-ply,SBD,6
Tom Weeks,109.77,110,M,M-O,,290.3,165.56,272.16,728.02,Single-ply,SBD,1
J. Pace,,110,M,M-O,,272.16,181.44,272.16,725.75,Single-ply,SBD,2
J. Drew,,110,M,M-O,,278.96,163.29,247.21,689.46,Single-ply,SBD,3
B. Burris,,110,M,M-O,,258.55,136.08,240.4,635.03,Single-ply,SBD,4
Paul Drone,,125,M,M-O,,240.4,154.22,226.8,621.42,Single-ply,SBD,1
Chris Otte,,140+,M,M-O,,226.8,127.01,226.8,580.6,Single-ply,SBD,1
