Division,WeightClassKg,Place,Name,Team,BodyweightKg,Best3SquatKg,Best3BenchKg,Best3DeadliftKg,TotalKg,Equipment,Event,Sex
Boys,55.79,1,Isaiah Lucio,Pearsall,53.43,142.88,102.06,151.95,396.89,Single-ply,SBD,M
Boys,55.79,2,Luke Torres,Devine,55.16,136.08,83.91,149.69,369.68,Single-ply,SBD,M
Boys,55.79,3,Rudy Rios,Devine,55.79,131.54,77.11,145.15,353.8,Single-ply,SBD,M
Boys,55.79,4,Manny Arellano,Pearsall,52.71,95.25,92.99,104.33,292.57,Single-ply,SBD,M
Boys,59.87,1,Dimas Tenorio,Crystal City,58.33,190.51,122.47,195.04,508.02,Single-ply,SBD,M
Boys,59.87,2,Orlando Gonzales,Natalia,59.24,165.56,83.91,181.44,430.91,Single-ply,SBD,M
Boys,59.87,3,Rodney Garcia,Carrizo Springs,59.42,167.83,95.25,167.83,430.91,Single-ply,SBD,M
Boys,59.87,4,Juan Riojas,La Pryor,58.69,158.76,106.59,142.88,408.23,Single-ply,SBD,M
Boys,67.13,5,Garrison Kindred,Castroville Medina Valley,60.06,140.61,83.91,149.69,374.21,Single-ply,SBD,M
Boys,59.87,6,Jesse Gonzales,San Antonio Holy Cross,56.25,124.74,61.23,147.42,333.39,Single-ply,SBD,M
Boys,59.87,7,Marco Gomez,Crystal City,59.6,92.99,65.77,102.06,260.82,Single-ply,SBD,M
Boys,59.87,DQ,Jaime Ramirez,Rocksprings,56.34,115.67,,,,Single-ply,SBD,M
Boys,59.87,DQ,Steven Ramirez,Devine,59.06,142.88,70.31,,,Single-ply,SBD,M
Boys,67.13,1,Joe Guerrero,Devine,65.86,199.58,120.2,192.78,512.56,Single-ply,SBD,M
Boys,67.13,2,Aaron Realme,Pearsall,62.6,181.44,95.25,190.51,467.2,Single-ply,SBD,M
Boys,67.13,3,Christopher Alfaro,San Antonio East Central,61.78,170.1,95.25,195.04,460.4,Single-ply,SBD,M
Boys,67.13,4,Manuel Charo,San Antonio East Central,61.69,172.37,97.52,165.56,435.45,Single-ply,SBD,M
Boys,67.13,5,Luis Martinez,Pearsall,62.41,165.56,92.99,170.1,428.64,Single-ply,SBD,M
Boys,67.13,6,Darren Graham,San Antonio Holy Cross,62.51,149.69,74.84,156.49,381.02,Single-ply,SBD,M
Boys,67.13,7,Diego Perez #1,Rocksprings,60.69,124.74,83.91,136.08,344.73,Single-ply,SBD,M
Boys,74.84,8,Edgar Sanchez,Uvalde,67.31,124.74,74.84,131.54,331.12,Single-ply,SBD,M
Boys,67.13,9,Xavier Herrera,Brackettville Brackett,61.23,111.13,61.23,136.08,308.44,Single-ply,SBD,M
Boys,67.13,10,Ismael Franco,Crystal City,64.86,99.79,74.84,129.27,303.91,Single-ply,SBD,M
Boys,67.13,11,Jose Fargason,Devine,64.77,120.2,58.97,104.33,283.5,Single-ply,SBD,M
Boys,67.13,DQ,Juergen Lapham,Center Point,66.32,115.67,63.5,,,Single-ply,SBD,M
Boys,67.13,DQ,Paul Santana,Devine,65.86,174.63,113.4,,,Single-ply,SBD,M
Boys,74.84,1,Rene Rodriguez,Pearsall,68.04,183.7,104.33,199.58,487.61,Single-ply,SBD,M
Boys,74.84,2,Jaaziel Buenrostro,Carrizo Springs,73.94,170.1,113.4,188.24,471.74,Single-ply,SBD,M
Boys,74.84,3,Robert Adame,San Antonio Holy Cross,71.12,165.56,102.06,192.78,460.4,Single-ply,SBD,M
Boys,74.84,4,Jacob Aguilar,San Antonio Holy Cross,73.84,183.7,111.13,165.56,460.4,Single-ply,SBD,M
Boys,74.84,5,Edward Luna,San Antonio East Central,72.76,181.44,92.99,183.7,458.13,Single-ply,SBD,M
Boys,74.84,6,Coltin Bentley,Devine,73.21,183.7,97.52,176.9,458.13,Single-ply,SBD,M
Boys,74.84,7,Luis Perales,Carrizo Springs,67.4,165.56,102.06,188.24,455.86,Single-ply,SBD,M
Boys,74.84,8,Crispin Mercado,Carrizo Springs,69.85,170.1,95.25,181.44,446.79,Single-ply,SBD,M
Boys,74.84,9,John Reyes #1,Pearsall,69.85,124.74,99.79,206.38,430.91,Single-ply,SBD,M
Boys,74.84,10,Jacob Mies,Castroville Medina Valley,68.04,163.29,102.06,158.76,424.11,Single-ply,SBD,M
Boys,74.84,11,Gil Garcia,Crystal City,67.95,140.61,90.72,183.7,415.04,Single-ply,SBD,M
Boys,74.84,12,Matthew Garcia,San Antonio Holy Cross,70.4,154.22,77.11,165.56,396.89,Single-ply,SBD,M
Boys,74.84,13,Caden Fregia,Natalia,70.49,142.88,72.57,136.08,351.53,Single-ply,SBD,M
Boys,74.84,14,Isaiah Gomez,Natalia,73.12,142.88,70.31,136.08,349.27,Single-ply,SBD,M
Boys,74.84,15,Eric Gonzalez,Carrizo Springs,74.75,117.93,65.77,149.69,333.39,Single-ply,SBD,M
Boys,74.84,16,Francisco Arenas,Crystal City,68.49,111.13,68.04,149.69,328.85,Single-ply,SBD,M
Boys,74.84,17,Anthony Maldonado,La Pryor,69.13,117.93,74.84,136.08,328.85,Single-ply,SBD,M
Boys,74.84,18,Lorenzo Comacho,Uvalde,73.57,38.56,43.09,88.45,170.1,Single-ply,SBD,M
Boys,74.84,DQ,Martin Delgado,Pearsall,68.22,,,,,Single-ply,SBD,M
Boys,82.1,1,Tristin Burwell,Devine,82.1,210.92,140.61,174.63,526.17,Single-ply,SBD,M
Boys,82.1,2,Mark Sustaita,Castroville Medina Valley,81.1,188.24,115.67,204.12,508.02,Single-ply,SBD,M
Boys,82.1,3,Diego Garza,Pearsall,78.93,213.19,111.13,172.37,496.68,Single-ply,SBD,M
Boys,82.1,4,Jeremery Castillo,La Pryor,81.56,165.56,115.67,201.85,483.08,Single-ply,SBD,M
Boys,82.1,5,Adrian Sustaita,Castroville Medina Valley,77.29,172.37,99.79,185.97,458.13,Single-ply,SBD,M
Boys,82.1,6,Joseph Estevas,San Antonio East Central,79.47,158.76,97.52,176.9,433.18,Single-ply,SBD,M
Boys,82.1,7,Albert Gomez,Uvalde,81.1,156.49,97.52,176.9,430.91,Single-ply,SBD,M
Boys,82.1,8,Sergio Villarreal,Castroville Medina Valley,75.93,158.76,95.25,161.03,415.04,Single-ply,SBD,M
Boys,82.1,9,Louie Salazar,Carrizo Springs,76.29,163.29,92.99,158.76,415.04,Single-ply,SBD,M
Boys,82.1,10,Rene Romero,Crystal City,80.29,147.42,102.06,165.56,415.04,Single-ply,SBD,M
Boys,82.1,11,Steban Mireles,Castroville Medina Valley,79.92,149.69,90.72,140.61,381.02,Single-ply,SBD,M
Boys,82.1,12,Diego Pesina,La Pryor,79.56,113.4,52.16,120.2,285.76,Single-ply,SBD,M
Boys,89.81,1,Daniel Mann #2,Devine,88.09,217.72,151.95,215.46,585.13,Single-ply,SBD,M
Boys,89.81,2,AJ Camacho,Hondo,84.59,238.14,124.74,204.12,566.99,Single-ply,SBD,M
Boys,89.81,3,Tristan Rodriguez,San Antonio East Central,85.09,188.24,129.27,197.31,514.83,Single-ply,SBD,M
Boys,89.81,4,Michael Vasquez,Carrizo Springs,87.63,167.83,133.81,210.92,512.56,Single-ply,SBD,M
Boys,89.81,5,Derek Garcia,Uvalde,86.64,163.29,133.81,183.7,480.81,Single-ply,SBD,M
Boys,89.81,6,Julian Martinez,Natalia,89.36,176.9,95.25,190.51,462.66,Single-ply,SBD,M
Boys,89.81,7,Ethan Chapa,Center Point,89.18,181.44,102.06,156.49,439.98,Single-ply,SBD,M
Boys,89.81,8,Josh Cooper,Center Point,83.1,163.29,106.59,151.95,421.84,Single-ply,SBD,M
Boys,89.81,9,Jonathon Alvarado,Crystal City,87.63,129.27,83.91,142.88,356.07,Single-ply,SBD,M
Boys,89.81,10,Ariel Perez,Crystal City,87.91,102.06,72.57,136.08,310.71,Single-ply,SBD,M
Boys,89.81,11,Juan Oyevirdez,Carrizo Springs,86.09,104.33,52.16,131.54,288.03,Single-ply,SBD,M
Boys,89.81,12,Steven Musquiz,Crystal City,88.27,81.65,58.97,142.88,283.5,Single-ply,SBD,M
Boys,99.79,1,Jose Orellana,La Pryor,96.25,229.06,145.15,235.87,610.08,Single-ply,SBD,M
Boys,99.79,2,Issac Guzman,Castroville Medina Valley,93.17,204.12,142.88,208.65,555.65,Single-ply,SBD,M
Boys,99.79,3,Cristian Lopez,La Pryor,99.43,204.12,104.33,204.12,512.56,Single-ply,SBD,M
Boys,99.79,4,Tony Rivas,Brackettville Brackett,90.99,192.78,97.52,192.78,483.08,Single-ply,SBD,M
Boys,99.79,5,Joshua Cuevas,Pearsall,95.35,170.1,102.06,210.92,483.08,Single-ply,SBD,M
Boys,99.79,6,Anthony Garcia,Uvalde,91.99,170.1,95.25,199.58,464.93,Single-ply,SBD,M
Boys,99.79,7,Bo Perez,San Antonio Holy Cross,91.44,174.63,90.72,183.7,449.06,Single-ply,SBD,M
Boys,99.79,8,David Arvizo,La Pryor,90.99,163.29,108.86,163.29,435.45,Single-ply,SBD,M
Boys,99.79,9,Travis McGehee,Center Point,95.53,156.49,97.52,170.1,424.11,Single-ply,SBD,M
Boys,99.79,10,Alejandro Gonzalez,Crystal City,91.63,147.42,86.18,161.03,394.63,Single-ply,SBD,M
Boys,99.79,11,Austin Felan,Devine,91.35,158.76,102.06,129.27,390.09,Single-ply,SBD,M
Boys,99.79,12,Cruz Montez,Carrizo Springs,95.8,129.27,92.99,142.88,365.14,Single-ply,SBD,M
Boys,99.79,13,Dylan Lutz,Hondo,96.8,142.88,83.91,136.08,362.87,Single-ply,SBD,M
Boys,99.79,14,Bridger Netting,Castroville Medina Valley,92.71,138.35,79.38,,217.72,Single-ply,SB,M
Boys,99.79,DQ,Antonio Ramirez,Crystal City,98.97,188.24,97.52,,,Single-ply,SB,M
Boys,99.79,DQ,Eli Rejino,Devine,95.35,213.19,,,,Single-ply,SB,M
Boys,99.79,DQ,Emilio Alvarado,Crystal City,99.7,163.29,,,,Single-ply,SB,M
Boys,109.77,1,Andre Hernandez,Natalia,105.87,249.48,129.27,260.82,639.57,Single-ply,SBD,M
Boys,109.77,2,Jason Cortez,Uvalde,105.96,260.82,149.69,192.78,603.28,Single-ply,SBD,M
Boys,109.77,3,Ray Palomeque,Pearsall,107.77,208.65,129.27,240.4,578.33,Single-ply,SBD,M
Boys,109.77,4,Zachary Zavala,Crystal City,107.95,208.65,127.01,170.1,505.76,Single-ply,SBD,M
Boys,109.77,5,Jacob Esquibel,La Pryor,102.15,183.7,113.4,188.24,485.34,Single-ply,SBD,M
Boys,109.77,6,Brian Hernandez,Brackettville Brackett,106.87,183.7,79.38,176.9,439.98,Single-ply,SBD,M
Boys,109.77,7,Josh Alderete,Uvalde,105.41,102.06,65.77,117.93,285.76,Single-ply,SBD,M
Boys,124.74,1,Jp Ortiz,Devine,110.04,256.28,151.95,254.01,662.24,Single-ply,SBD,M
Boys,124.74,2,Austin Soto,Devine,116.94,238.14,183.7,204.12,625.96,Single-ply,SBD,M
Boys,124.74,3,Jose Mata,La Pryor,122.29,235.87,147.42,226.8,610.08,Single-ply,SBD,M
Boys,124.74,4,Santiago Leija,Natalia,113.13,204.12,127.01,215.46,546.58,Single-ply,SBD,M
Boys,124.74,5,Migel Garcia,Uvalde,117.66,185.97,117.93,217.72,521.63,Single-ply,SBD,M
Boys,124.74,6,Matthew Castro,Carrizo Springs,117.3,206.38,97.52,204.12,508.02,Single-ply,SBD,M
Boys,124.74,7,Bryce Long,San Antonio East Central,121.11,204.12,131.54,163.29,498.95,Single-ply,SBD,M
Boys,124.74,8,David DeLaRosa,Uvalde,116.94,158.76,102.06,197.31,458.13,Single-ply,SBD,M
Boys,124.74,9,Nathan Pearson,Brackettville Brackett,121.74,165.56,90.72,183.7,439.98,Single-ply,SBD,M
Boys,124.74,10,Oscar Ramirez,Natalia,110.13,183.7,92.99,161.03,437.72,Single-ply,SBD,M
Boys,124.74,11,Jose Morales,Crystal City,117.12,174.63,92.99,149.69,417.3,Single-ply,SBD,M
Boys,124.74,DQ,Lupe Tellez,La Pryor,121.83,183.7,,,,Single-ply,SBD,M
Boys,124.74+,1,Drew Kirkpatrick,Uvalde,139.07,272.16,204.12,249.48,725.75,Single-ply,SBD,M
Boys,124.74+,2,Mario Chavez,Carrizo Springs,185.25,222.26,179.17,213.19,614.62,Single-ply,SBD,M
Boys,124.74+,3,Mark Garcia,Brackettville Brackett,127.46,233.6,138.35,233.6,605.55,Single-ply,SBD,M
Boys,124.74+,4,Jon Lara,Natalia,132.36,233.6,113.4,204.12,551.11,Single-ply,SBD,M
Boys,124.74+,5,Rolando DeLuna,Castroville Medina Valley,130.45,233.6,113.4,192.78,539.77,Single-ply,SBD,M
Boys,124.74+,6,Mike Kessler,Castroville Medina Valley,137.26,199.58,113.4,183.7,496.68,Single-ply,SBD,M
Boys,,NS,Leo Martinez,Center Point,,,,,,Single-ply,SBD,M
Boys,,NS,Matthew Henry #2,Center Point,,,,,,Single-ply,SBD,M
Boys,,NS,Josh Guerra,Castroville Medina Valley,,,,,,Single-ply,SBD,M
Boys,,NS,Krystafer Moreno,La Pryor,,,,,,Single-ply,SBD,M
Boys,,NS,Gage Cross,Hondo,,,,,,Single-ply,SBD,M
Boys,,NS,Jose Nuno,Devine,,,,,,Single-ply,SBD,M
Boys,,NS,Hayden Burwell,Devine,,,,,,Single-ply,SBD,M
Boys,,NS,Edward Gonzalez,Crystal City,,,,,,Single-ply,SBD,M
Boys,,NS,Pablo Valadez,Center Point,,,,,,Single-ply,SBD,M
Boys,,NS,Daniel Martin,Center Point,,,,,,Single-ply,SBD,M
Boys,,NS,Jorge Saldana,Natalia,,,,,,Single-ply,SBD,M
Boys,,NS,Mike Salazar,La Pryor,,,,,,Single-ply,SBD,M
Boys,,NS,Ray Navarro,Natalia,,,,,,Single-ply,SBD,M
Boys,,NS,Manuel Saldana,Natalia,,,,,,Single-ply,SBD,M
Boys,,NS,Hector Soria,San Antonio East Central,,,,,,Single-ply,SBD,M
Boys,,NS,Nick Whitley,San Antonio East Central,,,,,,Single-ply,SBD,M
Boys,,NS,Emry Flores,Rocksprings,,,,,,Single-ply,SBD,M
Boys,,NS,Jorge Ortiz,Uvalde,,,,,,Single-ply,SBD,M
Boys,,NS,Michael Gutierrerz,San Antonio East Central,,,,,,Single-ply,SBD,M
Boys,,NS,Eduardo De La Garza,San Antonio East Central,,,,,,Single-ply,SBD,M
Boys,,NS,Christian Campos,Uvalde,,,,,,Single-ply,SBD,M
Boys,,NS,Matthew Olivarez,Uvalde,,,,,,Single-ply,SBD,M
Boys,,NS,Estevan Rodriguez,Uvalde,,,,,,Single-ply,SBD,M
