Place,Name,Sex,BirthDate,Age,Equipment,Division,BodyweightKg,WeightClassKg,Squat1Kg,Squat2Kg,Squat3Kg,Best3SquatKg,Bench1Kg,Bench2Kg,Bench3Kg,Best3BenchKg,Deadlift1Kg,Deadlift2Kg,Deadlift3Kg,Best3DeadliftKg,TotalKg,Event,Team
1,Amanda Parish,F,1978-05-16,42,Raw,Masters 1,56.5,57,85,92.5,97.5,97.5,60,65,-68,65,110,115,122.5,122.5,285,SBD,Auckland
1,Carolyn McAulay,F,1976-07-09,44,Raw,Masters 1,61.8,63,102.5,110,-112.5,110,65,70,-72.5,70,135,145,-155.5,145,325,SBD,Wellington & Central
DQ,Anita Broczek,F,1977-10-16,42,Raw,Masters 1,61.1,63,105,-110,-110,105,-65,-67.5,-67.5,,120,125,130,130,,SBD,Wellington & Central
1,Roshelle Jessop,F,1975-11-09,44,Raw,Masters 1,70.6,72,132.5,140,147.5,147.5,85,90,-92.5,90,170,180,190.5,190.5,428,SBD,Canterbury
2,Jennie Hopkinson,F,1973-09-22,47,Raw,Masters 1,68.1,72,112.5,-120,120,120,62.5,65,67.5,67.5,155,160,165,165,352.5,SBD,Wellington & Central
1,Frances Graham,F,1971-03-30,49,Raw,Masters 1,79.1,84,110,120,-130,120,60,65,-67.5,65,130,145,155,155,340,SBD,Waikato & BOP
G,Kelly Wilson #1,F,1978-10-20,41,Raw,Masters 1,72.1,84,110,117.5,122.5,122.5,67.5,72.5,-75,72.5,155,165,-167.5,165,360,SBD,Wellington & Central
1,Ali Cosner,F,1971-05-21,49,Raw,Masters 1,91.6,84+,115,125,140,140,70,-77.5,-77.5,70,170,180,-185,180,390,SBD,Northland
2,Sharron Emslie,F,1976-12-15,43,Raw,Masters 1,161.6,84+,-125,130,-137.5,130,65,-70,-70,65,140,150,162.5,162.5,357.5,SBD,Canterbury
3,Fiona Park,F,1977-05-25,43,Raw,Masters 1,87.87,84+,130,135,142.5,142.5,75,77.5,-80,77.5,130,135,-140,135,355,SBD,Southern
4,Travette Pram,F,1976-09-26,44,Raw,Masters 1,134.25,84+,-110,115,-125,115,52.5,57.5,60,60,137.5,147.5,-152.5,147.5,322.5,SBD,Auckland
1,Anna Clarke,F,1968-01-04,52,Raw,Masters 2,56.15,57,90,-100,-100,90,50,55,-57.5,55,110,117.5,127.5,127.5,272.5,SBD,Waikato & BOP
2,Romelia Goodin,F,1970-10-15,49,Raw,Masters 2,55.55,57,70,75,80,80,50,55,-60,55,100,-110,-112.5,100,235,SBD,Waikato & BOP
1,Billie Mudie,F,1969-11-26,50,Raw,Masters 2,71.4,72,75,82.5,90,90,40,45,-47.5,45,122.5,130,-135,130,265,SBD,Wellington & Central
2,Kerstin Lawrenz,F,1964-08-18,56,Raw,Masters 2,64.85,72,-55,-55,55,55,50,52.5,55,55,-90,90,100,100,210,SBD,Auckland
1,Tracy Chipping,F,1961-05-06,59,Raw,Masters 2,81.75,84,121,125,128,128,65,67.5,-70,67.5,135,140,145,145,340.5,SBD,Southern
2,Natasha Clarke #2,F,1968-10-10,51,Raw,Masters 2,81.85,84,115,120,-126,120,67.5,70,72.5,72.5,135,142.5,-150,142.5,335,SBD,Canterbury
3,Sue Taylor,F,1963-04-26,57,Raw,Masters 2,83.3,84,95,100,105,105,47.5,50,52.5,52.5,125,132.5,-140,132.5,290,SBD,Wellington & Central
4,Rachel Kann,F,1966-03-31,54,Raw,Masters 2,76.95,84,70,77.5,82.5,82.5,40,-45,-47.5,40,110,120,125,125,247.5,SBD,Auckland
1,Ngahine Lum,F,1968-02-28,52,Raw,Masters 2,106.25,84+,85,-90,-90,85,70,80,-87.5,80,-120,120,135,135,300,SBD,Northland
1,Trish Muldrock,F,1954-11-19,65,Raw,Masters 3,46,47,62.5,67.5,72.5,72.5,52.5,55,-57.5,55,105,112.5,117.5,117.5,245,SBD,Northland
1,Julianne Taylor,F,1959-08-23,61,Raw,Masters 3,51.75,52,87.5,93,95.5,95.5,50,55,-57.5,55,107.5,115,-117.5,115,265.5,SBD,Auckland
1,Catherine Menzies,F,1960-09-22,60,Raw,Masters 3,62.1,63,85,91,-92.5,91,62.5,-67,-67,62.5,110,115,-117.5,115,268.5,SBD,Waikato & BOP
1,Lesley Procter,F,1956-08-06,64,Raw,Masters 3,71.6,72,97.5,-105,-105,97.5,57.5,60.5,-62.5,60.5,130,135,-140,135,293,SBD,Southern
2,Margaret Bastion,F,1953-12-01,66,Raw,Masters 3,71.7,72,91,95,-100,95,25,27.5,30,30,120,127.5,132.5,132.5,257.5,SBD,Wellington & Central
3,Colleen Cadman,F,1954-02-09,66,Raw,Masters 3,69.1,72,60,65,-70,65,45,50,-55,50,85,92.5,95,95,210,SBD,Waikato & BOP
1,Cherry Wilson,F,1950-12-03,69,Raw,Masters 4,56.5,57,78,80.5,82.5,82.5,37.5,40.5,41.5,41.5,100,106,108,108,232,SBD,Auckland
1,Andrei Richardson,M,1978-12-14,41,Raw,Masters 1,64.45,66,152.5,-160,160,160,105,-112.5,-112.5,105,200,207.5,212.5,212.5,477.5,SBD,Auckland
1,David Cooper #1,M,1977-08-26,43,Raw,Masters 1,80.55,83,185,195,-202.5,195,105,110,-115,110,235,245,255,255,560,SBD,Southern
1,Alex Flint,M,1978-01-08,42,Raw,Masters 1,91.95,93,200,210,217.5,217.5,132.5,137.5,-140,137.5,222.5,237.5,245,245,600,SBD,Auckland
2,Quintin Harriman,M,1977-04-26,43,Raw,Masters 1,92.45,93,180,190,-195,190,120,130,-135,130,220,230,-235,230,550,SBD,Auckland
3,Richard Best,M,1975-12-08,44,Raw,Masters 1,88.3,93,167.5,177.5,185,185,137.5,142.5,147.5,147.5,182.5,195,205,205,537.5,SBD,Wellington & Central
1,Darren Neves,M,1980-11-10,39,Raw,Masters 1,104.95,105,240,255,262.5,262.5,140,147.5,152.5,152.5,250,272.5,285,285,700,SBD,Auckland
2,Edwin Ng,M,1979-05-03,41,Raw,Masters 1,104.5,105,225,245,255,255,115,125,-132.5,125,-260,277.5,-287.5,277.5,657.5,SBD,Auckland
3,Andrew Penny,M,1974-02-02,46,Raw,Masters 1,95.75,105,140,155,170,170,125,130,-135,130,220,235,-250,235,535,SBD,Northland
4,Vince Taylor,M,1977-01-09,43,Raw,Masters 1,104.95,105,147.5,157.5,162.5,162.5,120,127.5,130,130,192.5,202.5,210,210,502.5,SBD,Canterbury
5,Peter Bevington,M,1979-09-19,41,Raw,Masters 1,104.3,105,220,-232.5,,220,165,171,-175.5,171,60,,,60,451,SBD,Waikato & BOP
1,Sani Sanileva,M,1974-05-19,46,Raw,Masters 1,118.6,120,225,227.5,240,240,147.5,155,160,160,225,235,240,240,640,SBD,Auckland
2,Paul MacManus,M,1973-10-10,46,Raw,Masters 1,114.5,120,175,190,200,200,142.5,152.5,155,155,180,200,215,215,570,SBD,Wellington & Central
1,Craig Smith #1,M,1978-07-12,42,Raw,Masters 1,131.4,120+,197.5,215,222.5,222.5,147.5,157.5,162.5,162.5,250,272.5,285,285,670,SBD,Canterbury
1,Tecwyn Williamson,M,1966-08-01,54,Raw,Masters 2,73.85,74,185,-198,198,198,120,-131.5,-131.5,120,205,-207.5,-223,205,523,SBD,Canterbury
2,Everitt Johnson,M,1968-04-26,52,Raw,Masters 2,73.85,74,-135,135,140,140,90,95,97.5,97.5,175,185,-190,185,422.5,SBD,Auckland
3,John Crawford-Smith,M,1962-06-21,58,Raw,Masters 2,72.75,74,130,140,145,145,75,80,82.5,82.5,150,160,-167.5,160,387.5,SBD,Wellington & Central
1,Robb Graham,M,1968-08-14,52,Raw,Masters 2,80.55,83,160,170,-180,170,100,105,-107.5,105,205,220,231,231,506,SBD,Waikato & BOP
1,Craig McMillan,M,1969-11-15,50,Raw,Masters 2,92.65,93,215,225,230,230,70,80,95,95,245.5,260,267.5,267.5,592.5,SBD,Wellington & Central
2,Rob MacKenzie,M,1967-08-29,53,Raw,Masters 2,86.95,93,145,155,162.5,162.5,97.5,102.5,107.5,107.5,172.5,182.5,192.5,192.5,462.5,SBD,Canterbury
DQ,Chad Anderson,M,1966-07-15,54,Raw,Masters 2,92.75,93,-195,-195,-195,,115,120,-125,120,217.5,227.5,-230,227.5,,SBD,Waikato & BOP
1,Les Laban,M,1969-11-09,50,Raw,Masters 2,104.65,105,215,227.5,232.5,232.5,132.5,137.5,140,140,245,265,275,275,647.5,SBD,Auckland
DQ,Mark Farrell,M,1969-08-26,51,Raw,Masters 2,104.5,105,-100,-100,-100,,125,-132.5,137.5,137.5,,,,,,SBD,Wellington & Central
1,Geoffrey Holmes,M,1961-10-14,58,Raw,Masters 2,141.9,120+,-210,220,230,230,110,120,-125,120,210,225,240,240,590,SBD,Wellington & Central
1,Kevin Strachan,M,1954-12-10,65,Raw,Masters 3,65.7,66,120,125,-130.5,125,70,75,80,80,150,160,165,165,370,SBD,Auckland
1,Stephen Pickens,M,1957-10-21,62,Raw,Masters 3,70.05,74,132.5,140,145,145,75,85,90,90,175,190,201.5,201.5,436.5,SBD,Northland
2,Philip Crosbie,M,1957-10-22,62,Raw,Masters 3,72.2,74,-135,140,152.5,152.5,65,-70,70,70,150,160,-165,160,382.5,SBD,Auckland
1,Norman Tepa Sr,M,,,Raw,Masters 3,88.8,93,205,210,-215,210,125,132.5,-135,132.5,-215,215,225,225,567.5,SBD,Auckland
2,Roger Gedye,M,1956-04-17,64,Raw,Masters 3,92.25,93,152.5,162.5,172.5,172.5,110,115,-120,115,225,240,-246,240,527.5,SBD,Auckland
1,Junior Opetaia,M,1960-04-27,60,Raw,Masters 3,112.3,120,130,-140,-140,130,-90,90,100,100,170,177.5,-185,177.5,407.5,SBD,Canterbury
1,Peter Lane,M,1949-08-23,71,Raw,Masters 4,91,93,50,65,-80,65,77.5,85,-87.5,85,90,110,-117.5,110,260,SBD,Auckland
1,Scott Parsons,M,1978-10-20,41,Single-ply,Masters 1,103.2,105,180,210,,210,225,235,-245,235,240,290,-300,290,735,SBD,Waikato & BOP
1,Tony Urlich,M,1960-01-31,60,Single-ply,Masters 3,92.4,93,150,160,-170,160,115,120,-125,120,180,190,-200,190,470,SBD,Northland
1,Rosie Luo,F,2000-09-01,20,Raw,Juniors,46.7,47,77.5,82.5,85,85,47.5,50,52.5,52.5,100,107.5,112.5,112.5,250,SBD,Auckland
1,Dana Ye-Lee,F,1999-07-27,21,Raw,Juniors,52,52,110,117.5,-120,117.5,72.5,75,-77.5,75,140,150,157.5,157.5,350,SBD,Auckland
2,Natalya Dalley,F,1999-01-24,21,Raw,Juniors,51.9,52,97.5,102.5,105,105,47.5,50,52.5,52.5,112.5,120,125,125,282.5,SBD,Wellington & Central
1,Veronica Manning,F,1999-04-20,21,Raw,Juniors,62.85,63,112.5,117.5,120,120,72.5,75,-77.5,75,152.5,162.5,170.5,170.5,365.5,SBD,Auckland
1,Elsie Petrie-Taylor,F,1998-05-16,22,Raw,Juniors,67.55,72,115,125,-130,125,52.5,60,-62.5,60,130,145,155,155,340,SBD,Canterbury
1,Emily Giles-Rosanowski,F,1997-04-01,23,Raw,Juniors,76.65,84,152.5,-160,160,160,95,100,-102.5,100,175,185,192.5,192.5,452.5,SBD,Canterbury
1,Brooke Rowbotham,F,1999-06-20,21,Raw,Juniors,130.95,84+,150,160,170,170,90,-95,-97.5,90,140,150,160,160,420,SBD,Canterbury
2,Romy Lee,F,1998-01-05,22,Raw,Juniors,98.75,84+,145,155,-160,155,70,77.5,82.5,82.5,145,155,-165,155,392.5,SBD,Auckland
3,Sara Farrell,F,2001-06-06,19,Raw,Juniors,90.05,84+,125,135,142.5,142.5,65,70,72.5,72.5,150,157.5,165,165,380,SBD,Wellington & Central
1,Zaviera McMillan,F,2005-05-23,15,Raw,Sub-Juniors,56.35,57,92.5,102.5,107.5,107.5,50.5,58,64,64,100,107.5,113.5,113.5,285,SBD,Wellington & Central
1,Zoe Perkins,F,2002-06-18,18,Raw,Sub-Juniors,62.8,63,135,142.5,-147.5,142.5,65,67.5,70,70,145,152.5,157.5,157.5,370,SBD,Auckland
2,Samantha Thoumine,F,2003-09-23,17,Raw,Sub-Juniors,61.8,63,100,102.5,-105,102.5,45,52.5,-55,52.5,120,135,-140,135,290,SBD,Northland
1,Grace Parquist,F,2004-05-15,16,Raw,Sub-Juniors,92.6,84+,105,115,-125,115,50,55,60,60,107.5,120,130,130,305,SBD,Waikato & BOP
1,Zako Fong,M,1998-08-14,22,Raw,Juniors,65,66,155,160,-170,160,-115,115,120,120,200,-210,210,210,490,SBD,Southern
2,Gideon Diaros,M,1998-09-22,22,Raw,Juniors,65.35,66,150,160,-165,160,85,-87.5,87.5,87.5,180,190,-192.5,190,437.5,SBD,Auckland
1,Ben Calder-Lee,M,2001-09-10,19,Raw,Juniors,73.55,74,200,210,215,215,125,130,-132.5,130,230,242.5,-250,242.5,587.5,SBD,Canterbury
2,Judah Pelaco,M,1997-06-05,23,Raw,Juniors,71.85,74,165,175,182.5,182.5,120,125,-127.5,125,217.5,227.5,235,235,542.5,SBD,Wellington & Central
3,Chi-Yu Yang,M,1998-02-12,22,Raw,Juniors,71.45,74,152.5,162.5,170,170,140,-145,-145,140,170,182.5,-195,182.5,492.5,SBD,Auckland
4,Hemi Ormsby,M,2000-01-28,20,Raw,Juniors,72.8,74,150,165,170,170,100,-105,-105,100,210,-232.5,-232.5,210,480,SBD,Waikato & BOP
5,Beaden Overington,M,2001-08-03,19,Raw,Juniors,71.15,74,160,167.5,172.5,172.5,97.5,102.5,-107.5,102.5,190,-200,-200,190,465,SBD,Waikato & BOP
1,Mahaki Koopu,M,1998-08-24,22,Raw,Juniors,82,83,245,260,267.5,267.5,152.5,155,157.5,157.5,265,282.5,-292.5,282.5,707.5,SBD,Canterbury
2,Joshua Perkins,M,1997-01-07,23,Raw,Juniors,83,83,220,232.5,240,240,150,155,157.5,157.5,245,265,272.5,272.5,670,SBD,Auckland
3,Thomas Delamore,M,1999-11-04,20,Raw,Juniors,81.7,83,180,190,-197.5,190,107.5,112.5,-117.5,112.5,222.5,232.5,242.5,242.5,545,SBD,Auckland
4,Mitchell Kennedy,M,1997-01-24,23,Raw,Juniors,82.85,83,190,202.5,-210,202.5,107.5,-112.5,-112.5,107.5,220,230,235,235,545,SBD,Waikato & BOP
5,Alex Gaimster,M,1999-08-09,21,Raw,Juniors,79.3,83,180,182.5,190,190,-117.5,117.5,122.5,122.5,210,220,225,225,537.5,SBD,Southern
6,Dylan Bellam,M,2001-06-12,19,Raw,Juniors,79.05,83,180,190,-200,190,100,107.5,110,110,210,-220,-220,210,510,SBD,Canterbury
7,Joseph Hong,M,1998-04-09,22,Raw,Juniors,80.55,83,170,175,-180,175,110,115,-117.5,115,205,215,-220,215,505,SBD,Auckland
8,Bradley Caffell,M,1997-03-10,23,Raw,Juniors,80.85,83,135,142.5,145,145,97.5,-102.5,-102.5,97.5,177.5,-187.5,187.5,187.5,430,SBD,Southern
DQ,Paora Winika,M,2000-01-23,20,Raw,Juniors,81.45,83,-205,-205,-205,,135,,,135,220,222.5,-230,222.5,,SBD,Wellington & Central
DQ,Jayden Robinson,M,1997-07-11,23,Raw,Juniors,82.85,83,-160,-160,-160,,,,,,,,,,,SBD,Canterbury
DQ,Josh McWilliam,M,2003-03-31,17,Raw,Sub-Juniors,58.45,59,90,-100,100,100,-92.5,-98.5,-98.5,,100,-102.5,,100,,SBD,Waikato & BOP
1,Kenny Liang,M,2002-02-21,18,Raw,Sub-Juniors,63.95,66,132.5,-137.5,137.5,137.5,82.5,87.5,92.5,92.5,157.5,162.5,-170,162.5,392.5,SBD,Auckland
1,Ethan Watt,M,2003-06-17,17,Raw,Sub-Juniors,72.45,74,167.5,-170,185,185,95,102.5,110,110,187.5,200,207.5,207.5,502.5,SBD,Southern
2,Levi Greening,M,2002-12-29,17,Raw,Sub-Juniors,71.5,74,170,180,-190,180,115,117.5,-122.5,117.5,180,190,-200,190,487.5,SBD,Canterbury
3,Malachi Vaifale,M,2005-05-15,15,Raw,Sub-Juniors,71.3,74,115,125,132.5,132.5,65,70,75,75,147.5,157.5,167.5,167.5,375,SBD,Auckland
1,Henry Chapman,M,2003-04-04,17,Raw,Sub-Juniors,81.65,83,160,175,185,185,100,-107.5,-107.5,100,220,230,-242.5,230,515,SBD,Canterbury
2,Ashton Cooke,M,2003-12-26,16,Raw,Sub-Juniors,82,83,160,170,180,180,90,95,-100,95,195,-205,205,205,480,SBD,Wellington & Central
3,Ngakau Howell,M,2003-03-11,17,Raw,Sub-Juniors,82.85,83,135,-145,-145,135,85,95,-100,95,-220,220,-243,220,450,SBD,Canterbury
1,Heath Graham,M,2002-08-23,18,Raw,Sub-Juniors,92.75,93,217.5,-225.5,230.5,230.5,132.5,137.5,142.5,142.5,245,257.5,270.5,270.5,643.5,SBD,Waikato & BOP
2,Bede Alexander,M,2002-01-26,18,Raw,Sub-Juniors,92.85,93,217.5,225,-236,225,152.5,160.5,163,163,230,255,-265,255,643,SBD,Canterbury
3,Harry Milligan,M,2002-05-17,18,Raw,Sub-Juniors,87.45,93,187.5,195,-197.5,195,-112.5,-112.5,112.5,112.5,225,240,-250,240,547.5,SBD,Southern
1,Theo Maddox,M,2002-10-12,17,Raw,Sub-Juniors,119.35,120,232.5,247.5,-262.5,247.5,130,140,147.5,147.5,275,290,-300,290,685,SBD,Waikato & BOP
2,Hōne Williams,M,2006-05-30,14,Raw,Sub-Juniors,116.35,120,-200,200,-205,200,110,-115,115,115,190,205,-215,205,520,SBD,Northland
1,Megan-Li Smith,F,1996-04-13,24,Raw,Open,46.65,47,120,127.5,135,135,62.5,65,-67.5,65,140,150,-155,150,350,SBD,Canterbury
1,Sara Surtees,F,1981-08-05,39,Raw,Open,50.1,52,122.5,130,-132.5,130,57.5,-62.5,-62.5,57.5,142.5,-150,-150,142.5,330,SBD,Wellington & Central
2,Esther Tukua,F,1997-08-13,23,Raw,Open,50.1,52,105,107.5,110,110,52.5,55,-57.5,55,132.5,135,142.5,142.5,307.5,SBD,Wellington & Central
3,Jenny Sheng,F,1992-06-27,28,Raw,Open,51.55,52,90,95,-97.5,95,67.5,70,-72.5,70,132.5,142.5,-145,142.5,307.5,SBD,Auckland
1,Evie Corrigan,F,1996-04-09,24,Raw,Open,55.95,57,160,168,-171,168,90,94,96.5,96.5,185,193,200,200,464.5,SBD,Auckland
2,Holly Jenkins,F,1992-12-03,27,Raw,Open,56.4,57,132.5,137.5,142.5,142.5,57.5,62.5,65,65,147.5,157.5,-160,157.5,365,SBD,Wellington & Central
3,Megan Jeffery,F,1981-10-27,38,Raw,Open,56.7,57,97.5,-105,105,105,72.5,77.5,80,80,132.5,142.5,-147.5,142.5,327.5,SBD,Southern
4,Ashliegh Sargison,F,1996-08-08,24,Raw,Open,56.65,57,112.5,117.5,120,120,55,57.5,60,60,127.5,132.5,-137.5,132.5,312.5,SBD,Wellington & Central
5,Stephanie Dorreen,F,1996-07-11,24,Raw,Open,54.8,57,95,100,102.5,102.5,55,57.5,60,60,125,132.5,140,140,302.5,SBD,Canterbury
1,Sarah Menzies,F,1992-08-08,28,Raw,Open,62.9,63,142.5,150,152.5,152.5,91,94,-96,94,175,189,-193,189,435.5,SBD,Auckland
2,Courtney Weir,F,1988-10-25,31,Raw,Open,62.5,63,127.5,135,145,145,75,82.5,87.5,87.5,155,165,170,170,402.5,SBD,Auckland
3,Amy-Lee Owen,F,1995-09-09,25,Raw,Open,62.3,63,132.5,140,-142.5,140,85,87.5,90,90,145,155,160,160,390,SBD,Auckland
4,Katie Lin,F,1989-11-22,30,Raw,Open,62.25,63,127.5,135,137.5,137.5,70,72.5,75,75,145,155,-165,155,367.5,SBD,Auckland
5,Jolly Ng,F,1993-02-23,27,Raw,Open,62.95,63,115,122.5,127.5,127.5,62.5,65,70,70,135,145,-150,145,342.5,SBD,Auckland
6,Namrata Rai,F,1981-01-25,39,Raw,Open,61.55,63,100,-105,105,105,52.5,55,57.5,57.5,125,132.5,-137.5,132.5,295,SBD,Auckland
1,Hema Govind,F,1996-10-06,24,Raw,Open,71.75,72,170,180,,180,92.5,97.5,100,100,180,190,-192.5,190,470,SBD,Canterbury
2,Casey O'Malley,F,1990-11-14,29,Raw,Open,70.4,72,150,157.5,-160,157.5,95,97.5,100,100,192.5,201.5,-212.5,201.5,459,SBD,Canterbury
3,Amanda Wallstrom,F,1995-08-14,25,Raw,Open,71.35,72,147.5,155,-160,155,80,85,-87.5,85,150,160,-165,160,400,SBD,Auckland
4,Anna Claire Thompson,F,1981-01-14,39,Raw,Open,70.75,72,117.5,125,132.5,132.5,77.5,82.5,-85,82.5,152.5,165,175,175,390,SBD,Southern
5,Fran Milner,F,1987-09-26,33,Raw,Open,72,72,117.5,125,-130,125,82.5,87.5,92.5,92.5,145,155,162.5,162.5,380,SBD,Northland
6,Apikera Thomas,F,1981-05-25,39,Raw,Open,70.65,72,122.5,130,-132.5,130,75,80,82.5,82.5,145,155,162.5,162.5,375,SBD,Northland
7,Chanel Williams,F,1995-11-09,24,Raw,Open,70.6,72,112.5,120,127.5,127.5,87.5,92.5,-95,92.5,135,142.5,152.5,152.5,372.5,SBD,Canterbury
DQ,Lagi Naomi Fruean,F,1990-10-26,29,Raw,Open,70,72,152.5,157.5,-162.5,157.5,-75,-77.5,-77.5,,165,175,180,180,,SBD,Auckland
1,Gwen Douglas,F,1989-11-16,30,Single-ply,Open,69.4,72,165,-172.5,-172.5,165,95,100,-105,100,165,175,-180,175,440,SBD,Canterbury
1,Eli Abouchaaya,M,1998-03-05,22,Raw,Juniors,93,93,240,250,257.5,257.5,155,162.5,167.5,167.5,240,255,262.5,262.5,687.5,SBD,Auckland
2,Dillon Carroll,M,2000-11-06,19,Raw,Juniors,91.9,93,225,240,-250,240,175,-182.5,-185.5,175,250,265,-272.5,265,680,SBD,Auckland
3,Jacob MacKinnon,M,1997-03-06,23,Raw,Juniors,92.5,93,230,245,-255,245,140,150,155,155,235,250,-287.5,250,650,SBD,Wellington & Central
4,Daniel Caughley,M,1997-04-08,23,Raw,Juniors,91.2,93,190,200,207.5,207.5,137.5,142.5,-145,142.5,222.5,237.5,245,245,595,SBD,Canterbury
5,Raffy Dio,M,2001-04-23,19,Raw,Juniors,91.9,93,205,220,-227.5,220,117.5,125,-130,125,230,-242.5,-242.5,230,575,SBD,Auckland
6,William Graham,M,2000-06-13,20,Raw,Juniors,90.05,93,185,195,-205,195,132.5,137.5,140,140,195,207.5,212.5,212.5,547.5,SBD,Southern
7,Harrison Breen-Howley,M,1997-10-18,22,Raw,Juniors,92.85,93,180,190,-200,190,120,127.5,130,130,200,215,-227.5,215,535,SBD,Wellington & Central
1,Sean King,M,1998-07-07,22,Raw,Juniors,103.6,105,210,220,227.5,227.5,132.5,140,-145,140,240,255,-260,255,622.5,SBD,Auckland
2,Liam Andersen,M,1997-02-18,23,Raw,Juniors,101.95,105,207.5,217.5,-230,217.5,117.5,125,127.5,127.5,215,225,-227.5,225,570,SBD,Wellington & Central
3,Lachie McWilliam,M,2000-02-25,20,Raw,Juniors,98.9,105,175,185,-200,185,107.5,115,-120,115,220,230,240,240,540,SBD,Waikato & BOP
4,Hamish McWilliam,M,2000-02-25,20,Raw,Juniors,95.15,105,165,180,-200,180,105,110,115,115,220,230,-240,230,525,SBD,Waikato & BOP
G,Seth Stuart,M,1997-09-30,23,Raw,Juniors,95.8,105,187.5,200,212.5,212.5,125,-132.5,-132.5,125,257.5,275,-290,275,612.5,SBD,Waikato & BOP
G,Liam Duston,M,2000-10-30,19,Raw,Juniors,97.2,105,192.5,205,215,215,132.5,137.5,-140,137.5,200,215,225,225,577.5,SBD,Auckland
DQ,Richard De Reeper,M,1998-04-16,22,Raw,Juniors,118.3,120,225,235,245,245,-175,-175,-175,,285,-295,-295,285,,SBD,Canterbury
1,Terry Malofou,M,1998-10-20,21,Raw,Juniors,145,120+,270,290,300,300,217.5,230,-235,230,300,330,-342.5,330,860,SBD,Auckland
2,David Bell #1,M,2000-02-04,20,Raw,Juniors,153.4,120+,275,290,,290,150,160,170,170,197.5,220,240,240,700,SBD,Auckland
1,Michael Murray #1,M,1993-08-19,27,Raw,Open,56.9,59,137.5,147.5,155,155,87.5,95,-100,95,190,200,210.5,210.5,460.5,SBD,Canterbury
2,Ryan Stewart #1,M,1985-10-08,34,Raw,Open,57.25,59,87.5,95,-100,95,67.5,72.5,75,75,120,130,140,140,310,SBD,Southern
1,Vivian Washington,M,1996-01-22,24,Raw,Open,65.7,66,195,205,212.5,212.5,142.5,-147.5,147.5,147.5,225,242.5,255.5,255.5,615.5,SBD,Auckland
2,Will Hemmington,M,1998-10-18,21,Raw,Open,66,66,172.5,177.5,-180,177.5,132.5,140,145,145,217.5,-227.5,-227.5,217.5,540,SBD,Auckland
3,Van Cuong Nguyen,M,1984-09-01,36,Raw,Open,65.9,66,165,172.5,-177.5,172.5,120,125,130,130,200,212.5,220,220,522.5,SBD,Wellington & Central
4,Sheng Choong Kwan,M,1994-07-30,26,Raw,Open,65.5,66,172.5,182.5,187.5,187.5,115,120,122.5,122.5,200,210,-220,210,520,SBD,Auckland
5,Menuka Pilapitiya,M,1991-10-12,28,Raw,Open,66,66,165,172.5,177.5,177.5,120,125,130,130,192.5,202.5,210,210,517.5,SBD,Auckland
6,Ali Abbas,M,1996-10-09,23,Raw,Open,63.85,66,172.5,182.5,192.5,192.5,107.5,-112.5,-115,107.5,195,-205,-205,195,495,SBD,Canterbury
7,Kale Thompson,M,1991-01-10,29,Raw,Open,65.2,66,142.5,150,-155,150,110,115,117.5,117.5,192.5,202.5,-210,202.5,470,SBD,Southern
G,Jade Sutton,M,1996-06-17,24,Raw,Open,59.6,66,85,92.5,100,100,50,-55,60,60,105,120,-125,120,280,SBD,Waikato & BOP
1,Chris Kennedy #1,M,1992-09-24,28,Raw,Open,73.7,74,265,-276,-276,265,165,171.5,-176,171.5,282.5,292.5,-301,292.5,729,SBD,Auckland
2,Gary Cheng,M,1992-10-15,27,Raw,Open,73.7,74,192.5,202.5,207.5,207.5,130,135,140,140,217.5,-227.5,-227.5,217.5,565,SBD,Auckland
3,Hamish McAllister,M,1986-11-06,33,Raw,Open,73.6,74,170,177.5,185,185,135,140,145,145,200,210,220,220,550,SBD,Wellington & Central
4,Brandon Twigley,M,1992-01-22,28,Raw,Open,70.95,74,170,180,185,185,142.5,-150,-150,142.5,205,215,-220,215,542.5,SBD,Wellington & Central
5,Jordan Morland,M,1994-08-10,26,Raw,Open,74,74,150,160,165,165,105,112.5,-115,112.5,200,212.5,220,220,497.5,SBD,Auckland
6,Matthew Voice,M,1991-11-26,28,Raw,Open,73.3,74,150,160,-165,160,100,105,-110,105,170,180,185,185,450,SBD,Canterbury
1,Timothy Monigatti,M,1996-12-06,23,Raw,Open,80.05,83,270,287.5,-295,287.5,-165,165,-172.5,165,300,310,-320,310,762.5,SBD,Waikato & BOP
2,Alex Sun,M,1996-10-15,23,Raw,Open,82.65,83,-220,220,240,240,142.5,150,155,155,280,-305,-305,280,675,SBD,Southern
3,Jamie Campbell,M,1994-12-16,25,Raw,Open,82.05,83,217.5,230,237.5,237.5,150,157.5,160,160,245,260,-277.5,260,657.5,SBD,Southern
4,Joel Larter,M,1992-10-21,27,Raw,Open,82.85,83,217.5,-230,230,230,150,157.5,162.5,162.5,235,252.5,-267.5,252.5,645,SBD,Auckland
5,Sumner Maxwell-Brown,M,1995-08-11,25,Raw,Open,80.3,83,212.5,-225,225,225,132.5,137.5,142.5,142.5,240,260,267.5,267.5,635,SBD,Auckland
6,Jak Tan,M,1993-06-21,27,Raw,Open,81.85,83,225,240,247.5,247.5,125,132.5,-137.5,132.5,232.5,247.5,255,255,635,SBD,Auckland
7,Ian Chock,M,1993-03-05,27,Raw,Open,81.3,83,197.5,207.5,217.5,217.5,122.5,130,135,135,230,247.5,260,260,612.5,SBD,Wellington & Central
8,Emmanuel James Bautista,M,1991-03-07,29,Raw,Open,78.15,83,180,200,-210,200,120,130,137.5,137.5,245,262.5,-272.5,262.5,600,SBD,Canterbury
9,William Kingipotiki,M,1990-07-10,30,Raw,Open,82.4,83,195,205,212.5,212.5,125,132.5,135,135,235,250,-260,250,597.5,SBD,Southern
10,Radley Harahap,M,1995-09-21,25,Raw,Open,81.8,83,170,180,190,190,115,120,-122.5,120,210,220,-230,220,530,SBD,Southern
11,James Wilson #1,M,1992-03-08,28,Raw,Open,81.6,83,160,170,-175,170,87.5,92.5,-95,92.5,170,180,185,185,447.5,SBD,Auckland
1,Jamie King #1,M,1993-08-06,27,Raw,Open,92.5,93,277.5,292.5,-303,292.5,162.5,170,-175,170,305,322.5,-330,322.5,785,SBD,Canterbury
2,Lee McLeod,M,1996-09-28,24,Raw,Open,90.6,93,245,260,267.5,267.5,172.5,180,182.5,182.5,275,290,300,300,750,SBD,Auckland
3,Warren Wroth,M,1993-12-16,26,Raw,Open,92.85,93,245,260,-270,260,157.5,165,-170,165,285,305,315,315,740,SBD,Auckland
4,Parintorn Varnakomala,M,1994-06-15,26,Raw,Open,92.25,93,240,255,262.5,262.5,155,162.5,165,165,245,260,272.5,272.5,700,SBD,Canterbury
5,Marius Tonu'u,M,1996-06-16,24,Raw,Open,91.4,93,215,230,240,240,147.5,155,-160,155,265,-282.5,282.5,282.5,677.5,SBD,Auckland
6,Jonathan Christie,M,1986-07-27,34,Raw,Open,91.5,93,230,245,255,255,125,132.5,137.5,137.5,270,-285,-285,270,662.5,SBD,Southern
7,Philip Chan,M,1995-07-22,25,Raw,Open,90.6,93,235,245,252.5,252.5,135,140,142.5,142.5,240,250,260,260,655,SBD,Wellington & Central
8,Luke Thompson,M,1992-09-08,28,Raw,Open,92.7,93,212.5,225,232.5,232.5,130,132.5,-135,132.5,255,275,287.5,287.5,652.5,SBD,Auckland
9,Simon Kelsall,M,1970-03-08,50,Raw,Open,92.8,93,215,230,237.5,237.5,152.5,162.5,-167.5,162.5,237.5,252.5,-260,252.5,652.5,SBD,Auckland
10,Robin Vis,M,1986-02-10,34,Raw,Open,89.85,93,217.5,230,240,240,120,127.5,132.5,132.5,227.5,-245,260,260,632.5,SBD,Canterbury
11,George Frame,M,1991-03-07,29,Raw,Open,92.1,93,207.5,220,230,230,125,132.5,140,140,232.5,247.5,-252.5,247.5,617.5,SBD,Southern
12,Jesse McLay,M,1990-07-26,30,Raw,Open,92.85,93,205,215,220,220,127.5,132.5,-137.5,132.5,230,245,255,255,607.5,SBD,Canterbury
13,David Batchelor,M,1991-07-06,29,Raw,Open,87.65,93,180,200,215,215,135,145,155,155,210,230,-240,230,600,SBD,Wellington & Central
14,Catlin McLay,M,1988-05-30,32,Raw,Open,92.9,93,190,200,-205,200,132.5,137.5,140,140,225,242.5,250,250,590,SBD,Canterbury
15,Ben Wilkinson,M,1990-03-29,30,Raw,Open,91.9,93,175,185,195,195,115,122.5,127.5,127.5,222.5,240,257.5,257.5,580,SBD,Canterbury
16,Matthew Chan,M,1995-12-01,24,Raw,Open,92.2,93,200,212.5,-217.5,212.5,115,-120,120,120,240,-257.5,-257.5,240,572.5,SBD,Auckland
17,Tom Liu,M,1995-08-25,25,Raw,Open,90.6,93,187.5,200,-207.5,200,110,115,120,120,-220,220,235,235,555,SBD,Auckland
18,Jordan Clout,M,1993-06-12,27,Raw,Open,92.1,93,225,240,-242.5,240,155,-160,160,160,75,-235,-240,75,475,SBD,Wellington & Central
1,Amber Russell,F,1993-01-12,27,Raw,Open,83.45,84,162.5,167.5,-172.5,167.5,111,116,-120,116,162.5,170,175,175,458.5,SBD,Southern
2,Jenny Dewar,F,1983-11-11,36,Raw,Open,79.5,84,147.5,155,-160,155,90,95,97.5,97.5,160,167.5,182.5,182.5,435,SBD,Canterbury
3,Claire Nunan,F,1993-08-03,27,Raw,Open,79.85,84,132.5,140,150,150,82.5,90,92.5,92.5,165,177.5,185,185,427.5,SBD,Canterbury
4,Stacey Johnsen,F,1989-06-01,31,Raw,Open,83.65,84,150,160,-165,160,80,82.5,-85,82.5,165,177.5,185,185,427.5,SBD,Southern
5,Katherine Christie,F,1988-09-26,32,Raw,Open,83.4,84,135,142.5,150,150,77.5,82.5,85,85,152.5,160,165,165,400,SBD,Southern
6,Juliette Horne,F,1984-12-27,35,Raw,Open,80.3,84,117.5,125,130,130,67.5,70,72.5,72.5,155,165,172.5,172.5,375,SBD,Auckland
7,Georgia McDonald,F,1993-06-12,27,Raw,Open,83.1,84,125,130,135,135,70,-77.5,-77.5,70,135,145,150,150,355,SBD,Northland
1,Jana Hayes,F,1991-10-23,28,Raw,Open,128.4,84+,162.5,172.5,180,180,110,115,120,120,145,155,165,165,465,SBD,Canterbury
2,Maria Tauroa,F,1985-11-10,34,Raw,Open,136.1,84+,150,160,170,170,85,-92.5,92.5,92.5,190,195,200,200,462.5,SBD,Northland
3,Aimee Christensen,F,1991-09-23,29,Raw,Open,143.25,84+,170,175,-177.5,175,92.5,-97.5,-97.5,92.5,180,-190,-190,180,447.5,SBD,Canterbury
4,Mallory Toeaiga,F,1991-11-28,28,Raw,Open,113.05,84+,-140,140,-160,140,70,75,-77.5,75,-215,215,-225,215,430,SBD,Wellington & Central
5,Joanna Tuhou,F,1986-04-22,34,Raw,Open,92.75,84+,125,135,145,145,82.5,87.5,-92.5,87.5,160,180,-187.5,180,412.5,SBD,Auckland
6,Monique Leather,F,1981-12-04,38,Raw,Open,96.4,84+,140,150,157.5,157.5,65,72.5,-77.5,72.5,140,155,-162.5,155,385,SBD,Wellington & Central
7,Lee-Ann O'Callaghan,F,1981-12-06,38,Raw,Open,123.2,84+,-110,-115,115,115,65,67.5,70,70,140,155,-170,155,340,SBD,Waikato & BOP
1,Maui Koopu,M,1997-05-25,23,Raw,Open,103.75,105,277.5,295,302.5,302.5,175,182.5,-187.5,182.5,275,295,-305,295,780,SBD,Canterbury
2,Wade Phillips,M,1994-11-28,25,Raw,Open,104.75,105,265,277.5,-290,277.5,170,175,-180,175,277.5,290,295,295,747.5,SBD,Wellington & Central
3,Angus McKay,M,1996-03-16,24,Raw,Open,104.9,105,250,265,-272.5,265,147.5,155,157.5,157.5,285,302.5,-318,302.5,725,SBD,Southern
4,Alex McCallum,M,1995-03-07,25,Raw,Open,104.4,105,245,260,270,270,172.5,-180,180,180,247.5,262.5,272.5,272.5,722.5,SBD,Canterbury
5,Aaron Hills,M,1989-01-14,31,Raw,Open,103.65,105,230,245,-255,245,170,177.5,-180,177.5,275,290,-302.5,290,712.5,SBD,Auckland
6,Leo Xue,M,1991-03-10,29,Raw,Open,102,105,265,280,-300,280,170,185,-190,185,220,-247.5,-260,220,685,SBD,Auckland
7,Dan Brockbank,M,1986-05-27,34,Raw,Open,104.8,105,235,250,-260,250,160,-165,-165,160,260,-280,-280,260,670,SBD,Northland
8,Glenn Boreham,M,1984-04-02,36,Raw,Open,103.65,105,220,230,-240,230,150,157.5,160,160,245,260,-270,260,650,SBD,Auckland
9,Hamish Smith,M,1996-01-05,24,Raw,Open,103.4,105,197.5,207.5,-215,207.5,140,147.5,152.5,152.5,225,240,252.5,252.5,612.5,SBD,Auckland
10,Dean Jones,M,1985-03-17,35,Raw,Open,105,105,215,225,235,235,110,117.5,-120,117.5,227.5,242.5,260,260,612.5,SBD,Canterbury
11,David Jones #1,M,1981-08-18,39,Raw,Open,102.85,105,207.5,225,-232.5,225,117.5,125,-132.5,125,235,250,-262.5,250,600,SBD,Wellington & Central
1,Ben Scott #2,M,1996-11-21,23,Raw,Open,112.65,120,252.5,265,275,275,177.5,-185,185,185,265,277.5,285,285,745,SBD,Canterbury
2,Alex Hood,M,2000-06-28,20,Raw,Open,119.95,120,255,-270,270,270,145,155,165,165,270,290,300,300,735,SBD,Canterbury
3,Allan Postlewaight,M,1991-02-03,29,Raw,Open,119.1,120,240,260,265,265,172.5,-187.5,-187.5,172.5,265,280,-292.5,280,717.5,SBD,Auckland
4,Sean Clarke,M,1991-11-01,28,Raw,Open,115.35,120,200,212.5,220,220,135,142.5,-147.5,142.5,255,270,-275,270,632.5,SBD,Waikato & BOP
1,Sebastian McLarin,M,1987-07-08,33,Raw,Open,159.5,120+,-255,255,,255,200,210,-215,210,335,365,-382.5,365,830,SBD,Auckland
2,Greg Norton,M,1986-12-07,33,Raw,Open,128.3,120+,225,235,245,245,160,170,-175,170,235,255,275,275,690,SBD,Canterbury
3,Brian Gonzales #1,M,1993-04-25,27,Raw,Open,146.05,120+,210,225,-240,225,150,157.5,165,165,210,220,-235,220,610,SBD,Auckland
