Division,WeightClassKg,Place,Name,Team,BodyweightKg,Best3SquatKg,Best3BenchKg,Best3DeadliftKg,TotalKg,Equipment,Event,Sex,BirthDate
Girls,44.23,1,Lexi Iglesias,Port Lavaca Calhoun,43.09,122.47,72.57,117.93,312.98,Single-ply,SBD,F,
Girls,44.23,2,Sofia Torres,Uvalde,43.32,120.2,65.77,127.01,312.98,Single-ply,SBD,F,
Girls,44.23,3,Alexa Prado,Hidalgo Early College,43.32,106.59,49.9,108.86,265.35,Single-ply,SBD,F,
Girls,44.23,4,Miranda Ortiz,Alice,41.41,92.99,52.16,99.79,244.94,Single-ply,SBD,F,
Girls,44.23,5,Gloria Herrera,Corpus Christi Tuloso-Midway,43.27,81.65,38.56,99.79,219.99,Single-ply,SBD,F,
Girls,44.23,6,Deandra Avalos,Geronimo Navarro,40.1,79.38,49.9,81.65,210.92,Single-ply,SBD,F,
Girls,44.23,7,Nayeli Everett,Kingsville King,42.09,72.57,38.56,86.18,197.31,Single-ply,SBD,F,
Girls,44.23,8,Sol Selvera,Pearsall,41.59,68.04,38.56,77.11,183.7,Single-ply,SBD,F,
Girls,44.23,9,Mianize Martinez,Uvalde,41,65.77,40.82,74.84,181.44,Single-ply,SBD,F,
Girls,44.23,DQ,Ariana Reyes,Uvalde,43.18,,,,,Single-ply,SBD,F,
Girls,44.23,DQ,Joshlyn Cardenas,Uvalde,42.5,88.45,45.36,,,Single-ply,SBD,F,
Girls,44.23,DQ,Trinity Barr,Gonzales,42.59,,,,,Single-ply,SBD,F,
Girls,44.23,DQ,Ana Martinez,Crystal City,43.82,,,,,Single-ply,SBD,F,
Girls,44.23,DQ,Alicia Rios,Crystal City,42.91,,,,,Single-ply,SBD,F,
Girls,47.85,1,Ananda Lopez,Robstown,47.22,124.74,65.77,122.47,312.98,Single-ply,SBD,F,
Girls,47.85,2,Aaliyah Terrazas,Devine,45.18,115.67,58.97,127.01,301.64,Single-ply,SBD,F,
Girls,47.85,3,Victoria Varela,Port Lavaca Calhoun,45.99,120.2,54.43,124.74,299.37,Single-ply,SBD,F,
Girls,47.85,4,Analicia Granados,Crystal City,46.58,120.2,54.43,120.2,294.84,Single-ply,SBD,F,
Girls,47.85,5,Arsci Lopez,Devine,45.99,117.93,56.7,117.93,292.57,Single-ply,SBD,F,
Girls,47.85,6,Nayel Saldana,Devine,47.58,115.67,61.23,113.4,290.3,Single-ply,SBD,F,
Girls,47.85,7,Lily Falcone,COMAL DAVENPORT,44.59,104.33,47.63,122.47,274.42,Single-ply,SBD,F,
Girls,47.85,8,Mallory Balangon,Ingleside,46.81,97.52,52.16,90.72,240.4,Single-ply,SBD,F,
Girls,47.85,9,Veronica Martinez,Crystal City,44.59,90.72,45.36,102.06,238.14,Single-ply,SBD,F,
Girls,47.85,10,Lauren Salazar,Carrizo Springs,47.08,90.72,38.56,106.59,235.87,Single-ply,SBD,F,
Girls,47.85,11,Eneece Avila,La Feria,45.9,81.65,52.16,95.25,229.06,Single-ply,SBD,F,
Girls,47.85,12,Jennifer Vieyra-Lopez,Geronimo Navarro,46.08,77.11,47.63,95.25,219.99,Single-ply,SBD,F,
Girls,47.85,DQ,Johneli Gutierrez,Crystal City,47.4,,,,,Single-ply,SBD,F,
Girls,47.85,DQ,Charley Moreno,Rio Hondo,46.9,108.86,54.43,,,Single-ply,SBD,F,
Girls,51.94,1,Paloma Murillo,Rio Hondo,49.9,136.08,77.11,136.08,349.27,Single-ply,SBD,F,
Girls,51.94,2,Juliana Vasquez,Corpus Christi Tuloso-Midway,50.62,129.27,81.65,136.08,347,Single-ply,SBD,F,
Girls,51.94,3,Misty Garza,Rio Hondo,49.99,115.67,77.11,149.69,342.46,Single-ply,SBD,F,
Girls,51.94,4,Alamar Garcia,Pearsall,49.4,136.08,70.31,124.74,331.12,Single-ply,SBD,F,
Girls,51.94,5,Raelin Luna,Port Lavaca Calhoun,49.49,131.54,68.04,131.54,331.12,Single-ply,SBD,F,
Girls,51.94,6,Kay D'Leal,Corpus Christi Calallen,50.89,117.93,74.84,127.01,319.78,Single-ply,SBD,F,
Girls,51.94,7,Linda Urquieta,Corpus Christi Tuloso-Midway,51.07,129.27,65.77,120.2,315.25,Single-ply,SBD,F,
Girls,51.94,8,Kaylee Longoria,Carrizo Springs,50.39,120.2,63.5,124.74,308.44,Single-ply,SBD,F,
Girls,51.94,9,Haylee Marmolejo,Ingleside,50.48,117.93,70.31,117.93,306.17,Single-ply,SBD,F,
Girls,51.94,10,Annica Gonzales,Beeville Jones,50.8,120.2,58.97,127.01,306.17,Single-ply,SBD,F,
Girls,51.94,11,Virginia Gallegos,Carrizo Springs,50.89,120.2,52.16,117.93,290.3,Single-ply,SBD,F,
Girls,51.94,12,Alyson Lombrana,Crystal City,49.21,104.33,52.16,106.59,263.08,Single-ply,SBD,F,
Girls,51.94,DQ,Alina Estrada,Crystal City,51.12,,,,,Single-ply,SBD,F,
Girls,51.94,DQ,Amanda Aguilar,Uvalde,49.8,117.93,54.43,,,Single-ply,SBD,F,
Girls,56.02,1,Eh Nay Gay Hso,Port Lavaca Calhoun,54.7,167.83,70.31,145.15,383.29,Single-ply,SBD,F,
Girls,56.02,2,Myndi Rodriguez,Corpus Christi Tuloso-Midway,55.34,151.95,90.72,127.01,369.68,Single-ply,SBD,F,
Girls,56.02,3,Iliana Cortinas,Robstown,54.52,127.01,68.04,138.35,333.39,Single-ply,SBD,F,
Girls,56.02,4,Alaura-Ly Gonzalez,Alice,52.21,133.81,61.23,133.81,328.85,Single-ply,SBD,F,
Girls,56.02,5,Payton Cox #1,Port Lavaca Calhoun,54.11,124.74,65.77,127.01,317.51,Single-ply,SBD,F,
Girls,56.02,6,Galilea Rodriguez,La Feria,55.29,117.93,65.77,127.01,310.71,Single-ply,SBD,F,
Girls,56.02,7,Alizen Moreno,Beeville Jones,55.02,124.74,58.97,124.74,308.44,Single-ply,SBD,F,
Girls,56.02,8,Jeanette Rios,Devine,55.79,117.93,74.84,115.67,308.44,Single-ply,SBD,F,
Girls,56.02,9,Abigail Castellanos,Rio Hondo,53.8,127.01,61.23,117.93,306.17,Single-ply,SBD,F,
Girls,56.02,DQ,Julie del Bosque,Rio Hondo,54.3,,,,,Single-ply,SBD,F,
Girls,56.02,DQ,Viviana Lopez,Port Isabel,53.8,151.95,68.04,,,Single-ply,SBD,F,
Girls,56.02,DQ,Emily Flores,Rio Hondo,54.88,,,,,Single-ply,SBD,F,
Girls,56.02,DQ,Autumn Guerra,Pleasanton,53.89,,,,,Single-ply,SBD,F,
Girls,56.02,DQ,Aurianna Rich,Pleasanton,53.12,108.86,70.31,,,Single-ply,SBD,F,
Girls,60.1,1,Morgan Candela,Corpus Christi Tuloso-Midway,59.69,149.69,97.52,161.03,408.23,Single-ply,SBD,F,
Girls,60.1,2,Geraldine Tafolla,Port Lavaca Calhoun,56.88,149.69,72.57,140.61,362.87,Single-ply,SBD,F,
Girls,60.1,3,Jasmine Earls,Corpus Christi Calallen,58.6,131.54,70.31,149.69,351.53,Single-ply,SBD,F,
Girls,60.1,4,Sophia Aguilera,Port Isabel,60.1,149.69,56.7,136.08,342.46,Single-ply,SBD,F,
Girls,60.1,5,Bianca Guzman,Corpus Christi Tuloso-Midway,56.97,129.27,65.77,124.74,319.78,Single-ply,SBD,F,
Girls,60.1,6,Stehle Snyder,Rockport-Fulton,58.69,113.4,58.97,129.27,301.64,Single-ply,SBD,F,
Girls,60.1,7,Emily Garcia,Bandera,58.29,120.2,58.97,120.2,299.37,Single-ply,SBD,F,
Girls,60.1,8,Halle Lanham-Scheib,Geronimo Navarro,56.2,113.4,65.77,115.67,294.84,Single-ply,SBD,F,
Girls,60.1,9,Gabriella Rivas,Ingleside,59.78,120.2,54.43,120.2,294.84,Single-ply,SBD,F,
Girls,60.1,10,Lorisa Gonzales,Beeville Jones,59.42,113.4,65.77,106.59,285.76,Single-ply,SBD,F,
Girls,60.1,11,Cassandra Elias,Devine,57.38,113.4,54.43,115.67,283.5,Single-ply,SBD,F,
Girls,60.1,12,Libby Gonzales,Cuero,58.92,113.4,54.43,115.67,283.5,Single-ply,SBD,F,
Girls,60.1,DQ,Madalyn Armendarez,Crystal City,56.29,,,,,Single-ply,SBD,F,
Girls,60.1,DQ,Destyni Briseno,Port Lavaca Calhoun,58.6,129.27,,,,Single-ply,SBD,F,
Girls,67.36,1,Courtney Lamontagne,Corpus Christi Tuloso-Midway,65.77,172.37,95.25,163.29,430.91,Single-ply,SBD,F,
Girls,67.36,2,Ashley Gosch,Geronimo Navarro,65.91,163.29,86.18,158.76,408.23,Single-ply,SBD,F,
Girls,67.36,3,Samantha Sullivan,Corpus Christi John Paul II High School,63.91,154.22,74.84,163.29,392.36,Single-ply,SBD,F,
Girls,67.36,4,Valeria Ramirez,Rockport-Fulton,65.68,170.1,72.57,149.69,392.36,Single-ply,SBD,F,
Girls,67.36,5,Jamie Casas,Robstown,65,151.95,83.91,145.15,381.02,Single-ply,SBD,F,
Girls,67.36,6,Hser Ther,Port Lavaca Calhoun,64.18,149.69,74.84,138.35,362.87,Single-ply,SBD,F,
Girls,67.36,7,Jodycee Trujillo,Carrizo Springs,66.09,158.76,65.77,138.35,362.87,Single-ply,SBD,F,
Girls,67.36,8,Jackie McClendon,Corpus Christi Calallen,62.51,145.15,56.7,147.42,349.27,Single-ply,SBD,F,
Girls,67.36,9,Kelsey Chesson,Corpus Christi Calallen,65.41,145.15,61.23,140.61,347,Single-ply,SBD,F,
Girls,67.36,10,LaShandra Hallett,Kingsville King,66.09,111.13,58.97,138.35,308.44,Single-ply,SBD,F,
Girls,67.36,DQ,Sarah Howard,Geronimo Navarro,63.41,,,,,Single-ply,SBD,F,
Girls,67.36,DQ,Angelica Beltran,Beeville Jones,66,,,,,Single-ply,SBD,F,
Girls,67.36,DQ,Kylee Hensley,Bandera,65.32,,,,,Single-ply,SBD,F,
Girls,67.36,DQ,Relyla Rios,Crystal City,66.59,,,,,Single-ply,SBD,F,
Girls,75.07,1,Alexus Valdez,Corpus Christi Tuloso-Midway,71.03,165.56,83.91,149.69,399.16,Single-ply,SBD,F,
Girls,75.07,2,Madelyn Galvan,Port Isabel,73.12,163.29,81.65,149.69,394.63,Single-ply,SBD,F,
Girls,75.07,3,Kaitlin Menchaca,Geronimo Navarro,68.08,147.42,90.72,142.88,381.02,Single-ply,SBD,F,
Girls,75.07,4,Morgan Goebel,Cuero,72.21,136.08,72.57,154.22,362.87,Single-ply,SBD,F,
Girls,75.07,5,Brooke Carle,Geronimo Navarro,69.58,138.35,83.91,136.08,358.34,Single-ply,SBD,F,
Girls,75.07,6,Hadlee Wilson,Geronimo Navarro,72.62,138.35,68.04,142.88,349.27,Single-ply,SBD,F,
Girls,75.07,7,Jaycee Barnes,Port Lavaca Calhoun,73.48,131.54,65.77,149.69,347,Single-ply,SBD,F,
Girls,75.07,DQ,Lizette Zuniga,Rio Hondo,71.99,149.69,81.65,,,Single-ply,SBD,F,
Girls,75.07,DQ,Hailey Garner,Geronimo Navarro,72.48,142.88,92.99,,,Single-ply,SBD,F,
Girls,75.07,DQ,Isellia Gutierrez,Devine,71.58,,,,,Single-ply,SBD,F,
Girls,75.07,DQ,Marissa Ramirez #3,Crystal City,73.48,,,,,Single-ply,SBD,F,
Girls,75.07,DQ,Lyna Castorena,Crystal City,72.48,,,,,Single-ply,SBD,F,
Girls,75.07,DQ,Madison Calderon,Corpus Christi Calallen,73.12,204.12,,,,Single-ply,SBD,F,
Girls,75.07,DQ,Viviana Rodriguez,Uvalde,72.12,124.74,,,,Single-ply,SBD,F,
Girls,82.33,1,Amidy Moreno,Beeville Jones,79.61,188.24,122.47,181.44,492.15,Single-ply,SBD,F,
Girls,82.33,2,Alex Soto #1,Crystal City,79.29,170.1,90.72,163.29,424.11,Single-ply,SBD,F,
Girls,82.33,3,Katherine Fairly,Victoria St. Joseph,76.11,151.95,72.57,192.78,417.3,Single-ply,SBD,F,
Girls,82.33,4,Kayla DeLeon,Geronimo Navarro,75.48,149.69,95.25,142.88,387.82,Single-ply,SBD,F,
Girls,82.33,5,Zeena Flores,La Feria,80.51,156.49,74.84,154.22,385.55,Single-ply,SBD,F,
Girls,82.33,6,Angelina Alvizo,Hondo,81.92,151.95,70.31,140.61,362.87,Single-ply,SBD,F,
Girls,82.33,7,Sofia Aguilar,Pleasanton,75.11,138.35,70.31,142.88,351.53,Single-ply,SBD,F,
Girls,82.33,8,Victoria Alejandre,La Feria,77.2,151.95,63.5,131.54,347,Single-ply,SBD,F,
Girls,82.33,9,Sydney Frausto,La Feria,79.88,136.08,74.84,124.74,335.66,Single-ply,SBD,F,
Girls,82.33,10,Natalie Mata,Raymondville,80.69,142.88,61.23,102.06,306.17,Single-ply,SBD,F,
Girls,82.33,DQ,Graycee Gonzales,Gonzales,76.61,142.88,74.84,,,Single-ply,SBD,F,
Girls,82.33,DQ,Tevya Tipton,Corpus Christi West Oso,79.02,145.15,83.91,,,Single-ply,SBD,F,
Girls,82.33,DQ,Esmi Dorantes,Corpus Christi West Oso,76.11,131.54,,,,Single-ply,SBD,F,
Girls,82.33,DQ,Mikayla Newson,Beeville Jones,81.01,,,,,Single-ply,SBD,F,
Girls,90.04,1,Alyssa Ramirez,La Feria,87.09,215.46,102.06,192.78,510.29,Single-ply,SBD,F,
Girls,90.04,2,Kennedi Butcher,Port Lavaca Calhoun,87.82,185.97,131.54,183.7,501.22,Single-ply,SBD,F,
Girls,90.04,3,Alizah Rodriguez,Crystal City,85.91,188.24,92.99,142.88,424.11,Single-ply,SBD,F,
Girls,90.04,4,Kelsey Garcia,Uvalde,86.32,181.44,88.45,138.35,408.23,Single-ply,SBD,F,
Girls,90.04,5,Janel Garcia,Uvalde,88.99,163.29,77.11,156.49,396.89,Single-ply,SBD,F,
Girls,90.04,6,Gabriella Alejandre,La Feria,85.32,165.56,74.84,149.69,390.09,Single-ply,SBD,F,
Girls,90.04,7,Viviana Torres,Crystal City,87.59,145.15,68.04,151.95,365.14,Single-ply,SBD,F,
Girls,90.04,8,Kate Hill,Rockport-Fulton,83.78,145.15,63.5,133.81,342.46,Single-ply,SBD,F,
Girls,90.04,9,Cece Martinez,Devine,86.18,131.54,68.04,142.88,342.46,Single-ply,SBD,F,
Girls,90.04,10,Izabel Ruiz,Kingsville King,82.92,131.54,77.11,129.27,337.93,Single-ply,SBD,F,
Girls,90.04,11,Janessa Vela,Robstown,84.91,133.81,65.77,136.08,335.66,Single-ply,SBD,F,
Girls,90.04,12,Brenna O'Neal,Corpus Christi Calallen,86,138.35,61.23,136.08,335.66,Single-ply,SBD,F,
Girls,90.04,13,Hailie Gorman,Carrizo Springs,82.6,136.08,65.77,129.27,331.12,Single-ply,SBD,F,
Girls,90.04,14,Kaitlin Tagle,Corpus Christi Calallen,82.69,117.93,68.04,120.2,306.17,Single-ply,SBD,F,
Girls,90.04,15,Mercedez Trinidad,Hondo,87.41,127.01,56.7,115.67,299.37,Single-ply,SBD,F,
Girls,100.02,1,Analydia Montes,Corpus Christi Tuloso-Midway,93.62,190.51,97.52,179.17,467.2,Single-ply,SBD,F,
Girls,100.02,2,Bennett Welch,Victoria St. Joseph,97.48,163.29,97.52,181.44,442.25,Single-ply,SBD,F,
Girls,100.02,3,Mikaitlyn Anderson,Beeville Jones,96.48,170.1,108.86,145.15,424.11,Single-ply,SBD,F,
Girls,100.02,4,Cheyenne Martinez,Rockport-Fulton,90.31,172.37,70.31,165.56,408.23,Single-ply,SBD,F,
Girls,100.02,5,April Puente,Port Isabel,98.11,176.9,81.65,149.69,408.23,Single-ply,SBD,F,
Girls,100.02,6,Brittany Auzston,Beeville Jones,96.98,147.42,88.45,145.15,381.02,Single-ply,SBD,F,
Girls,100.02,7,Gabriela Orosco,Carrizo Springs,96.39,163.29,63.5,142.88,369.68,Single-ply,SBD,F,
Girls,100.02,8,Kayla Salazar,Pleasanton,93.3,133.81,68.04,149.69,351.53,Single-ply,SBD,F,
Girls,100.02,9,Leonor Rodriguez,Sinton,90.22,145.15,61.23,120.2,326.59,Single-ply,SBD,F,
Girls,100.02,DQ,Brittney Briseno,Pearsall,94.62,163.29,77.11,,,Single-ply,SBD,F,
Girls,100.02,DQ,Sela Villanueva,San Antonio Brooks Academy,96.89,183.7,,,,Single-ply,SBD,F,
Girls,100.02,DQ,Laney Marmelejo,Comal Canyon Lake,97.3,117.93,58.97,,,Single-ply,SBD,F,
Girls,100.02,DQ,Kylie Rodriguez,Devine,91.58,,,,,Single-ply,SBD,F,
Girls,100.02,DQ,Khali Key,Devine,96.39,,,,,Single-ply,SBD,F,
Girls,117.71,1,Ashlyn Weikle,Somerset,110.18,208.65,124.74,192.78,526.17,Single-ply,SBD,F,
Girls,117.71,2,Ariel Rangel,Somerset,114.8,183.7,142.88,147.42,474,Single-ply,SBD,F,
Girls,117.71,3,Angelina Calzada,Port Lavaca Calhoun,107.41,170.1,74.84,158.76,403.7,Single-ply,SBD,F,
Girls,117.71,4,Trinity Aguero,Gonzales,101.79,170.1,72.57,147.42,390.09,Single-ply,SBD,F,
Girls,117.71,5,Llianna Flores,Beeville Jones,105.51,142.88,81.65,120.2,344.73,Single-ply,SBD,F,
Girls,117.71,6,Alondra Hernandez,Geronimo Navarro,116.71,136.08,88.45,111.13,335.66,Single-ply,SBD,F,
Girls,117.71,7,Miricle Glover,Cuero,111.08,117.93,72.57,113.4,303.91,Single-ply,SBD,F,
Girls,117.71,8,Meribelle Mendiea,Sinton,114.08,127.01,70.31,102.06,299.37,Single-ply,SBD,F,
Girls,117.71,9,Haley Bairrington,Gonzales,103.92,102.06,63.5,129.27,294.84,Single-ply,SBD,F,
Girls,117.71,10,Destiny Barrera,Corpus Christi West Oso,111.22,113.4,70.31,102.06,285.76,Single-ply,SBD,F,
Girls,117.71,11,Cora King,Victoria St. Joseph,100.38,108.86,49.9,113.4,272.16,Single-ply,SBD,F,
Girls,117.71,DQ,Samantha Salazar,Pleasanton,100.61,131.54,,,,Single-ply,SBD,F,
Girls,117.71+,1,Alayna Searcy,Port Lavaca Calhoun,131,263.08,122.47,163.29,548.85,Single-ply,SBD,F,
Girls,117.71+,2,Andriah Trevino,Uvalde,119.48,172.37,83.91,172.37,428.64,Single-ply,SBD,F,
Girls,117.71+,3,Cerina Smith,Carrizo Springs,118.71,179.17,81.65,131.54,392.36,Single-ply,SBD,F,
Girls,117.71+,4,Chelsea Gonzalez,Port Isabel,118.39,131.54,68.04,120.2,319.78,Single-ply,SBD,F,
Girls,117.71+,5,Hannah Pena,Gonzales,118.39,90.72,38.56,102.06,231.33,Single-ply,SBD,F,
