Division,WeightClassKg,Place,Name,Team,BodyweightKg,Best3SquatKg,Best3BenchKg,Best3DeadliftKg,TotalKg,Equipment,Event,Sex,BirthDate
Girls,44.23,1,Arvana Hernandez,Mathis,44.13,102.06,61.23,95.25,258.55,Single-ply,SBD,F,
Girls,44.23,2,Sophia Padilla,Natalia,43.36,92.99,47.63,106.59,247.21,Single-ply,SBD,F,
Girls,44.23,3,Natalie Lopez,Agua Dulce,44.09,86.18,43.09,92.99,222.26,Single-ply,SBD,F,
Girls,44.23,4,Stormie Hensley,Stockdale,43.64,79.38,43.09,88.45,210.92,Single-ply,SBD,F,
Girls,44.23,5,Danae Garcia,Cotulla,41.37,74.84,40.82,83.91,199.58,Single-ply,SBD,F,
Girls,44.23,6,Melanie Hernandez,Columbus,43.09,77.11,40.82,81.65,199.58,Single-ply,SBD,F,
Girls,44.23,7,Daniela Padilla,Natalia,42.46,79.38,38.56,79.38,197.31,Single-ply,SBD,F,
Girls,44.23,8,Stephanie Ortega,Edinburg Quest College Prep,43.64,68.04,34.02,81.65,183.7,Single-ply,SBD,F,
Girls,44.23,9,Gabriella Velasquez,Poteet,35.56,61.23,29.48,77.11,167.83,Single-ply,SBD,F,
Girls,44.23,10,Elly Campos,Freer,44.23,63.5,29.48,72.57,165.56,Single-ply,SBD,F,
Girls,44.23,11,Denae Garcia,Karnes City,40.37,65.77,24.95,72.57,163.29,Single-ply,SBD,F,
Girls,44.23,DQ,Isabella Ruelas,Falfurrias,43.36,95.25,,,,Single-ply,SBD,F,
Girls,44.23,DQ,Araceli Guerra,Lyford,43.64,97.52,,,,Single-ply,SBD,F,
Girls,47.85,1,Marina Lopez,Skidmore-Tynan,46.99,131.54,61.23,113.4,306.17,Single-ply,SBD,F,
Girls,47.85,2,Meg Martinez,Natalia,46.72,113.4,74.84,106.59,294.84,Single-ply,SBD,F,
Girls,47.85,3,Ashley Lopez,Three Rivers,47.36,117.93,45.36,111.13,274.42,Single-ply,SBD,F,
Girls,47.85,4,Vanessa Marquez,Altair Rice,47.85,124.74,34.02,113.4,272.16,Single-ply,SBD,F,
Girls,47.85,5,Joanna Flores,Agua Dulce,47.54,108.86,47.63,113.4,269.89,Single-ply,SBD,F,
Girls,47.85,6,Alicia Rios,San Antonio Cole,47.08,92.99,49.9,113.4,256.28,Single-ply,SBD,F,
Girls,47.85,7,Sara Perez,Freer,47.26,97.52,49.9,106.59,254.01,Single-ply,SBD,F,
Girls,47.85,8,Keiandra Ross,Mathis,47.72,95.25,36.29,108.86,240.4,Single-ply,SBD,F,
Girls,47.85,9,Berkley Hunting,San Antonio Cole,47.36,77.11,49.9,90.72,217.72,Single-ply,SBD,F,
Girls,47.85,10,Sara Vela,Banquete,46.18,77.11,38.56,95.25,210.92,Single-ply,SBD,F,
Girls,47.85,11,Gabby Romans,Yorktown,45.54,63.5,29.48,63.5,156.49,Single-ply,SBD,F,
Girls,47.85,12,Mariely Cavazos,Edinburg Quest College Prep,46.9,52.16,27.22,63.5,142.88,Single-ply,SBD,F,
Girls,51.94,1,Amaris Garza,Edinburg Idea College Prep,51.53,120.2,81.65,133.81,335.66,Single-ply,SBD,F,
Girls,51.94,2,Jalesca Schorsch,Natalia,51.07,124.74,74.84,124.74,324.32,Single-ply,SBD,F,
Girls,51.94,3,Miranda Salas,Santa Gertrudis Academy,50.53,115.67,58.97,124.74,299.37,Single-ply,SBD,F,
Girls,51.94,4,Alejandra Reyes #2,Edinburg Quest College Prep,51.26,117.93,70.31,111.13,299.37,Single-ply,SBD,F,
Girls,51.94,5,Mercedes Leal,Mathis,51.8,124.74,56.7,108.86,290.3,Single-ply,SBD,F,
Girls,51.94,6,Madison Gwosdz,Karnes City,50.53,97.52,61.23,108.86,267.62,Single-ply,SBD,F,
Girls,51.94,7,Jesselen Tijerina,La Villa,51.8,97.52,49.9,111.13,258.55,Single-ply,SBD,F,
Girls,51.94,8,Lillian McWilliams,Goliad,50.62,92.99,61.23,102.06,256.28,Single-ply,SBD,F,
Girls,51.94,9,Aaliyah Mendez,Flatonia,51.17,95.25,61.23,99.79,256.28,Single-ply,SBD,F,
Girls,51.94,10,Celeste Huerta,Skidmore-Tynan,51.94,95.25,52.16,104.33,251.74,Single-ply,SBD,F,
Girls,51.94,11,Ava Sanchez,Natalia,50.53,97.52,52.16,97.52,247.21,Single-ply,SBD,F,
Girls,51.94,DQ,Mia Cancino,San Antonio Cole,50.8,,,,,Single-ply,SBD,F,
Girls,51.94,DQ,Dominique Banda,Natalia,50.62,117.93,65.77,,,Single-ply,SBD,F,
Girls,51.94,DQ,Alinna Cruz,Bishop,50.98,122.47,54.43,,,Single-ply,SBD,F,
Girls,56.02,1,Charlize Gonzalez,San Diego,55.52,151.95,79.38,133.81,365.14,Single-ply,SBD,F,
Girls,56.02,2,Dylan Wesselski,Corpus Christi London,55.07,129.27,74.84,142.88,347,Single-ply,SBD,F,
Girls,56.02,3,Hannah VanBlarcum,Orange Grove,55.52,129.27,63.5,136.08,328.85,Single-ply,SBD,F,
Girls,56.02,4,Angelica Padilla,Natalia,55.34,129.27,70.31,117.93,317.51,Single-ply,SBD,F,
Girls,56.02,5,Karina Longoria,Center Point,54.52,120.2,72.57,113.4,306.17,Single-ply,SBD,F,
Girls,56.02,6,Savanna Dickey,Marion,55.25,117.93,63.5,124.74,306.17,Single-ply,SBD,F,
Girls,56.02,7,Lilyanna Gonzalez,Stockdale,55.79,115.67,70.31,120.2,306.17,Single-ply,SBD,F,
Girls,56.02,8,Kiara Ross,Mathis,55.97,124.74,65.77,111.13,301.64,Single-ply,SBD,F,
Girls,56.02,9,Isabella Martinez,Natalia,54.7,113.4,68.04,115.67,297.1,Single-ply,SBD,F,
Girls,56.02,10,Chloe Williams,Center Point,54.88,117.93,68.04,111.13,297.1,Single-ply,SBD,F,
Girls,56.02,11,Kelly Alarcon,Hebbronville,55.79,104.33,70.31,108.86,283.5,Single-ply,SBD,F,
Girls,56.02,DQ,Samantha Diaz,Bishop,55.16,167.83,,,,Single-ply,SBD,F,
Girls,56.02,DQ,Raegan Nelson,Altair Rice,54.88,106.59,,,,Single-ply,SBD,F,
Girls,60.1,1,Isis Sandiford,Edinburg Idea College Prep,59.87,172.37,108.86,163.29,444.52,Single-ply,SBD,F,
Girls,60.1,2,Kylie Bosquez,Jourdanton,59.78,161.03,72.57,142.88,376.48,Single-ply,SBD,F,
Girls,60.1,3,Alyssa Marlowe,Center Point,56.7,136.08,86.18,145.15,367.41,Single-ply,SBD,F,
Girls,60.1,4,Arlene Ramirez,Hebbronville,59.87,145.15,72.57,142.88,360.61,Single-ply,SBD,F,
Girls,60.1,5,Mia Garza,Bishop,57.97,149.69,70.31,131.54,351.53,Single-ply,SBD,F,
Girls,60.1,6,Jerrilyn Gonzales,Karnes City,59.96,142.88,63.5,127.01,333.39,Single-ply,SBD,F,
Girls,60.1,7,Bradi Freeman,Altair Rice,59.69,142.88,52.16,133.81,328.85,Single-ply,SBD,F,
Girls,60.1,8,Chloe Gibson,Skidmore-Tynan,59.51,133.81,70.31,122.47,326.59,Single-ply,SBD,F,
Girls,60.1,9,Sophia Sanchez,Corpus Christi London,59.24,113.4,61.23,136.08,310.71,Single-ply,SBD,F,
Girls,60.1,10,Haley Hernandez,Goliad,58.88,117.93,70.31,120.2,308.44,Single-ply,SBD,F,
Girls,60.1,11,Cesi Ramirez,Center Point,57.24,127.01,52.16,127.01,306.17,Single-ply,SBD,F,
Girls,60.1,12,Asia Ramos,Poteet,58.33,111.13,65.77,120.2,297.1,Single-ply,SBD,F,
Girls,60.1,13,Kaelyn Lara,Natalia,58.33,102.06,70.31,124.74,297.1,Single-ply,SBD,F,
Girls,60.1,14,Karla Rabanales,Edinburg Quest College Prep,59.78,117.93,61.23,104.33,283.5,Single-ply,SBD,F,
Girls,67.36,1,Jennifer Benavidez,Cotulla,64.77,185.97,90.72,163.29,439.98,Single-ply,SBD,F,
Girls,67.36,2,Viviana Hernandez,Goliad,65.95,183.7,92.99,156.49,433.18,Single-ply,SBD,F,
Girls,67.36,3,Summer Green,Corpus Christi London,64.86,151.95,79.38,151.95,383.29,Single-ply,SBD,F,
Girls,67.36,4,Magali Medrano,Bishop,66.32,145.15,90.72,145.15,381.02,Single-ply,SBD,F,
Girls,67.36,5,Brooke Gisler,Karnes City,67.13,161.03,72.57,129.27,362.87,Single-ply,SBD,F,
Girls,67.36,6,Jaylan Camp,Jourdanton,64.59,145.15,54.43,145.15,344.73,Single-ply,SBD,F,
Girls,67.36,7,Leslie Flores,Santa Rosa,66.04,149.69,49.9,136.08,335.66,Single-ply,SBD,F,
Girls,67.36,8,Skylette Cisneros,Skidmore-Tynan,64.5,136.08,61.23,124.74,322.05,Single-ply,SBD,F,
Girls,67.36,9,Grace DelBosque,Bishop,66.04,131.54,65.77,124.74,322.05,Single-ply,SBD,F,
Girls,67.36,10,Nayeli Barrera,Rocksprings,60.78,136.08,77.11,104.33,317.51,Single-ply,SBD,F,
Girls,67.36,11,Abigail Breitbach,Universal City Randolph,63.41,127.01,54.43,136.08,317.51,Single-ply,SBD,F,
Girls,67.36,12,Kassandra Vallejo,La Villa,62.6,124.74,70.31,97.52,292.57,Single-ply,SBD,F,
Girls,67.36,13,Diamond Flores,Altair Rice,65.32,117.93,56.7,113.4,288.03,Single-ply,SBD,F,
Girls,67.36,14,Alissandra Carrion,San Diego,65.41,104.33,68.04,106.59,278.96,Single-ply,SBD,F,
Girls,67.36,DQ,Alize Sanchez,Lytle,63.5,,,,,Single-ply,SBD,F,
Girls,75.07,1,Mia Rincones,Edinburg Idea College Prep,72.94,156.49,106.59,158.76,421.84,Single-ply,SBD,F,
Girls,75.07,2,Yaritsa Alanis,Santa Gertrudis Academy,72.57,165.56,74.84,161.03,401.43,Single-ply,SBD,F,
Girls,75.07,3,Isabella Rodriguez,Stockdale,72.21,161.03,77.11,156.49,394.63,Single-ply,SBD,F,
Girls,75.07,4,Emilee Whitehead,Goliad,73.39,151.95,72.57,136.08,360.61,Single-ply,SBD,F,
Girls,75.07,5,Reina Romero,Mathis,73.57,147.42,72.57,136.08,356.07,Single-ply,SBD,F,
Girls,75.07,6,Jovana Billings,Edinburg Quest College Prep,72.03,131.54,63.5,154.22,349.27,Single-ply,SBD,F,
Girls,75.07,7,Summer Castro,Altair Rice,72.76,151.95,61.23,136.08,349.27,Single-ply,SBD,F,
Girls,75.07,8,Kirstyn Garza,Agua Dulce,72.94,138.35,65.77,142.88,347,Single-ply,SBD,F,
Girls,75.07,9,Jaden Yeoman,Orange Grove,71.03,122.47,83.91,133.81,340.19,Single-ply,SBD,F,
Girls,75.07,10,Isabella Gonzales,Mathis,73.21,149.69,65.77,122.47,337.93,Single-ply,SBD,F,
Girls,75.07,11,Patricia Ellis,Altair Rice,73.3,129.27,40.82,113.4,283.5,Single-ply,SBD,F,
Girls,75.07,DQ,Guadalupe Mendiola,Flatonia,71.12,161.03,,,,Single-ply,SBD,F,
Girls,75.07,DQ,April Bodie,Lytle,73.3,,,,,Single-ply,SBD,F,
Girls,75.07,DQ,Rayven Van Heeswyk,Jourdanton,71.76,158.76,83.91,,,Single-ply,SBD,F,
Girls,82.33,1,Samantha Gonzalez,Edinburg Idea College Prep,81.56,174.63,92.99,174.63,442.25,Single-ply,SBD,F,
Girls,82.33,2,Gabriela Munoz,Natalia,76.02,192.78,88.45,151.95,433.18,Single-ply,SBD,F,
Girls,82.33,3,Lauren Wells,Jourdanton,80.2,161.03,79.38,145.15,385.55,Single-ply,SBD,F,
Girls,82.33,4,Emilee Fuhrken,Orange Grove,76.02,149.69,77.11,145.15,371.95,Single-ply,SBD,F,
Girls,82.33,5,Anahi Cruz,Karnes City,75.75,163.29,77.11,129.27,369.68,Single-ply,SBD,F,
Girls,82.33,6,Kaitlyn Gonzales,Mathis,81.1,142.88,81.65,124.74,349.27,Single-ply,SBD,F,
Girls,82.33,7,Mageste Holland,Universal City Randolph,77.38,131.54,61.23,136.08,328.85,Single-ply,SBD,F,
Girls,82.33,8,Analeigha Salinas,Freer,77.56,151.95,63.5,111.13,326.59,Single-ply,SBD,F,
Girls,82.33,9,Norma Galvan,Hebbronville,78.38,124.74,79.38,122.47,326.59,Single-ply,SBD,F,
Girls,82.33,10,Dalenisa Coronado,Santa Gertrudis Academy,79.56,129.27,74.84,120.2,324.32,Single-ply,SBD,F,
Girls,82.33,11,Maria Cantu,Skidmore-Tynan,81.01,117.93,70.31,136.08,324.32,Single-ply,SBD,F,
Girls,82.33,12,Hailey Hinojosa,Falfurrias,80.74,145.15,58.97,117.93,322.05,Single-ply,SBD,F,
Girls,82.33,13,Amara Davis,Universal City Randolph,81.01,122.47,61.23,131.54,315.25,Single-ply,SBD,F,
Girls,82.33,14,Suzie Rangel,Rocksprings,75.21,131.54,68.04,113.4,312.98,Single-ply,SBD,F,
Girls,90.04,1,Jasmine Ramon,Natalia,87.09,172.37,106.59,158.76,437.72,Single-ply,SBD,F,
Girls,90.04,2,Alina Carrera,Taft,88.09,172.37,104.33,147.42,424.11,Single-ply,SBD,F,
Girls,90.04,3,Reeana Esquivel,Edinburg Idea College Prep,88.36,156.49,99.79,154.22,410.5,Single-ply,SBD,F,
Girls,90.04,4,Daniella Villarreal,Skidmore-Tynan,86.91,158.76,95.25,131.54,385.55,Single-ply,SBD,F,
Girls,90.04,5,Jackie Fly,Marion,88.09,151.95,79.38,142.88,374.21,Single-ply,SBD,F,
Girls,90.04,6,Teresa Valadez,Center Point,86.82,154.22,81.65,136.08,371.95,Single-ply,SBD,F,
Girls,90.04,7,Sasha Garcia,Edinburg Quest College Prep,86.45,156.49,68.04,136.08,360.61,Single-ply,SBD,F,
Girls,90.04,8,Mady Steele,Center Point,88.45,127.01,92.99,124.74,344.73,Single-ply,SBD,F,
Girls,90.04,9,Kelsey Eguia,Dilley,88.45,142.88,68.04,120.2,331.12,Single-ply,SBD,F,
Girls,90.04,10,Miriam Bocanegra,Jourdanton,89.09,145.15,61.23,117.93,324.32,Single-ply,SBD,F,
Girls,90.04,11,Raven Carroll,San Antonio Cole,87.45,127.01,63.5,120.2,310.71,Single-ply,SBD,F,
Girls,90.04,12,Dezi Flores,Freer,85.55,113.4,54.43,127.01,294.84,Single-ply,SBD,F,
Girls,90.04,13,Gabriella Moreno,Freer,87.91,102.06,56.7,129.27,288.03,Single-ply,SBD,F,
Girls,100.02,1,Mikayla Gonzales,Natalia,93.35,190.51,102.06,163.29,455.86,Single-ply,SBD,F,
Girls,100.02,2,Elia Soliz,San Diego,98.97,172.37,106.59,154.22,433.18,Single-ply,SBD,F,
Girls,100.02,3,Daphnie Laymon,Freer,99.7,174.63,77.11,176.9,428.64,Single-ply,SBD,F,
Girls,100.02,4,Emily Ortiz,Orange Grove,97.61,174.63,102.06,149.69,426.38,Single-ply,SBD,F,
Girls,100.02,5,Regina Seidel,Cotulla,99.16,176.9,92.99,138.35,408.23,Single-ply,SBD,F,
Girls,100.02,6,Jenivae Rodriguez,Cotulla,98.07,172.37,90.72,127.01,390.09,Single-ply,SBD,F,
Girls,100.02,7,Lillian Gonzalez,Cotulla,96.07,170.1,88.45,127.01,385.55,Single-ply,SBD,F,
Girls,100.02,8,Kate Robinson,Natalia,97.16,176.9,72.57,136.08,385.55,Single-ply,SBD,F,
Girls,100.02,9,Aerianna Segura,Goliad,98.25,170.1,81.65,131.54,383.29,Single-ply,SBD,F,
Girls,100.02,10,Rebecca Ruiz,Rocksprings,95.16,145.15,83.91,133.81,362.87,Single-ply,SBD,F,
Girls,100.02,11,Kim Amaya,Yorktown,95.07,154.22,65.77,124.74,344.73,Single-ply,SBD,F,
Girls,100.02,12,Caitlin Lara,Mathis,91.53,136.08,77.11,115.67,328.85,Single-ply,SBD,F,
Girls,100.02,DQ,Miah Contreras,La Villa,96.52,151.95,,,,Single-ply,SBD,F,
Girls,117.71,1,Trinity Meduna,Rocksprings,104.6,183.7,106.59,158.76,449.06,Single-ply,SBD,F,
Girls,117.71,2,Rian Garza,Kenedy,112.76,190.51,86.18,158.76,435.45,Single-ply,SBD,F,
Girls,117.71,3,Emili Oliver,Lytle,107.5,192.78,90.72,142.88,426.38,Single-ply,SBD,F,
Girls,117.71,4,Mica Mayorga,Banquete,101.7,183.7,79.38,145.15,408.23,Single-ply,SBD,F,
Girls,117.71,5,Sha'Torri Williams,Flatonia,106.87,158.76,86.18,136.08,381.02,Single-ply,SBD,F,
Girls,117.71,6,Allison Elizondo,San Diego,116.21,181.44,74.84,120.2,376.48,Single-ply,SBD,F,
Girls,117.71,7,Jacelyn Venegas,Rocksprings,100.97,142.88,86.18,120.2,349.27,Single-ply,SBD,F,
Girls,117.71,8,Samantha Ferguson,Altair Rice,108.41,145.15,52.16,120.2,317.51,Single-ply,SBD,F,
Girls,117.71,9,India Hamilton,Goliad,115.3,113.4,83.91,120.2,317.51,Single-ply,SBD,F,
Girls,117.71,10,Siriah Rodriguez #2,Altair Rice,107.86,149.69,49.9,108.86,308.44,Single-ply,SBD,F,
Girls,117.71,11,Isabel Laque,Natalia,103.33,113.4,70.31,122.47,306.17,Single-ply,SBD,F,
Girls,117.71,12,Alexis Flores #5,Lytle,106.23,113.4,52.16,127.01,292.57,Single-ply,SBD,F,
Girls,117.71,13,Arriana Romero,Natalia,100.24,99.79,61.23,102.06,263.08,Single-ply,SBD,F,
Girls,117.71+,1,Joslynn Contreras,La Villa,131.72,165.56,102.06,156.49,424.11,Single-ply,SBD,F,
Girls,117.71+,2,Payge Brown,Goliad,118.12,145.15,95.25,124.74,365.14,Single-ply,SBD,F,
Girls,117.71+,3,Katelyn Pratz,Mathis,145.15,145.15,74.84,133.81,353.8,Single-ply,SBD,F,
Girls,117.71+,4,Juneice Gerragauch,Santa Gertrudis Academy,118.66,142.88,81.65,122.47,347,Single-ply,SBD,F,
Girls,117.71+,5,Carolina Brown,Hallettsville,140.98,140.61,72.57,120.2,333.39,Single-ply,SBD,F,
Girls,117.71+,DQ,Alejandra Hinojosa,Ben Bolt-Palito Blanco,127.37,,,,,Single-ply,SBD,F,
