Division,WeightClassKg,Place,Name,Team,BodyweightKg,Best3SquatKg,Best3BenchKg,Best3DeadliftKg,TotalKg,Equipment,Event,Sex
Girls,44.23,1,Jailin Munoz,Lago Vista,43.18,136.08,49.9,115.67,301.64,Single-ply,SBD,F
Girls,44.23,2,Hannah Zurovetz,Lago Vista,42.91,104.33,47.63,108.86,260.82,Single-ply,SBD,F
Girls,44.23,3,Lily Buckley,Lago Vista,43.18,106.59,45.36,97.52,249.48,Single-ply,SBD,F
Girls,44.23,4,Elizabeth Warren,Moody,42.64,95.25,54.43,97.52,247.21,Single-ply,SBD,F
Girls,44.23,5,Vanessa Martinez,Brady,44.18,90.72,40.82,113.4,244.94,Single-ply,SBD,F
Girls,44.23,6,Samantha Garcia,Whitney,43.73,86.18,36.29,97.52,219.99,Single-ply,SBD,F
Girls,44.23,7,Liz Perkins,Moody,44.18,83.91,34.02,97.52,215.46,Single-ply,SBD,F
Girls,44.23,8,Daniella Duran,Waco Reicher Catholic,44,63.5,34.02,92.99,190.51,Single-ply,SBD,F
Girls,44.23,9,Angela Foss,Crawford,36.02,63.5,31.75,83.91,179.17,Single-ply,SBD,F
Girls,44.23,10,Miranda Young,McGregor,41.73,68.04,34.02,63.5,165.56,Single-ply,SBD,F
Girls,47.85,1,Amanda Hubbard,Moody,46.72,99.79,65.77,117.93,283.5,Single-ply,SBD,F
Girls,47.85,2,Maribel Reyna,Rogers,44.72,115.67,47.63,113.4,276.69,Single-ply,SBD,F
Girls,47.85,3,Sterling Ford,Brady,46.9,111.13,52.16,113.4,276.69,Single-ply,SBD,F
Girls,47.85,4,Teresa Ramirez,Gustine,45.72,102.06,43.09,120.2,265.35,Single-ply,SBD,F
Girls,47.85,5,Jacquelyn Washington,Hillsboro,47.08,104.33,43.09,111.13,258.55,Single-ply,SBD,F
Girls,47.85,6,Makayla Hashaw,Chilton,46.08,90.72,45.36,102.06,238.14,Single-ply,SBD,F
Girls,47.85,7,Makayla Robbins,Gustine,47.26,90.72,40.82,90.72,222.26,Single-ply,SBD,F
Girls,47.85,8,Rachael Zacharias,West,46.9,88.45,31.75,92.99,213.19,Single-ply,SBD,F
Girls,47.85,9,Kori Giles,Crawford,47.81,68.04,31.75,86.18,185.97,Single-ply,SBD,F
Girls,47.85,10,Tancy Hester,Tolar,47.81,74.84,31.75,68.04,174.63,Single-ply,SBD,F
Girls,51.94,1,Shannon Carpenter,Lago Vista,47.99,117.93,54.43,115.67,288.03,Single-ply,SBD,F
Girls,51.94,2,Angel Galindo,Brady,51.8,113.4,58.97,115.67,288.03,Single-ply,SBD,F
Girls,51.94,3,Gabby Constancia,Early,51.89,111.13,58.97,111.13,281.23,Single-ply,SBD,F
Girls,51.94,4,Katie D'Angelo,McGregor,51.71,102.06,56.7,113.4,272.16,Single-ply,SBD,F
Girls,51.94,5,Lora Weaver,Brady,49.99,111.13,49.9,102.06,263.08,Single-ply,SBD,F
Girls,51.94,6,Hailey Murray,Brady,51.44,104.33,45.36,111.13,260.82,Single-ply,SBD,F
Girls,51.94,7,Bria Dokupil,West,51.17,90.72,54.43,113.4,258.55,Single-ply,SBD,F
Girls,51.94,8,Stephanie Piar,Hillsboro,51.44,108.86,43.09,104.33,256.28,Single-ply,SBD,F
Girls,51.94,9,Savannah Johnson,San Saba,49.8,97.52,52.16,104.33,254.01,Single-ply,SBD,F
Girls,51.94,10,Kayla Perkins,Axtell,49.17,95.25,52.16,104.33,251.74,Single-ply,SBD,F
Girls,51.94,11,Hailey Northcutt,Lago Vista,48.44,97.52,56.7,92.99,247.21,Single-ply,SBD,F
Girls,51.94,DQ,Angel Griggs,Hillsboro,50.35,88.45,40.82,108.86,,Single-ply,SBD,F
Girls,51.94,DQ,Victoria Rutherford,Sidney,51.89,113.4,,,,Single-ply,SBD,F
Girls,56.02,1,Sarah Gautreaux,Thrall,54.79,142.88,77.11,131.54,351.53,Single-ply,SBD,F
Girls,56.02,2,Raquel Morado,Brady,55.16,131.54,58.97,138.35,328.85,Single-ply,SBD,F
Girls,56.02,3,Alexandra Aycock,Riesel,55.52,138.35,68.04,117.93,324.32,Single-ply,SBD,F
Girls,56.02,4,Sanjuana Delgado,Whitney,55.97,129.27,65.77,127.01,322.05,Single-ply,SBD,F
Girls,56.02,5,Amber Pavelka,West,55.7,127.01,54.43,129.27,310.71,Single-ply,SBD,F
Girls,56.02,6,Kambrie Spain,Brady,53.89,120.2,47.63,131.54,299.37,Single-ply,SBD,F
Girls,56.02,7,Kasandra Ibarra,Comanche,53.43,97.52,52.16,127.01,276.69,Single-ply,SBD,F
Girls,56.02,8,Gabrielle Hamilton,Early,54.98,106.59,56.7,104.33,267.62,Single-ply,SBD,F
Girls,56.02,9,Anayely Escobar,Dublin,55.07,111.13,47.63,106.59,265.35,Single-ply,SBD,F
Girls,56.02,10,Lauren Mosley,McGregor,55.52,108.86,40.82,102.06,251.74,Single-ply,SBD,F
Girls,56.02,DQ,Jessica Harvey,Hempstead,54.93,113.4,45.36,113.4,,Single-ply,SBD,F
Girls,56.02,DQ,Jami Jakubik,Snook,54.07,99.79,43.09,108.86,,Single-ply,SBD,F
Girls,60.1,1,Cassy Carlton,Lago Vista,58.15,176.9,83.91,138.35,399.16,Single-ply,SBD,F
Girls,60.1,2,Taylor Jones #1,Little River Academy,58.42,131.54,63.5,140.61,335.66,Single-ply,SBD,F
Girls,60.1,3,Hallie Brinson,Early,58.79,138.35,65.77,127.01,331.12,Single-ply,SBD,F
Girls,60.1,4,Cameron Tuggle,Lago Vista,58.79,136.08,54.43,136.08,326.59,Single-ply,SBD,F
Girls,60.1,5,Jayce Cummings,Moody,56.61,120.2,65.77,129.27,315.25,Single-ply,SBD,F
Girls,60.1,6,Gabrielle Ramirez,Florence,57.52,120.2,54.43,129.27,303.91,Single-ply,SBD,F
Girls,60.1,7,Allyson Jacobs,McGregor,59.42,136.08,63.5,102.06,301.64,Single-ply,SBD,F
Girls,60.1,8,Chassie Fisher,Moody,56.61,124.74,58.97,115.67,299.37,Single-ply,SBD,F
Girls,60.1,9,Amber James,Dublin,56.52,127.01,49.9,117.93,294.84,Single-ply,SBD,F
Girls,60.1,10,Shayna Srackangast,Blanco,58.69,115.67,56.7,120.2,292.57,Single-ply,SBD,F
Girls,60.1,11,Diana Cortes,Jarrell,56.15,127.01,56.7,99.79,283.5,Single-ply,SBD,F
Girls,60.1,12,Aniaya Fillyaw,Jarrell,58.88,117.93,43.09,122.47,283.5,Single-ply,SBD,F
Girls,67.36,1,Ashlyn Wilkerson,Whitney,67.13,158.76,65.77,154.22,378.75,Single-ply,SBD,F
Girls,67.36,2,Samantha Augeri,McGregor,63.68,136.08,65.77,140.61,342.46,Single-ply,SBD,F
Girls,67.36,3,Shelby Nix,Lago Vista,65.41,131.54,61.23,149.69,342.46,Single-ply,SBD,F
Girls,67.36,4,Crystal Williams,Little River Academy,61.96,140.61,61.23,138.35,340.19,Single-ply,SBD,F
Girls,67.36,5,Katlyn Robicheaux,Lago Vista,61.23,138.35,68.04,124.74,331.12,Single-ply,SBD,F
Girls,67.36,6,Brianna Tippie,McGregor,65.23,136.08,56.7,136.08,328.85,Single-ply,SBD,F
Girls,67.36,7,Kirstyne Huggins,Moody,66.77,136.08,68.04,124.74,328.85,Single-ply,SBD,F
Girls,67.36,8,Kaylie Hudson,Axtell,66.04,136.08,56.7,122.47,315.25,Single-ply,SBD,F
Girls,67.36,DQ,Tatyana King,Holland,67.13,,,,,Single-ply,SBD,F
Girls,67.36,DQ,Emma Kramer,Thrall,65.95,111.13,58.97,113.4,,Single-ply,SBD,F
Girls,67.36,DQ,Alissa Womack,Jarrell,63.59,120.2,61.23,,,Single-ply,SBD,F
Girls,75.07,1,Kyndall Hoelscher,West,73.84,163.29,86.18,154.22,403.7,Single-ply,SBD,F
Girls,75.07,2,Brittany Frillou,Axtell,72.12,163.29,86.18,140.61,390.09,Single-ply,SBD,F
Girls,75.07,3,Brittany Carter,Bosqueville,73.84,154.22,72.57,161.03,387.82,Single-ply,SBD,F
Girls,75.07,4,Marina Sanchez,Brady,73.12,154.22,58.97,163.29,376.48,Single-ply,SBD,F
Girls,75.07,5,Maritza Aviles,Jarrell,71.94,154.22,79.38,129.27,362.87,Single-ply,SBD,F
Girls,75.07,6,Ashley Porter,Thrall,74.03,151.95,58.97,136.08,347,Single-ply,SBD,F
Girls,75.07,7,Logan Kindle,Whitney,74.66,140.61,68.04,136.08,344.73,Single-ply,SBD,F
Girls,75.07,8,KinniKinica Bundage,Hearne,72.39,129.27,54.43,151.95,335.66,Single-ply,SBD,F
Girls,75.07,9,Millenia Rodriguez,Brady,70.94,136.08,54.43,133.81,324.32,Single-ply,SBD,F
Girls,75.07,10,Lydia Contella,Waco Reicher Catholic,73.94,127.01,56.7,124.74,308.44,Single-ply,SBD,F
Girls,75.07,DQ,Julianna Flores,Waco Reicher Catholic,70.94,120.2,45.36,124.74,,Single-ply,SBD,F
Girls,75.07,DQ,Dezurai Martinez,Jarrell,72.76,108.86,65.77,117.93,,Single-ply,SBD,F
Girls,75.07,DQ,Adele Chaffer,Little River Academy,68.17,106.59,56.7,124.74,,Single-ply,SBD,F
Girls,82.33,1,Jas'Lyn Glover,Hempstead,81.42,163.29,81.65,181.44,426.38,Single-ply,SBD,F
Girls,82.33,2,Allana Bettge,Waco Reicher Catholic,81.01,158.76,72.57,154.22,385.55,Single-ply,SBD,F
Girls,82.33,3,Martha Riojas,Dublin,79.92,158.76,83.91,131.54,374.21,Single-ply,SBD,F
Girls,82.33,4,Monique Alvarado,Comanche,79.74,151.95,61.23,149.69,362.87,Single-ply,SBD,F
Girls,82.33,5,Sara Estes,Brady,79.47,151.95,74.84,131.54,358.34,Single-ply,SBD,F
Girls,82.33,6,Chesney Kuper,Little River Academy,81.01,136.08,72.57,140.61,349.27,Single-ply,SBD,F
Girls,82.33,7,Allison Janke,Holland,75.84,127.01,86.18,127.01,340.19,Single-ply,SBD,F
Girls,82.33,8,Yasemin Ozen,Lago Vista,76.57,115.67,63.5,115.67,294.84,Single-ply,SBD,F
Girls,82.33,9,Anna True,Crawford,77.11,108.86,58.97,127.01,294.84,Single-ply,SBD,F
Girls,82.33,DQ,Ivey Mount,Crawford,76.29,106.59,45.36,117.93,,Single-ply,SBD,F
Girls,82.33,DQ,Jessica Cryer,Holland,79.38,97.52,65.77,104.33,,Single-ply,SBD,F
Girls,82.33,DQ,Kennedy Harms,Comanche,80.56,,,,,Single-ply,SBD,F
Girls,90.04,1,Taylor Strmiska,Little River Academy,83.73,195.04,92.99,181.44,469.47,Single-ply,SBD,F
Girls,90.04,2,Cheyenne Meyer,Bruceville-Eddy,84.19,163.29,74.84,172.37,410.5,Single-ply,SBD,F
Girls,90.04,3,Beth Bounds,Moody,85.46,167.83,79.38,158.76,405.97,Single-ply,SBD,F
Girls,90.04,4,Mikayla Jowers,Crawford,89.81,158.76,88.45,145.15,392.36,Single-ply,SBD,F
Girls,90.04,5,Essance Porter,McGregor,82.78,154.22,63.5,167.83,385.55,Single-ply,SBD,F
Girls,90.04,6,Rosie Narvaez,Rogers,86.18,156.49,77.11,136.08,369.68,Single-ply,SBD,F
Girls,90.04,7,Jordan Bush,Little River Academy,85.46,147.42,68.04,142.88,358.34,Single-ply,SBD,F
Girls,90.04,8,Adriana Rodriguez,McGregor,87.63,151.95,58.97,140.61,351.53,Single-ply,SBD,F
Girls,90.04,9,Kim Licea,Comanche,86.55,136.08,56.7,145.15,337.93,Single-ply,SBD,F
Girls,90.04,10,Ximena Gutierrez,Florence,89.09,149.69,61.23,127.01,337.93,Single-ply,SBD,F
Girls,90.04,DQ,Shaniqua Lee,McGregor,87.72,136.08,58.97,142.88,,Single-ply,SBD,F
Girls,100.02,1,Gaby Angel,Florence,98.79,185.97,79.38,163.29,428.64,Single-ply,SBD,F
Girls,100.02,2,Angela Rost,McGregor,96.98,167.83,77.11,170.1,415.04,Single-ply,SBD,F
Girls,100.02,3,Lacy LeBoeuf,Bosqueville,95.98,165.56,83.91,158.76,408.23,Single-ply,SBD,F
Girls,100.02,4,Gabrielle Lopez #2,West,98.43,172.37,83.91,131.54,387.82,Single-ply,SBD,F
Girls,100.02,5,Cassie Carmichael,Bangs,97.07,147.42,74.84,158.76,381.02,Single-ply,SBD,F
Girls,100.02,6,Maka Sierra,Comanche,90.36,147.42,52.16,142.88,342.46,Single-ply,SBD,F
Girls,100.02,7,Maddison Perry,Moody,96.8,129.27,68.04,136.08,333.39,Single-ply,SBD,F
Girls,100.02,DQ,Carmela Guevara,Tolar,90.63,161.03,63.5,,,Single-ply,SBD,F
Girls,100.02+,1,Kinsey Lane,Tolar,113.35,204.12,72.57,181.44,458.13,Single-ply,SBD,F
Girls,100.02+,2,Savannah Powers,Lago Vista,109.86,219.99,95.25,136.08,451.32,Single-ply,SBD,F
Girls,100.02+,3,Emilia Betancourt,Bruceville-Eddy,108.14,185.97,83.91,172.37,442.25,Single-ply,SBD,F
Girls,100.02+,4,Sydney Robins,Bruceville-Eddy,111.04,181.44,83.91,165.56,430.91,Single-ply,SBD,F
Girls,100.02+,5,Hailie Morehead,Franklin,122.02,181.44,72.57,165.56,419.57,Single-ply,SBD,F
Girls,100.02+,6,Erica Greybill,Bruceville-Eddy,106.14,170.1,70.31,163.29,403.7,Single-ply,SBD,F
Girls,100.02+,7,Andrea Garcia,Chilton,112.67,154.22,70.31,145.15,369.68,Single-ply,SBD,F
Girls,100.02+,8,Brittany Carrasco,Cameron Yoe,123.2,149.69,70.31,145.15,365.14,Single-ply,SBD,F
Girls,100.02+,9,Daisa Bell,Snook,125.55,140.61,86.18,120.2,347,Single-ply,SBD,F
Girls,100.02+,10,Mikayla Cox,Franklin,118.93,140.61,68.04,136.08,344.73,Single-ply,SBD,F
Girls,100.02+,11,McKaylen Drake,Rogers,110.31,151.95,70.31,120.2,342.46,Single-ply,SBD,F
Girls,100.02+,DQ,Deonshae Milliner,Moody,112.85,140.61,52.16,136.08,,Single-ply,SBD,F
Girls,100.02+,DQ,Mykenzie Stroud,Holland,100.24,136.08,77.11,120.2,,Single-ply,SBD,F
