Division,WeightClassKg,Place,Name,Team,BodyweightKg,Best3SquatKg,Best3BenchKg,Best3DeadliftKg,TotalKg,Equipment,Event,Sex
Boys,51.71,1,Viator Gomez,Mertzon Irion County,50.94,131.54,65.77,122.47,319.78,Single-ply,SBD,M
Boys,51.71,2,Luke Argo,Lampasas,51.71,136.08,54.43,120.2,310.71,Single-ply,SBD,M
Boys,55.79,3,Derrick McBee,Brady,51.85,108.86,54.43,138.35,301.64,Single-ply,SBD,M
Boys,51.71,4,Britton Heath,Coahoma,51.21,117.93,52.16,117.93,288.03,Single-ply,SBD,M
Boys,55.79,1,Jesse Ramirez #2,San Angelo Lake View,54.98,167.83,95.25,181.44,444.52,Single-ply,SBD,M
Boys,59.87,2,Eric Garcia,Sonora,55.93,145.15,77.11,147.42,369.68,Single-ply,SBD,M
Boys,55.79,3,Chris Ramirez,Lampasas,55.57,140.61,68.04,156.49,365.14,Single-ply,SBD,M
Boys,55.79,4,Kevin Buitron,Sonora,54.98,122.47,77.11,151.95,351.53,Single-ply,SBD,M
Boys,55.79,5,Gus Barrera,Sonora,54.16,111.13,58.97,136.08,306.17,Single-ply,SBD,M
Boys,55.79,6,Tanner Myers,Mertzon Irion County,55.02,106.59,58.97,111.13,276.69,Single-ply,SBD,M
Boys,55.79,7,Devynn Mejia,San Angelo Grape Creek,55.34,113.4,49.9,113.4,276.69,Single-ply,SBD,M
Boys,55.79,8,Jarron Kirkland,Brady,54.61,104.33,47.63,115.67,267.62,Single-ply,SBD,M
Boys,55.79,DQ,Gunnar McNeill,San Angelo Grape Creek,55.57,,,,,Single-ply,SBD,M
Boys,59.87,1,Austin Martinez,Mertzon Irion County,59.6,190.51,108.86,183.7,483.08,Single-ply,SBD,M
Boys,59.87,2,Trenton Crenshaw,Coahoma,58.97,149.69,90.72,158.76,399.16,Single-ply,SBD,M
Boys,59.87,3,Stephen Seely,San Angelo Lake View,59.6,140.61,77.11,176.9,394.63,Single-ply,SBD,M
Boys,67.13,4,Devin Keese,Brady,60.1,151.95,77.11,145.15,374.21,Single-ply,SBD,M
Boys,59.87,5,Dorian Jimanez,Brady,57.33,140.61,72.57,154.22,367.41,Single-ply,SBD,M
Boys,59.87,6,Meeko Gonzalez,Sonora,59.19,124.74,79.38,147.42,351.53,Single-ply,SBD,M
Boys,59.87,7,Roger Gehrels,Eldorado,59.6,142.88,68.04,136.08,347,Single-ply,SBD,M
Boys,59.87,8,Brandon Lee,San Angelo Lake View,58.33,136.08,63.5,142.88,342.46,Single-ply,SBD,M
Boys,59.87,9,Glenn Crowder,Iraan,57.42,117.93,70.31,147.42,335.66,Single-ply,SBD,M
Boys,67.13,1,Knijin Bell-Williams,Lampasas,65.54,167.83,104.33,185.97,458.13,Single-ply,SBD,M
Boys,67.13,2,Cristan Pachicano,Stamford,65.45,181.44,99.79,167.83,449.06,Single-ply,SBD,M
Boys,67.13,3,Austin Ramirez,Iraan,64.55,174.63,79.38,190.51,444.52,Single-ply,SBD,M
Boys,67.13,4,Justin Medrando,Brady,65.77,151.95,113.4,172.37,437.72,Single-ply,SBD,M
Boys,67.13,5,Sean Schaefer,Ballinger,65.95,172.37,92.99,172.37,437.72,Single-ply,SBD,M
Boys,67.13,6,JR Rodriguez,Rankin,66,170.1,102.06,163.29,435.45,Single-ply,SBD,M
Boys,67.13,7,Julio Dominguez,San Angelo Lake View,66.5,147.42,95.25,176.9,419.57,Single-ply,SBD,M
Boys,67.13,8,Will Smith #4,Lampasas,67.13,154.22,77.11,158.76,390.09,Single-ply,SBD,M
Boys,67.13,9,Dusty Strictland,Christoval,66.41,131.54,65.77,161.03,358.34,Single-ply,SBD,M
Boys,67.13,10,Dustin Moore,Anson,64.95,124.74,74.84,124.74,324.32,Single-ply,SBD,M
Boys,74.84,1,Angel Moreno,San Angelo Lake View,72.39,226.8,117.93,204.12,548.85,Single-ply,SBD,M
Boys,74.84,2,Willie Collins,Ballinger,71.21,201.85,122.47,188.24,512.56,Single-ply,SBD,M
Boys,74.84,3,Aaron Castillo,Rankin,74.3,181.44,129.27,199.58,510.29,Single-ply,SBD,M
Boys,74.84,4,Hank Levison,Mertzon Irion County,72.21,204.12,88.45,204.12,496.68,Single-ply,SBD,M
Boys,74.84,5,Morgan Lytle,Christoval,74.12,190.51,102.06,197.31,489.88,Single-ply,SBD,M
Boys,74.84,6,Avery Gary,Lampasas,69.44,176.9,102.06,195.04,474,Single-ply,SBD,M
Boys,74.84,7,Landon Leschper,Anson,73.75,183.7,108.86,181.44,474,Single-ply,SBD,M
Boys,74.84,8,Jose Armendariz,San Angelo Grape Creek,70.99,181.44,95.25,190.51,467.2,Single-ply,SBD,M
Boys,74.84,9,Luke Parker,Christoval,71.85,185.97,92.99,185.97,464.93,Single-ply,SBD,M
Boys,74.84,10,Michael Chavez,Sonora,73.3,161.03,79.38,163.29,403.7,Single-ply,SBD,M
Boys,74.84,11,Kevin O'Dell,San Angelo Grape Creek,74.16,142.88,95.25,165.56,403.7,Single-ply,SBD,M
Boys,74.84,12,Jonathan Gutierrez,Sonora,71.08,136.08,88.45,158.76,383.29,Single-ply,SBD,M
Boys,82.1,13,Deonn Fuentes,Eldorado,74.93,136.08,61.23,129.27,326.59,Single-ply,SBD,M
Boys,74.84,DQ,Sam Jacobs,Christoval,70.4,,,,,Single-ply,SBD,M
Boys,82.1,1,Richard Ruschenberg,San Angelo Grape Creek,79.83,217.72,102.06,190.51,510.29,Single-ply,SBD,M
Boys,82.1,2,Caleb Hudson,San Angelo Lake View,76.84,174.63,113.4,210.92,498.95,Single-ply,SBD,M
Boys,82.1,3,Jerry Trejo,Brady,77.56,170.1,111.13,210.92,492.15,Single-ply,SBD,M
Boys,82.1,4,Ryder Sawyer,Iraan,79.02,181.44,97.52,192.78,471.74,Single-ply,SBD,M
Boys,82.1,5,Hunter Wilkinson,Lampasas,76.88,181.44,97.52,188.24,467.2,Single-ply,SBD,M
Boys,82.1,6,Cole Gatzki,Plains,75.43,181.44,106.59,174.63,462.66,Single-ply,SBD,M
Boys,82.1,7,Mitchel Hudson,Anson,77.56,183.7,97.52,181.44,462.66,Single-ply,SBD,M
Boys,82.1,8,Fabian Gomez,Eldorado,81.78,170.1,102.06,163.29,435.45,Single-ply,SBD,M
Boys,89.81,9,Kendall Hartman,Iraan,82.15,136.08,58.97,147.42,342.46,Single-ply,SBD,M
Boys,89.81,1,Marcos Rodarte,San Angelo Grape Creek,89.13,281.23,113.4,217.72,612.35,Single-ply,SBD,M
Boys,89.81,2,Joe Melendez,Coahoma,88.27,233.6,122.47,197.31,553.38,Single-ply,SBD,M
Boys,89.81,3,John Cuellar,Ballinger,88.36,215.46,127.01,201.85,544.31,Single-ply,SBD,M
Boys,89.81,4,Nick Anna,Plains,85.77,172.37,108.86,197.31,478.54,Single-ply,SBD,M
Boys,89.81,5,Colt Baker,Anson,84.37,165.56,104.33,190.51,460.4,Single-ply,SBD,M
Boys,89.81,6,Drew Cumpton,Anson,89.81,181.44,83.91,181.44,446.79,Single-ply,SBD,M
Boys,89.81,7,Topher McGhee,Lampasas,88.22,165.56,104.33,170.1,439.98,Single-ply,SBD,M
Boys,89.81,8,Johnathan Arrieta,Anson,88.63,142.88,77.11,147.42,367.41,Single-ply,SBD,M
Boys,99.79,1,Haddan Stokes,Coahoma,97.16,204.12,129.27,179.17,512.56,Single-ply,SBD,M
Boys,99.79,2,Josh Smith #26,San Angelo Lake View,94.53,217.72,104.33,181.44,503.49,Single-ply,SBD,M
Boys,99.79,3,Ethan Patlan,Sonora,93.58,176.9,115.67,181.44,474,Single-ply,SBD,M
Boys,99.79,4,Michael Ortiz,Iraan,94.94,154.22,92.99,192.78,439.98,Single-ply,SBD,M
Boys,99.79,5,Slaton Hansen,Anson,92.62,149.69,77.11,151.95,378.75,Single-ply,SBD,M
Boys,99.79,DQ,Grant Dorsey,Lampasas,93.67,113.4,74.84,,,Single-ply,SBD,M
Boys,99.79,DQ,Matt Garcia,Mertzon Irion County,94.98,208.65,145.15,,,Single-ply,SBD,M
Boys,109.77,1,David Cockrell,Lampasas,109.04,226.8,165.56,181.44,573.79,Single-ply,SBD,M
Boys,109.77,2,Andy Gamez,Lampasas,109.32,238.14,117.93,217.72,573.79,Single-ply,SBD,M
Boys,109.77,3,Stephen Dominguez,Sonora,107.68,208.65,136.08,195.04,539.77,Single-ply,SBD,M
Boys,109.77,4,Harrel James,Christoval,107.23,188.24,95.25,188.24,471.74,Single-ply,SBD,M
Boys,109.77,5,Jaime Chancellor,Eldorado,106.23,161.03,81.65,161.03,403.7,Single-ply,SBD,M
Boys,109.77,6,David Ramirez,Plains,105.19,140.61,99.79,158.76,399.16,Single-ply,SBD,M
Boys,109.77,7,Isaiah Castanuela,Brady,102.29,104.33,65.77,124.74,294.84,Single-ply,SBD,M
Boys,109.77,DQ,Adrian Hernandez #2,San Angelo Grape Creek,103.06,,,,,Single-ply,SBD,M
Boys,109.77,DQ,Elijah Cross,Sonora,100.7,,,,,Single-ply,SBD,M
Boys,124.74,1,Daniel Schlather,San Angelo Lake View,124.74,235.87,136.08,226.8,598.74,Single-ply,SBD,M
Boys,124.74,2,Kelton Bales,Eldorado,121.74,249.48,131.54,215.46,596.47,Single-ply,SBD,M
Boys,124.74,3,Dustin Fontana,Coahoma,114.76,208.65,167.83,213.19,589.67,Single-ply,SBD,M
Boys,124.74,4,Zak Walton,Coahoma,117.48,235.87,136.08,204.12,576.06,Single-ply,SBD,M
Boys,124.74,5,Christian Delgado,San Angelo Lake View,117.03,240.4,129.27,204.12,573.79,Single-ply,SBD,M
Boys,124.74,6,Braulio Vargas,Eldorado,123.92,185.97,115.67,174.63,476.27,Single-ply,SBD,M
Boys,124.74+,1,Jake Dibble,Lampasas,145.24,229.06,138.35,219.99,587.4,Single-ply,SBD,M
Boys,124.74+,2,Caleb Wrinkle,Rankin,129.32,201.85,129.27,229.06,560.19,Single-ply,SBD,M
Boys,124.74+,3,Mark Hudson,San Angelo Lake View,152.86,226.8,111.13,222.26,560.19,Single-ply,SBD,M
Boys,124.74+,4,Chris Villanueva,Anson,137.21,208.65,115.67,174.63,498.95,Single-ply,SBD,M
Boys,124.74+,5,Ray Ramero,Christoval,135.35,183.7,95.25,183.7,462.66,Single-ply,SBD,M
Boys,124.74+,DQ,Cagen Chaney,Iraan,135.17,249.48,,,,Single-ply,SBD,M
Boys,124.74+,DQ,Marc Zapata,Brady,141.52,204.12,,,,Single-ply,SBD,M
