Division,WeightClassKg,Place,Name,Team,BodyweightKg,Best3SquatKg,Best3BenchKg,Best3DeadliftKg,TotalKg,Equipment,Event,Sex
Boys,51.71,1,Kenny Nguyen,Dickinson,51.53,129.27,88.45,127.01,344.73,Single-ply,SBD,M
Boys,51.71,2,Fidencio Cruz,Dickinson,50.44,120.2,63.5,122.47,306.17,Single-ply,SBD,M
Boys,51.71,3,Brandon Parish,Galveston Ball,45.18,108.86,58.97,102.06,269.89,Single-ply,SBD,M
Boys,51.71,4,Ivan Sifuentes,Hitchcock,51.62,43.09,47.63,99.79,190.51,Single-ply,SBD,M
Boys,55.79,1,Joseph Dodds,Dickinson,55.07,174.63,92.99,154.22,421.84,Single-ply,SBD,M
Boys,55.79,2,Immanuel Hill,La Marque,55.34,122.47,81.65,136.08,340.19,Single-ply,SBD,M
Boys,59.87,1,Alex Sharp,Dickinson,56.15,174.63,111.13,181.44,467.2,Single-ply,SBD,M
Boys,67.13,2,Colin Herzog,Santa Fe,59.96,145.15,90.72,145.15,381.02,Single-ply,SBD,M
Boys,59.87,3,Michael Dupuy,Santa Fe,56.61,136.08,86.18,142.88,365.14,Single-ply,SBD,M
Boys,74.84,1,Shawn Foster,Dickinson,67.31,176.9,104.33,183.7,464.93,Single-ply,SBD,M
Boys,67.13,2,Jacob Carpenter,Texas City,66.86,167.83,111.13,174.63,453.59,Single-ply,SBD,M
Boys,67.13,3,Deandre Swann,Galveston Ball,67.04,142.88,99.79,183.7,426.38,Single-ply,SBD,M
Boys,74.84,1,Garrett Reagan,Dickinson,74.3,192.78,115.67,195.04,503.49,Single-ply,SBD,M
Boys,74.84,2,Jamal Owens,La Marque,69.94,181.44,102.06,204.12,487.61,Single-ply,SBD,M
Boys,82.1,1,Daniel Wilkerson,Santa Fe,78.38,229.06,149.69,226.8,605.55,Single-ply,SBD,M
Boys,82.1,2,Luke Chimes,Dickinson,78.47,226.8,138.35,199.58,564.72,Single-ply,SBD,M
Boys,82.1,3,Cody Platt,Santa Fe,81.65,213.19,129.27,215.46,557.92,Single-ply,SBD,M
Boys,82.1,4,Jamal Duncan,La Marque,80.2,183.7,113.4,204.12,501.22,Single-ply,SBD,M
Boys,82.1,5,Rupert Davis,Hitchcock,81.92,197.31,90.72,206.38,494.42,Single-ply,SBD,M
Boys,82.1,6,Armani Mouton,Dickinson,81.19,183.7,120.2,183.7,487.61,Single-ply,SBD,M
Boys,82.1,7,John Le,Dickinson,81.28,195.04,97.52,195.04,487.61,Single-ply,SBD,M
Boys,82.1,8,Chris Hall,Santa Fe,78.74,167.83,133.81,167.83,469.47,Single-ply,SBD,M
Boys,82.1,9,William Thomas,La Marque,78.02,165.56,129.27,163.29,458.13,Single-ply,SBD,M
Boys,82.1,10,Chris Garcia #12,Pasadena Dobie,76.11,151.95,113.4,181.44,446.79,Single-ply,SBD,M
Boys,82.1,11,Lester Block,Galveston Ball,77.66,147.42,,,147.42,Single-ply,S,M
Boys,89.81,1,Michael McDonald,Pasadena Dobie,86.82,235.87,133.81,229.06,598.74,Single-ply,SBD,M
Boys,89.81,2,Byron Wells,Dickinson,84.28,206.38,129.27,240.4,576.06,Single-ply,SBD,M
Boys,89.81,3,Brandon Boyd,La Marque,83.91,183.7,145.15,204.12,532.97,Single-ply,SBD,M
Boys,89.81,4,Savon Caldwell,Texas City,87.45,215.46,97.52,219.99,532.97,Single-ply,SBD,M
Boys,89.81,5,Josh Marshall,Texas City,89.45,199.58,124.74,195.04,519.36,Single-ply,SBD,M
Boys,89.81,6,Israel Clark,Santa Fe,86.73,179.17,113.4,217.72,510.29,Single-ply,SBD,M
Boys,89.81,7,Anthony Messer,Texas City,89.45,199.58,102.06,199.58,501.22,Single-ply,SBD,M
Boys,89.81,8,James Martin #6,La Marque,86.45,165.56,111.13,181.44,458.13,Single-ply,SBD,M
Boys,89.81,9,Dj Sweeny,Santa Fe,84.82,158.76,,,158.76,Single-ply,S,M
Boys,99.79,1,Justin Rice,Pasadena Dobie,98.88,242.67,129.27,260.82,632.76,Single-ply,SBD,M
Boys,99.79,2,Scott McCormick,Santa Fe,98.88,226.8,151.95,215.46,594.21,Single-ply,SBD,M
Boys,99.79,3,Patrick Enriquez,Galveston Ball,95.8,195.04,124.74,192.78,512.56,Single-ply,SBD,M
Boys,99.79,4,Otis Johnson,Texas City,90.26,183.7,113.4,158.76,455.86,Single-ply,SBD,M
Boys,99.79,5,Jaybrian Williams,Galveston Ball,94.8,147.42,102.06,192.78,442.25,Single-ply,SBD,M
Boys,109.77,1,Charles Tisby,Pasadena Dobie,106.78,226.8,151.95,267.62,646.37,Single-ply,SBD,M
Boys,109.77,2,Ashante Joseph,Pasadena Dobie,101.24,249.48,138.35,254.01,641.83,Single-ply,SBD,M
Boys,109.77,3,Andrew Bletsch,Santa Fe,109.59,233.6,158.76,249.48,641.83,Single-ply,SBD,M
Boys,109.77,4,Richard Goodson,Texas City,108.59,240.4,136.08,244.94,621.42,Single-ply,SBD,M
Boys,109.77,5,Ervin Billiot,Hitchcock,102.06,231.33,129.27,224.53,585.13,Single-ply,SBD,M
Boys,109.77,6,Cobry Dotdon,Galveston Ball,105.14,195.04,124.74,215.46,535.24,Single-ply,SBD,M
Boys,124.74,1,Ray Gentry,Santa Fe,123.01,297.1,206.38,260.82,764.3,Single-ply,SBD,M
Boys,124.74,2,Kenny Wilkins,Texas City,115.85,210.92,138.35,215.46,564.72,Single-ply,SBD,M
Boys,124.74,3,Leland Brown,Galveston Ball,113.4,190.51,120.2,183.7,494.42,Single-ply,SBD,M
Boys,124.74,4,Nico Ortiz,Texas City,117.48,163.29,97.52,161.03,421.84,Single-ply,SBD,M
Boys,124.74+,1,Frank Green,Dickinson,125.1,317.51,185.97,240.4,743.89,Single-ply,SBD,M
Boys,124.74+,2,Luis Cavazos,Texas City,143.34,185.97,113.4,185.97,485.34,Single-ply,SBD,M
