Division,WeightClassKg,Place,Name,Team,BodyweightKg,Best3SquatKg,Best3BenchKg,Best3DeadliftKg,TotalKg,Equipment,Event,Sex,BirthDate
Boys,51.71,1,Kody Estes,Donna,51.26,102.06,58.97,106.59,267.62,Single-ply,SBD,M,
Boys,51.71,2,Ruben Aguilera,Donna North,49.17,70.31,47.63,90.72,208.65,Single-ply,SBD,M,
Boys,51.71,DQ,Deondre Moody,Donna North,46.54,83.91,,,,Single-ply,SBD,M,
Boys,67.13,1,Ashton Garcia,Donna,64.41,127.01,70.31,113.4,310.71,Single-ply,SBD,M,
Boys,67.13,DQ,Jose Molina,Donna North,63.5,120.2,,,,Single-ply,SBD,M,
Boys,74.84,1,Alex Benavidez,Donna North,74.84,219.99,133.81,192.78,546.58,Single-ply,SBD,M,
Boys,82.1,1,John Bustos,Donna North,82.1,249.48,147.42,206.38,603.28,Single-ply,SBD,M,
Boys,82.1,2,Joel Ramirez,Donna,82.1,192.78,99.79,174.63,467.2,Single-ply,SBD,M,
Boys,89.81,1,Ryan Ramirez,Donna,83.01,167.83,99.79,151.95,419.57,Single-ply,SBD,M,
Boys,89.81,2,Tony Ruiz,Donna,89.36,170.1,86.18,151.95,408.23,Single-ply,SBD,M,
Boys,99.79,1,Tony Gandaria,Donna North,99.79,251.74,174.63,229.06,655.44,Single-ply,SBD,M,
Boys,99.79,2,Gabriel Ortiz,Donna,98.88,219.99,149.69,192.78,562.45,Single-ply,SBD,M,
Boys,99.79,3,Aric Singleterry,Donna,99.34,226.8,124.74,199.58,551.11,Single-ply,SBD,M,
Boys,99.79,4,Jesus Benavides,Donna North,92.35,183.7,102.06,167.83,453.59,Single-ply,SBD,M,
Boys,109.77,1,Fabian Martinez,Donna North,109.77,297.1,151.95,249.48,698.53,Single-ply,SBD,M,
Boys,109.77,2,Caleb Torres,Donna,109.32,226.8,120.2,226.8,573.79,Single-ply,SBD,M,
Boys,109.77,3,Matt Fernandez,Donna,102.06,204.12,117.93,149.69,471.74,Single-ply,SBD,M,
Boys,109.77,DQ,Moises Ochoa,Donna North,103.42,192.78,,,,Single-ply,SBD,M,
Boys,124.74,1,Edgar Otero,Donna North,121.2,272.16,142.88,219.99,635.03,Single-ply,SBD,M,
Boys,124.74,2,Juan Meza,Donna,115.21,192.78,102.06,154.22,449.06,Single-ply,SBD,M,
Boys,139.71,1,Juan Vargas,Donna,131.54,208.65,145.15,176.9,530.7,Single-ply,SBD,M,
Boys,139.71+,1,Eduardo De La Cerda,Donna,142.88,233.6,138.35,179.17,551.11,Single-ply,SBD,M,
