Division,WeightClassKg,Place,Name,Team,BodyweightKg,Best3SquatKg,Best3BenchKg,Best3DeadliftKg,TotalKg,Equipment,Event,Sex,BirthDate
Boys,59.87,1,Isaac Prieto,Lyford,58.51,138.35,83.91,147.42,369.68,Single-ply,SBD,M,
Boys,67.13,1,Jonathan Castillo,Edcouch-Elsa,66.22,219.99,129.27,195.04,544.31,Single-ply,SBD,M,
Boys,67.13,2,Tyler McClaugherty,Lyford,65.63,199.58,104.33,201.85,505.76,Single-ply,SBD,M,
Boys,67.13,3,Ramon Castro,Lyford,65.59,131.54,86.18,145.15,362.87,Single-ply,SBD,M,
Boys,74.84,1,Matt Sanchez,Lyford,73.53,190.51,120.2,204.12,514.83,Single-ply,SBD,M,
Boys,74.84,2,Diego Valdez,Edcouch-Elsa,73.94,190.51,120.2,199.58,510.29,Single-ply,SBD,M,
Boys,74.84,3,Devon Mendoza,Lyford,74.66,201.85,115.67,174.63,492.15,Single-ply,SBD,M,
Boys,74.84,4,Victor Rubalcaba,Lyford,74.84,147.42,102.06,156.49,405.97,Single-ply,SBD,M,
Boys,74.84,DQ,Luis Hernandez,Edcouch-Elsa,73.94,185.97,,,,Single-ply,SBD,M,
Boys,82.1,1,Victor Guerrero,Edcouch-Elsa,81.19,204.12,131.54,208.65,544.31,Single-ply,SBD,M,
Boys,82.1,2,Jonathan Lugo,Edcouch-Elsa,81.65,197.31,108.86,195.04,501.22,Single-ply,SBD,M,
Boys,89.81,1,Nico Herrea,Edcouch-Elsa,89.36,219.99,140.61,183.7,544.31,Single-ply,SBD,M,
Boys,89.81,2,Sean Marmolejo,Edcouch-Elsa,88.9,208.65,122.47,183.7,514.83,Single-ply,SBD,M,
Boys,99.79,1,Justyn Esquivel,Edcouch-Elsa,98.88,249.48,163.29,217.72,630.49,Single-ply,SBD,M,
Boys,99.79,2,Oscar Lupercio,Lyford,98.88,208.65,138.35,206.38,553.38,Single-ply,SBD,M,
Boys,99.79,3,Derek Vera,Edcouch-Elsa,99.34,199.58,131.54,170.1,501.22,Single-ply,SBD,M,
Boys,99.79,4,Elijah Vela,Lyford,97.93,161.03,113.4,183.7,458.13,Single-ply,SBD,M,
Boys,109.77,1,Justin Sandoval,Edcouch-Elsa,108.41,238.14,136.08,215.46,589.67,Single-ply,SBD,M,
Boys,109.77,2,Carlos Martinez,Lyford,103.33,217.72,127.01,219.99,564.72,Single-ply,SBD,M,
Boys,109.77,3,Jared Hernandez,Edcouch-Elsa,108.86,185.97,108.86,154.22,449.06,Single-ply,SBD,M,
Boys,139.71+,1,Juan Barrera,Edcouch-Elsa,155.13,240.4,136.08,181.44,557.92,Single-ply,SBD,M,
