Place,Sex,Name,CyrillicName,BodyweightKg,Squat1Kg,Squat2Kg,Squat3Kg,Best3SquatKg,Squat4Kg,Bench1Kg,Bench2Kg,Bench3Kg,Best3BenchKg,Bench4Kg,Deadlift1Kg,Deadlift2Kg,Deadlift3Kg,Best3DeadliftKg,Deadlift4Kg,TotalKg,WeightClassKg,Event,Equipment,Tested,Division,Age,BirthDate
1,F,Anastasiya Ivanova,Анастасия Иванова,52,70,75,80,80,,35,-40,-40,35,,80,85,90,90,,205,52,SBD,Raw,No,Pro Open,28,1992-12-28
1,F,Yuliya Egorova,Юлия Егорова,65.6,-90,-90,90,90,,47.5,55,-57.5,55,,85,90,-100,90,,235,67.5,SBD,Raw,No,Pro Open,27,1993-05-06
1,M,Vladimir Stepanov,Владимир Степанов,65.3,135,140,145,145,,95,100,-105,100,,160,165,-170,165,,410,67.5,SBD,Raw,No,Pro Open,26,1994-10-05
1,M,Anton Vinokurov,Антон Винокуров,74.4,140,155,160,160,,95,102.5,-105,102.5,,195,-205,-205,195,,457.5,75,SBD,Raw,No,Pro Open,29,1991-12-15
1,M,Sergey Nesterko,Сергей Нестерко,81,140,150,-155,150,,125,130,-135,130,,200,220,230,230,,510,82.5,SBD,Raw,No,Pro Open,37,1983-04-29
1,M,Rafael Garifullov,Рафаэль Гарифуллов,70,180,190,195,195,,140,-147.5,147.5,147.5,,200,210,220,220,,562.5,75,SBD,Wraps,No,Pro Open,26,1995-01-03
1,F,Olga Gorozhanina,Ольга Горожанина,54.4,,,,,,45,52.5,-57.5,52.5,,,,,,,52.5,56,B,Raw,No,Pro Open,37,1983-11-05
DQ,F,Natalya Bagautdinova,Наталья Багаутдинова,59,,,,,,-50,-50,-50,,,,,,,,,60,B,Raw,No,Pro Open,35,1985-10-30
1,M,Timur Galeev,Тимур Галеев,64.7,,,,,,37.5,42.5,-47.5,42.5,,,,,,,42.5,67.5,B,Raw,No,Youth,12,2008-07-18
1,M,Aleksey Shestakov,Алексей Шестаков,64.6,,,,,,77.5,-87.5,-87.5,77.5,,,,,,,77.5,67.5,B,Raw,No,Pro Open,31,1989-09-23
2,M,Ruslan Zaynetdinov,Руслан Зайнетдинов,64.7,,,,,,77.5,-85,-90,77.5,,,,,,,77.5,67.5,B,Raw,No,Pro Open,24,1996-11-05
1,M,Andrey Osin,Андрей Осин,72.3,,,,,,-75,75,85,85,,,,,,,85,75,B,Raw,No,Pro Sub-Juniors 17-19,17,2004-03-25
1,M,Rafael Garifullov,Рафаэль Гарифуллов,70,,,,,,140,-147.5,147.5,147.5,,,,,,,147.5,75,B,Raw,No,Pro Open,26,1995-01-03
2,M,Delyus Khaysarov,Делюс Хайсаров,74.1,,,,,,110,115,120,120,,,,,,,120,75,B,Raw,No,Pro Open,31,1990-02-16
3,M,Aleksandr Karagodin,Александр Карагодин,74.3,,,,,,105,110,117.5,117.5,,,,,,,117.5,75,B,Raw,No,Pro Open,29,1991-05-07
1,M,Evgeniy Novichkov,Евгений Новичков,80,,,,,,120,-132.5,-142.5,120,,,,,,,120,82.5,B,Raw,No,Pro Sub-Juniors 17-19,18,2002-07-09
1,M,Aleksey Aryabkin,Алексей Арябкин,82.5,,,,,,140,147.5,152.5,152.5,,,,,,,152.5,82.5,B,Raw,No,Pro Open,32,1988-04-16
2,M,Dmitriy Romanov,Дмитрий Романов,79.8,,,,,,125,135,-137.5,135,,,,,,,135,82.5,B,Raw,No,Pro Open,36,1984-05-18
3,M,Sergey Nesterko,Сергей Нестерко,81,,,,,,125,130,-135,130,,,,,,,130,82.5,B,Raw,No,Pro Open,37,1983-04-29
1,M,Mikhail Bondarenko,Михаил Бондаренко,88.2,,,,,,120,127.5,-135,127.5,,,,,,,127.5,90,B,Raw,No,Pro Teen 14-16,15,2006-01-03
1,M,Aleksey Filatov,Алексей Филатов,88.3,,,,,,90,95,100,100,,,,,,,100,90,B,Raw,No,Pro Sub-Juniors 17-19,18,2002-05-07
1,M,Aleksandr Lamzin,Александр Ламзин,88.5,,,,,,170,175,180,180,,,,,,,180,90,B,Raw,No,Pro Open,30,1990-07-18
2,M,Anton Polatovskiy,Антон Полатовский,90,,,,,,115,-125,-125,115,,,,,,,115,90,B,Raw,No,Pro Open,26,1994-04-19
1,M,Dmitriy Sidorov,Дмитрий Сидоров,96,,,,,,-160,165,-170,165,,,,,,,165,100,B,Raw,No,Pro Open,33,1988-03-28
2,M,Vladimir Patrin,Владимир Патрин,94.3,,,,,,-115,120,125,125,,,,,,,125,100,B,Raw,No,Pro Open,25,1995-04-30
1,M,Denis Sergeev,Денис Сергеев,106.4,,,,,,160,167.5,172.5,172.5,,,,,,,172.5,110,B,Raw,No,Pro Open,29,1991-08-17
1,M,Vladimir Adamov,Владимир Адамов,119.5,,,,,,190,205,210,210,,,,,,,210,125,B,Raw,No,Pro Open,34,1986-04-25
1,M,Aleksandr Fedotov,Александр Федотов,137.6,,,,,,185,192.5,-200,192.5,,,,,,,192.5,140,B,Raw,No,Pro Open,28,1993-02-18
1,F,Anna Golubeva,Анна Голубева,62.5,,,,,,,,,,,95,100,105,105,,105,67.5,D,Raw,No,Pro Open,37,1983-10-07
1,F,Elena Tkachun,Елена Ткачун,89.3,,,,,,,,,,,125,132.5,137.5,137.5,,137.5,90,D,Raw,No,Pro Masters 50-59,59,1961-05-10
1,M,Rafael Garifullov,Рафаэль Гарифуллов,70,,,,,,,,,,,200,210,220,220,,220,75,D,Raw,No,Pro Open,26,1995-01-03
2,M,Anton Vinokurov,Антон Винокуров,74.4,,,,,,,,,,,195,-205,-205,195,,195,75,D,Raw,No,Pro Open,29,1991-12-15
1,M,Mikhail Ivanov,Михаил Иванов,81.3,,,,,,,,,,,155,162.5,167.5,167.5,,167.5,82.5,D,Raw,No,Pro Teen 14-16,16,2004-08-11
1,M,Sergey Nesterko,Сергей Нестерко,81,,,,,,,,,,,200,220,230,230,,230,82.5,D,Raw,No,Pro Open,37,1983-04-29
1,M,Aleksandr Bogdanov,Александр Богданов,95.4,,,,,,,,,,,210,220,230,230,,230,100,D,Raw,No,Pro Juniors 20-23,23,1997-10-16
1,M,Aleksey Chumnov,Алексей Чумнов,106.5,,,,,,,,,,,240,250,255,255,,255,110,D,Raw,No,Pro Open,35,1985-11-06
2,M,Denis Gorozhanin,Денис Горожанин,106.2,,,,,,,,,,,150,160,170,170,,170,110,D,Raw,No,Pro Open,27,1993-05-15
