Division,WeightClassKg,Place,Name,Team,BodyweightKg,Best3SquatKg,Best3BenchKg,Best3DeadliftKg,TotalKg,Equipment,Event,Sex
Boys,55.79,1,Richard Guerra,Waco Midway,51.89,106.59,58.97,117.93,283.5,Single-ply,SBD,M
Boys,51.71,2,Fredrick Sandoval,Copperas Cove,51.35,88.45,56.7,133.81,278.96,Single-ply,SBD,M
Boys,51.71,3,Isaiah Robinson,Waco Midway,49.9,92.99,65.77,111.13,269.89,Single-ply,SBD,M
Boys,51.71,4,Johnny Martinez,Belton,50.53,83.91,58.97,106.59,249.48,Single-ply,SBD,M
Boys,51.71,5,Cody Bester,Fairfield,40.64,63.5,40.82,72.57,176.9,Single-ply,SBD,M
Boys,51.71,6,Sean Murphy,Bosqueville,48.99,56.7,34.02,74.84,165.56,Single-ply,SBD,M
Boys,55.79,1,Clint Lott,Waco Midway,55.43,138.35,72.57,136.08,347,Single-ply,SBD,M
Boys,55.79,DQ,Jonathan Johnson,Copperas Cove,52.8,,,,,Single-ply,SBD,M
Boys,55.79,3,Pete Contreras,Belton,54.79,97.52,63.5,113.4,274.42,Single-ply,SBD,M
Boys,67.13,1,Tyson Eno,Belton,59.96,136.08,90.72,147.42,374.21,Single-ply,SBD,M
Boys,59.87,2,Luis Juarez,Bosqueville,59.69,124.74,77.11,151.95,353.8,Single-ply,SBD,M
Boys,59.87,3,Colton Russell,Bosqueville,56.79,131.54,68.04,136.08,335.66,Single-ply,SBD,M
Boys,67.13,4,Julian Woods,Belton,59.96,108.86,79.38,129.27,317.51,Single-ply,SBD,M
Boys,59.87,5,Hunter Wehmeier,Copperas Cove,59.33,104.33,72.57,129.27,306.17,Single-ply,SBD,M
Boys,59.87,6,Thomas Lene,Waco Midway,57.33,102.06,74.84,108.86,285.76,Single-ply,SBD,M
Boys,59.87,7,Brandon Schmidt,Temple,57.88,104.33,65.77,115.67,285.76,Single-ply,SBD,M
Boys,67.13,1,Matt Hall,Copperas Cove,64.32,174.63,106.59,197.31,478.54,Single-ply,SBD,M
Boys,67.13,2,Gary Goode,Waco Midway,66.95,170.1,88.45,179.17,437.72,Single-ply,SBD,M
Boys,67.13,3,Robert Martinez,Belton,65.77,149.69,77.11,190.51,417.3,Single-ply,SBD,M
Boys,74.84,4,Colton Nixon,Waco Midway,67.31,156.49,97.52,156.49,410.5,Single-ply,SBD,M
Boys,67.13,5,Zach Beyer,Bosqueville,66.13,149.69,83.91,172.37,405.97,Single-ply,SBD,M
Boys,67.13,6,Jeffrey Sanders,Temple,65.41,145.15,90.72,154.22,390.09,Single-ply,SBD,M
Boys,67.13,7,Rudy Gonzales,Belton,66.22,147.42,77.11,154.22,378.75,Single-ply,SBD,M
Boys,74.84,8,Michael Espinosa,Waco Midway,67.31,145.15,79.38,149.69,374.21,Single-ply,SBD,M
Boys,67.13,9,Fabian Valenzuela,Copperas Cove,64.68,133.81,83.91,154.22,371.95,Single-ply,SBD,M
Boys,67.13,10,Jermaine Snowden,Copperas Cove,64.59,111.13,68.04,136.08,315.25,Single-ply,SBD,M
Boys,67.13,11,Brandon Julian,Belton,63.68,113.4,61.23,129.27,303.91,Single-ply,SBD,M
Boys,67.13,12,Colton Scallion,Bosqueville,62.05,92.99,63.5,117.93,274.42,Single-ply,SBD,M
Boys,74.84,DQ,Stephen Snyder,Belton,67.22,133.81,,,,Single-ply,SBD,M
Boys,74.84,1,Myrlon Edwards,Waco Midway,73.66,213.19,104.33,192.78,510.29,Single-ply,SBD,M
Boys,74.84,2,Eduardo Rodriguez,Temple,71.21,181.44,117.93,185.97,485.34,Single-ply,SBD,M
Boys,74.84,3,Tywon Thomas,Belton,74.12,156.49,122.47,197.31,476.27,Single-ply,SBD,M
Boys,74.84,4,Stephen St John,Belton,74.84,170.1,99.79,204.12,474,Single-ply,SBD,M
Boys,74.84,5,Naaman Young,Copperas Cove,73.75,151.95,127.01,181.44,460.4,Single-ply,SBD,M
Boys,74.84,6,Tony Thomas,Waco,74.12,172.37,102.06,185.97,460.4,Single-ply,SBD,M
Boys,74.84,7,Darren Smith #2,Belton,72.39,149.69,108.86,154.22,412.77,Single-ply,SBD,M
Boys,74.84,8,Keith Buhl,Temple,74.84,158.76,72.57,181.44,412.77,Single-ply,SBD,M
Boys,74.84,9,Case D'Herde,Waco Midway,69.04,142.88,90.72,174.63,408.23,Single-ply,SBD,M
Boys,74.84,10,Robert Seybold,Copperas Cove,72.94,129.27,77.11,147.42,353.8,Single-ply,SBD,M
Boys,74.84,11,Alex Anderson #3,Waco Midway,73.75,117.93,79.38,140.61,337.93,Single-ply,SBD,M
Boys,74.84,12,Demarkos White,Copperas Cove,72.85,111.13,58.97,140.61,310.71,Single-ply,SBD,M
Boys,74.84,DQ,Andrew Morgan,Bosqueville,73.03,113.4,,138.35,,Single-ply,SBD,M
Boys,82.1,1,Keimon McDowell,Waco,78.56,190.51,102.06,204.12,496.68,Single-ply,SBD,M
Boys,89.81,2,Trey Reagan,Waco Midway,82.28,201.85,113.4,181.44,496.68,Single-ply,SBD,M
Boys,89.81,3,Shawn Sunday,Waco,82.19,181.44,88.45,188.24,458.13,Single-ply,SBD,M
Boys,82.1,4,Johnny Sirmanes,Copperas Cove,77.75,172.37,102.06,176.9,451.32,Single-ply,SBD,M
Boys,82.1,5,Victor Norwood,Waco,81.56,174.63,97.52,174.63,446.79,Single-ply,SBD,M
Boys,82.1,6,Adrian Norwood,Waco,77.11,151.95,95.25,165.56,412.77,Single-ply,SBD,M
Boys,82.1,7,Nika Davis,Waco,81.01,136.08,86.18,145.15,367.41,Single-ply,SBD,M
Boys,82.1,DQ,Julian Doubleday,Copperas Cove,78.2,158.76,83.91,,,Single-ply,SBD,M
Boys,82.1,DQ,Colby Guillroy,Copperas Cove,78.38,136.08,90.72,,,Single-ply,SBD,M
Boys,82.1,DQ,Devin Patterson,Belton,81.56,170.1,,,,Single-ply,SBD,M
Boys,89.81,DQ,Cody Stidham,Waco Midway,88.63,,,,,Single-ply,SBD,M
Boys,89.81,DQ,Alex Johnson #8,Copperas Cove,85.82,,,,,Single-ply,SBD,M
Boys,89.81,3,Justin Richter,Waco Midway,88.45,199.58,136.08,174.63,510.29,Single-ply,SBD,M
Boys,89.81,4,Aj Gabriel,Fairfield,88.54,188.24,108.86,185.97,483.08,Single-ply,SBD,M
Boys,89.81,5,Patrick Rieves,Temple,89.72,170.1,117.93,174.63,462.66,Single-ply,SBD,M
Boys,89.81,6,Ryan Cox,Belton,89.81,167.83,111.13,147.42,426.38,Single-ply,SBD,M
Boys,89.81,7,Dalton Barker,Fairfield,87,142.88,97.52,158.76,399.16,Single-ply,SBD,M
Boys,89.81,8,Devin Mercer,Waco Midway,88.9,133.81,102.06,145.15,381.02,Single-ply,SBD,M
Boys,89.81,9,Brandon Jackson,Waco,83.91,127.01,77.11,142.88,347,Single-ply,SBD,M
Boys,109.77,1,Ryan Wilkinson,Fairfield,99.88,249.48,145.15,231.33,625.96,Single-ply,SBD,M
Boys,99.79,2,Ricky Alvarez,Belton,99.7,229.06,154.22,213.19,596.47,Single-ply,SBD,M
Boys,99.79,DQ,Josh Lyons,Copperas Cove,96.52,,,,,Single-ply,SBD,M
Boys,99.79,4,Brandon Hamilton,Copperas Cove,91.99,208.65,115.67,226.8,551.11,Single-ply,SBD,M
Boys,99.79,5,Greg Garrett,Waco Midway,99.34,226.8,136.08,188.24,551.11,Single-ply,SBD,M
Boys,99.79,6,Cody Sell,Fairfield,93.62,204.12,115.67,190.51,510.29,Single-ply,SBD,M
Boys,99.79,7,Josh Owens,Waco,91.53,183.7,104.33,197.31,485.34,Single-ply,SBD,M
Boys,99.79,8,Stefan White,Waco,96.34,185.97,108.86,176.9,471.74,Single-ply,SBD,M
Boys,99.79,9,Justin Greene,Copperas Cove,99.06,163.29,111.13,174.63,449.06,Single-ply,SBD,M
Boys,99.79,10,Luke Rachel,Fairfield,95.44,142.88,102.06,154.22,399.16,Single-ply,SBD,M
Boys,99.79,11,James Murphy,Belton,94.89,158.76,81.65,147.42,387.82,Single-ply,SBD,M
Boys,99.79,12,Alex Hoskins,Fairfield,98.16,136.08,99.79,113.4,349.27,Single-ply,SBD,M
Boys,99.79,DQ,Andy Pendleton,Waco,93.71,170.1,88.45,,,Single-ply,SBD,M
Boys,99.79,DQ,Donald Thompson,Waco,98.25,165.56,,,,Single-ply,SBD,M
Boys,99.79,DQ,John Almanza,Bosqueville,94.8,170.1,97.52,,,Single-ply,SBD,M
Boys,99.79,DQ,Gage Anderson,Bosqueville,93.35,,,,,Single-ply,SBD,M
Boys,109.77,1,Cory Black,Fairfield,108.68,260.82,167.83,226.8,655.44,Single-ply,SBD,M
Boys,109.77,2,Michael Mooneyham,Fairfield,103.87,249.48,136.08,240.4,625.96,Single-ply,SBD,M
Boys,109.77,3,Christian Barry,Waco Midway,109.32,260.82,142.88,219.99,623.69,Single-ply,SBD,M
Boys,124.74,DQ,Ryan Miller #6,Copperas Cove,109.86,,,,,Single-ply,SBD,M
Boys,109.77,5,Luke Biarnsen,Waco Midway,109.41,215.46,124.74,208.65,548.85,Single-ply,SBD,M
Boys,109.77,6,Brent Marona,Copperas Cove,103.15,226.8,106.59,208.65,542.04,Single-ply,SBD,M
Boys,109.77,7,Dillon Kilpatrick,Fairfield,104.33,208.65,145.15,181.44,535.24,Single-ply,SBD,M
Boys,109.77,8,Ray Jones,Copperas Cove,101.88,172.37,120.2,170.1,462.66,Single-ply,SBD,M
Boys,109.77,9,Bryant Jones,Temple,102.6,158.76,115.67,174.63,449.06,Single-ply,SBD,M
Boys,109.77,10,Evan Gordan,Waco,105.51,172.37,111.13,161.03,444.52,Single-ply,SBD,M
Boys,109.77,11,David Moore #6,Copperas Cove,104.42,147.42,81.65,147.42,376.48,Single-ply,SBD,M
Boys,124.74,1,Daniel Bass,Temple,122.65,256.28,154.22,226.8,637.3,Single-ply,SBD,M
Boys,124.74,2,Stephen Honeywood,Belton,119.11,242.67,136.08,206.38,585.13,Single-ply,SBD,M
Boys,124.74,3,Trevell Harden,Waco Midway,112.94,226.8,142.88,195.04,564.72,Single-ply,SBD,M
Boys,124.74,4,Marquise Johnson,Waco Midway,114.21,208.65,136.08,190.51,535.24,Single-ply,SBD,M
Boys,124.74,5,Mike Wall,Belton,118.12,192.78,138.35,183.7,514.83,Single-ply,SBD,M
Boys,124.74,6,Richard Carvajal,Waco,115.21,226.8,102.06,170.1,498.95,Single-ply,SBD,M
Boys,124.74,7,Jerron Palmer,Waco,123.65,195.04,111.13,188.24,494.42,Single-ply,SBD,M
Boys,124.74,8,Nathan Moody,Belton,111.86,172.37,102.06,176.9,451.32,Single-ply,SBD,M
Boys,124.74,DQ,Trent Andrews,Bosqueville,119.66,183.7,,,,Single-ply,SBD,M
Boys,124.74,DQ,Cody Elenz,Copperas Cove,124.65,247.21,,,,Single-ply,SBD,M
Boys,124.74+,1,Andrew Billings #1,Waco,125.37,219.99,156.49,233.6,610.08,Single-ply,SBD,M
Boys,124.74+,DQ,Daniel Alverez,Waco Midway,174.27,,,,,Single-ply,SBD,M
Boys,124.74+,3,Les Sakaria,Copperas Cove,127.55,215.46,120.2,183.7,519.36,Single-ply,SBD,M
Boys,124.74+,4,Michael Stevenson,Bosqueville,128.09,174.63,102.06,185.97,462.66,Single-ply,SBD,M
Boys,124.74+,5,Koby Williams,Belton,130.18,154.22,104.33,170.1,428.64,Single-ply,SBD,M
Boys,124.74+,6,Kyle Donaldson,Bosqueville,130.63,136.08,90.72,158.76,385.55,Single-ply,SBD,M
Boys,124.74+,DQ,Devon Petty,Waco Midway,161.93,,,,,Single-ply,SBD,M
