Division,WeightClassKg,Place,Name,Team,BodyweightKg,Best3SquatKg,Best3BenchKg,Best3DeadliftKg,TotalKg,Equipment,Event,Sex
Boys,51.71,1,Kelton Johnson,Levelland,27.67,34.02,22.68,49.9,106.59,Single-ply,SBD,M
Boys,55.79,1,Landon Nail,Lubbock Cooper,55.79,127.01,81.65,161.03,369.68,Single-ply,SBD,M
Boys,55.79,2,Cysco Barrera,Plainview,55.79,131.54,54.43,117.93,303.91,Single-ply,SBD,M
Boys,55.79,3,Izac Anthony,Levelland,55.79,102.06,47.63,124.74,274.42,Single-ply,SBD,M
Boys,59.87,1,Abraham Herrera,Levelland,59.42,102.06,56.7,115.67,274.42,Single-ply,SBD,M
Boys,67.13,1,Dillan Smith,Lubbock Cooper,63.5,163.29,111.13,183.7,458.13,Single-ply,SBD,M
Boys,67.13,2,Mason Brogden,Levelland,63.5,113.4,65.77,136.08,315.25,Single-ply,SBD,M
Boys,67.13,3,Austin White,Levelland,63.96,115.67,61.23,138.35,315.25,Single-ply,SBD,M
Boys,67.13,4,Stephen Calcote,Levelland,63.05,108.86,63.5,140.61,312.98,Single-ply,SBD,M
Boys,67.13,5,Rafael Ramero,Lubbock Cooper,62.14,111.13,61.23,129.27,301.64,Single-ply,SBD,M
Boys,67.13,6,Ian Mitchell #1,Lubbock Cooper,63.05,102.06,52.16,111.13,265.35,Single-ply,SBD,M
Boys,67.13,7,Nathan Fletcher #3,Levelland,67.13,95.25,58.97,108.86,263.08,Single-ply,SBD,M
Boys,67.13,DQ,Ivan Espinosa,Plainview,60.78,83.91,,,,Single-ply,SBD,M
Boys,74.84,1,Gabe Rodriguez,Lubbock Cooper,71.21,161.03,97.52,181.44,439.98,Single-ply,SBD,M
Boys,74.84,2,Jesus Rios Flores,Plainview,69.4,124.74,74.84,136.08,335.66,Single-ply,SBD,M
Boys,74.84,3,Bobby Marez,Levelland,68.95,111.13,74.84,142.88,328.85,Single-ply,SBD,M
Boys,74.84,4,Jacob Sanchez,Lubbock Cooper,73.94,124.74,79.38,122.47,326.59,Single-ply,SBD,M
Boys,74.84,5,Logan Wright,Levelland,73.48,113.4,65.77,138.35,317.51,Single-ply,SBD,M
Boys,74.84,6,Jacob Woolam,Lubbock Cooper,74.84,111.13,65.77,136.08,312.98,Single-ply,SBD,M
Boys,74.84,DQ,Dustin Beverage,Plainview,72.12,127.01,79.38,,,Single-ply,SBD,M
Boys,82.1,1,Brody Schleeter,Lubbock Cooper,79.83,206.38,147.42,233.6,587.4,Single-ply,SBD,M
Boys,82.1,2,Caleb Hurst,Lubbock Cooper,77.56,176.9,122.47,197.31,496.68,Single-ply,SBD,M
Boys,82.1,3,Carlos Pina,Lubbock Cooper,82.1,195.04,113.4,188.24,496.68,Single-ply,SBD,M
Boys,82.1,4,Armando Ramos,Levelland,81.19,158.76,104.33,174.63,437.72,Single-ply,SBD,M
Boys,82.1,5,Joshua Diaz,Plainview,81.19,129.27,77.11,122.47,328.85,Single-ply,SBD,M
Boys,89.81,1,Quinten Franks,Lubbock Cooper,87.09,208.65,111.13,226.8,546.58,Single-ply,SBD,M
Boys,89.81,2,Manuel Casteleja,Plainview,85.73,170.1,106.59,181.44,458.13,Single-ply,SBD,M
Boys,89.81,3,Will Moran,Lubbock Cooper,89.81,142.88,88.45,181.44,412.77,Single-ply,SBD,M
Boys,89.81,4,Renee Enriquez,Lubbock Cooper,89.36,147.42,90.72,170.1,408.23,Single-ply,SBD,M
Boys,89.81,5,Joel Rodriquez,Plainview,87.09,156.49,88.45,156.49,401.43,Single-ply,SBD,M
Boys,89.81,6,Nathan Silva,Lubbock Cooper,88.45,124.74,83.91,145.15,353.8,Single-ply,SBD,M
Boys,89.81,7,Troy Jewel,Lubbock Cooper,85.28,120.2,70.31,136.08,326.59,Single-ply,SBD,M
Boys,99.79,1,Braden Price,Levelland,91.17,170.1,95.25,204.12,469.47,Single-ply,SBD,M
Boys,99.79,2,Adrian Cabanas,Lubbock Cooper,97.52,163.29,97.52,181.44,442.25,Single-ply,SBD,M
Boys,99.79,3,Karson Ritchie,Lubbock Cooper,90.26,111.13,72.57,117.93,301.64,Single-ply,SBD,M
Boys,109.77,1,Heath Carrell,Lubbock Cooper,105.23,219.99,158.76,226.8,605.55,Single-ply,SBD,M
Boys,109.77,2,Octavius Vera,Plainview,102.06,215.46,115.67,181.44,512.56,Single-ply,SBD,M
Boys,109.77,3,Christan Barkley,Lubbock Cooper,109.77,170.1,117.93,204.12,492.15,Single-ply,SBD,M
Boys,109.77,4,Ethan Martinez,Lubbock Cooper,109.32,181.44,122.47,163.29,467.2,Single-ply,SBD,M
Boys,109.77,5,Troy Teo,Lubbock Cooper,103.87,154.22,102.06,165.56,421.84,Single-ply,SBD,M
Boys,109.77,6,Gilbert Lopez,Plainview,109.32,185.97,92.99,136.08,415.04,Single-ply,SBD,M
Boys,109.77,7,Zach Bocanegra,Lubbock Cooper,105.69,145.15,95.25,147.42,387.82,Single-ply,SBD,M
Boys,124.74,1,Jacob Schneider,Lubbock Cooper,117.03,185.97,158.76,185.97,530.7,Single-ply,SBD,M
Boys,124.74,2,Garrett Reavis,Lubbock Cooper,124.74,165.56,108.86,181.44,455.86,Single-ply,SBD,M
Boys,124.74,3,Cody Wright,Plainview,113.4,158.76,86.18,158.76,403.7,Single-ply,SBD,M
Boys,124.74+,1,JJ Castro,Levelland,153.77,163.29,97.52,167.83,428.64,Single-ply,SBD,M
Boys,124.74+,2,Travis Flinchbaugh,Lubbock Cooper,125.19,113.4,65.77,136.08,315.25,Single-ply,SBD,M
