<svg xmlns="http://www.w3.org/2000/svg" width="32.705" height="36" viewBox="0 0 32.705 36">
  <g id="Icon_feather-bell" data-name="Icon feather-bell" transform="translate(-3 -1.5)">
    <path id="Path_7292" data-name="Path 7292" d="M29.254,12.9a9.9,9.9,0,1,0-19.8,0C9.451,24.454,4.5,27.754,4.5,27.754H34.205s-4.951-3.3-4.951-14.853" transform="translate(0 0)" fill="none" stroke="#fff" stroke-linecap="round" stroke-linejoin="round" stroke-width="3"/>
    <path id="Path_7293" data-name="Path 7293" d="M21.115,31.5a3.3,3.3,0,0,1-5.71,0" transform="translate(1.093 2.856)" fill="none" stroke="#fff" stroke-linecap="round" stroke-linejoin="round" stroke-width="3"/>
  </g>
</svg>
