<svg xmlns="http://www.w3.org/2000/svg" width="28.954" height="28.955" viewBox="0 0 28.954 28.955">
  <path id="Icon_material-person" data-name="Icon material-person" d="M18.477,18.477a6.239,6.239,0,1,0-6.239-6.239A6.237,6.237,0,0,0,18.477,18.477Zm0,3.119C14.313,21.6,6,23.687,6,27.835v3.119H30.954V27.835C30.954,23.687,22.641,21.6,18.477,21.6Z" transform="translate(-4 -4)" fill="none" stroke="#979797" stroke-width="4" opacity="0.67"/>
</svg>
