<svg xmlns="http://www.w3.org/2000/svg" width="49" height="49" viewBox="0 0 49 49">
  <g id="orders" transform="translate(0 -0.487)">
    <rect id="Rectangle_4018" data-name="Rectangle 4018" width="49" height="49" transform="translate(0 0.487)" fill="#fff" opacity="0"/>
    <g id="sent_1_" data-name="sent (1)" transform="translate(8.619 5.632)">
      <g id="Group_5868" data-name="Group 5868">
        <g id="Group_5867" data-name="Group 5867">
          <path id="Path_36915" data-name="Path 36915" d="M281.048,1.039A2.086,2.086,0,0,0,279.248,0h-7.732V9.146h14.221Z" transform="translate(-254.294)" fill="#fff"/>
          <path id="Path_36916" data-name="Path 36916" d="M58.079,0h-7.8a2.086,2.086,0,0,0-1.8,1.041L43.8,9.146H58.079V0Z" transform="translate(-43.025)" fill="#fff"/>
          <path id="Path_36917" data-name="Path 36917" d="M33.057,156.648v24.016a2.6,2.6,0,0,0,2.549,2.647h27.1a2.6,2.6,0,0,0,2.549-2.647V156.648Zm21.02,10.1-5.6,5.823a1.054,1.054,0,0,1-1.532,0l-2.628-2.729a1.158,1.158,0,0,1,0-1.592,1.056,1.056,0,0,1,1.533,0l1.86,1.934,4.839-5.028a1.055,1.055,0,0,1,1.532,0A1.157,1.157,0,0,1,54.077,166.748Z" transform="translate(-33.057 -145.335)" fill="#fff"/>
        </g>
      </g>
    </g>
  </g>
</svg>
