<svg id="Group_6058" data-name="Group 6058" xmlns="http://www.w3.org/2000/svg" width="49" height="49" viewBox="0 0 49 49">
  <rect id="Rectangle_4015" data-name="Rectangle 4015" width="49" height="49" fill="#fff" opacity="0"/>
  <g id="motorcycle_1_" data-name="motorcycle (1)" transform="translate(4.925 6.156)">
    <path id="Path_36931" data-name="Path 36931" d="M38.778,130.391a3.937,3.937,0,0,0-.107-1.793c-1.163-4.19-4.644-12.77-7.537-16.3a2.1,2.1,0,0,0-3.069,0,2.158,2.158,0,0,0-.624,1.336,1.52,1.52,0,0,0-.833-.4s-7.336-.914-7.425-.9H15.846a1.243,1.243,0,0,0-1.405,1.405v10.71H11.992V112.962a1.032,1.032,0,0,0-1.031-1.031H1.031A1.032,1.032,0,0,0,0,112.962s0,16.128,0,17.171a2.17,2.17,0,0,0,2.17,2.17H4.3a5.863,5.863,0,1,0,11.387,0h6.562v1.438a2.063,2.063,0,0,0,2.061,2.061h.039a2.046,2.046,0,0,0,2.045-2.066l-.015-1.433h1.865a5.864,5.864,0,1,0,10.531-1.912Zm-4.837,1.1a2.213,2.213,0,1,1-2.213,2.213A2.215,2.215,0,0,1,33.941,131.487ZM12.209,133.7A2.213,2.213,0,1,1,10,131.487,2.215,2.215,0,0,1,12.209,133.7Zm14.1-8.936a2.084,2.084,0,0,0-2.077-2.056H20.8v-7l1.677.206a1.4,1.4,0,0,0,1.362,1.1h5.87l.455,3.791-3.847,5.036Z" transform="translate(0 -102.585)" fill="#fff"/>
    <path id="Path_36932" data-name="Path 36932" d="M142.745,23.333a4.123,4.123,0,0,0,4.035-4.966l.9-.018a1.627,1.627,0,0,0,1.351-.873l.3-.638a.846.846,0,0,0-.8-1.26l-3.832.009a4.122,4.122,0,1,0-1.963,7.746Z" transform="translate(-125.635 -15.088)" fill="#fff"/>
  </g>
</svg>
