<svg xmlns="http://www.w3.org/2000/svg" xmlns:xlink="http://www.w3.org/1999/xlink" width="36" height="36" viewBox="0 0 36 36">
  <defs>
    <clipPath id="clip-path">
      <rect id="Rectangle_4075" data-name="Rectangle 4075" width="36" height="36" transform="translate(0 -0.164)" fill="#fe7951"/>
    </clipPath>
  </defs>
  <g id="Orders_Cancelled" transform="translate(0 0.165)" clip-path="url(#clip-path)">
    <g id="package_1_" data-name="package (1)" transform="translate(0 0.262)">
      <g id="Group_6034" data-name="Group 6034" transform="translate(1.002 4.821)">
        <g id="Group_6033" data-name="Group 6033">
          <path id="Path_37055" data-name="Path 37055" d="M7.779,5.127,1.353,8.537a2.473,2.473,0,0,0-.312.2L17.471,17.3l6.88-3.4Z" transform="translate(-1.041 -5.127)" fill="#fe7951"/>
        </g>
      </g>
      <g id="Group_6036" data-name="Group 6036" transform="translate(18.463 10.328)">
        <g id="Group_6035" data-name="Group 6035">
          <path id="Path_37056" data-name="Path 37056" d="M36.33,10.849l-8.22,4.065v4.58a1.043,1.043,0,1,1-2.086,0V15.946L19.18,19.331V35.907l.064-.03,15.734-7.972a2.437,2.437,0,0,0,1.355-2.193V10.941C36.333,10.91,36.331,10.879,36.33,10.849Z" transform="translate(-19.18 -10.849)" fill="#fe7951"/>
        </g>
      </g>
      <g id="Group_6038" data-name="Group 6038" transform="translate(9.966 0)">
        <g id="Group_6037" data-name="Group 6037">
          <path id="Path_37057" data-name="Path 37057" d="M34.648,8.347,18.921.378l-.007,0A2.459,2.459,0,0,0,16.688.4L10.354,3.757,27,12.569l8.037-3.975A2.477,2.477,0,0,0,34.648,8.347Z" transform="translate(-10.354 -0.119)" fill="#fe7951"/>
        </g>
      </g>
      <g id="Group_6040" data-name="Group 6040" transform="translate(0 10.259)">
        <g id="Group_6039" data-name="Group 6039">
          <path id="Path_37058" data-name="Path 37058" d="M0,10.776c0,.048,0,.1,0,.144V25.728A2.444,2.444,0,0,0,1.314,27.9l14.98,7.95.007,0,.076.037V19.313ZM11.068,23.269l-1.384.578,1.455,2.309a1.043,1.043,0,1,1-1.765,1.112L7.731,24.662l-1.619.676a1.043,1.043,0,0,1-.8-1.925l1.295-.54L5.169,20.595a1.043,1.043,0,0,1,1.765-1.112l1.621,2.574,1.708-.713a1.043,1.043,0,1,1,.8,1.925Z" transform="translate(0 -10.776)" fill="#fe7951"/>
        </g>
      </g>
    </g>
  </g>
</svg>
