{
  "gitzone": {
    "projectType": "npm",
    "module": {
      "githost": "gitlab.com",
      "gitscope": "signup.software",
      "gitrepo": "interfaces",
      "description": "the public interfaces for signup.software",
      "npmPackagename": "@signup.software/interfaces",
      "license": "MIT",
      "projectDomain": "signup.software"
    }
  },
  "npmci": {
    "npmGlobalTools": [],
    "npmAccessLevel": "public"
  }
}