{
  "roomsCounterLabel": "Rooms",
  "adultsCounterLabel": "Adults",
  "childrenCounterLabel": "Children",
  "roomsCounterTooltip": "The total number of wanted rooms",
  "adultsCounterTooltip": "the total number of adults in all rooms together",
  "childrenCounterTooltip": "the total number of children in all rooms together",
  "roomsCounterDefaultValue": null,
  "adultsCounterDefaultValue": null,
  "childrenCounterDefaultValue": null,
  "show_starting_price_home": false,
  "show_starting_price_booking": false
}
