{
  "home": {
    "kwords": [
      "booking",
      "book",
      "nile",
      "nubian",
      "nuba",
      "Heissacamp",
      "Heissa",
      "Aswan",
      "camp",
      "heissa home"
    ],
    "description": "Heissacamp. Enjoy living simple and natural days in Aswan syle."
  },
  "booking": {
    "kwords": [
      "book",
      "booking",
      "Heissacamp booking",
      "Heissa booking",
      "Aswan booking",
      "camp booking"
    ],
    "description": "Book HeissaCamp now!"
  },
  "gallery": {
    "kwords": [
      "Heissacamp gallery",
      "Heissa gallery",
      "Aswan gallery",
      "camp gallery"
    ],
    "description": "Heissacamp. Enjoy living simple and natural days in Aswan syle."
  },
  "blog": {
    "kwords": [
      "Heissacamp blog",
      "Heissa blog",
      "Aswan blog",
      "camp blog"
    ],
    "description": "Heissacamp. Enjoy living simple and natural days in Aswan syle."
  }
}
