[
    {
        "title": "Best Price Guarantee",
        "description": "Vestibulum ante ipsum primis in faucibus orci luctus et ultrices posuere cubilia Curae. Suspendisse sollicitudin velit sed leo.",
        "icon": "milenia-font-icon-cards"
    },
    {
        "title": "Book Now to Secure Availability",
        "description": "Ut pharetra augue nec augue. Nam elit agna,endrerit sit amet, tincidunt ac, viverra sed, nulla. Donec porta diam eu massa.",
        "icon": "milenia-font-icon-calendar"
    },
    {
        "title": "Free Wi-Fi Available",
        "description": "Donec in velit vel ipsum auctor pulvinar. Vestibulum iaculis lacinia est. Proin dictum elementum velit. Fusce euismod consequat ante.",
        "icon": "milenia-font-icon-wi-fi"
    },
    {
        "title": "Meetings & Special Events",
        "description": "Lorem ipsum dolor sit amet, consectetuer adipisMauris accumsan nulla vel diam. Sed in lacus ut enim adipiscing aliquet. ",
        "icon": "milenia-font-icon-dish2"
    },
    {
        "title": "Free Cancellation Anytime",
        "description": "In pede mi, aliquet sit amet, euismod in,auctor ut, ligula. Aliquam dapibus tincidunt metus. Praesent justo dolor, lobortis quis, lobortis dignissim.",
        "icon": "milenia-font-icon-mobile2"
    }
]