 DBCSR| CPU Multiplication driver                                           XSMM
 DBCSR| Multrec recursion limit                                              512
 DBCSR| Multiplication stack size                                           1000
 DBCSR| Maximum elements for images                                    UNLIMITED
 DBCSR| Multiplicative factor virtual images                                   1
 DBCSR| Use multiplication densification                                       T
 DBCSR| Multiplication size stacks                                             3
 DBCSR| Use memory pool for CPU allocation                                     F
 DBCSR| Number of 3D layers                                               SINGLE
 DBCSR| Use MPI memory allocation                                              F
 DBCSR| Use RMA algorithm                                                      F
 DBCSR| Use Communication thread                                               T
 DBCSR| Communication thread load                                             87
 DBCSR| MPI: My node id                                                        0
 DBCSR| MPI: Number of nodes                                                  36
 DBCSR| OMP: Current number of threads                                         1
 DBCSR| OMP: Max number of threads                                             1
 DBCSR| Split modifier for TAS multiplication algorithm                  1.0E+00


  **** **** ******  **  PROGRAM STARTED AT               2023-01-09 17:37:11.734
 ***** ** ***  *** **   PROGRAM STARTED ON                                 c10-6
 **    ****   ******    PROGRAM STARTED BY                              marineld
 ***** **    ** ** **   PROGRAM PROCESS ID                                 31124
  **** **  *******  **  PROGRAM STARTED IN /cluster/projects/nn4654k/sigbjobo/pr
                                           ojects/ML-Cascella/TrainingSets/THF-m
                                           /1-Iteration/inputs

 CP2K| version string:                                          CP2K version 8.2
 CP2K| source code revision number:                                  git:310b7ab
 CP2K| cp2kflags: omp libint fftw3 libxc parallel mpi3 scalapack xsmm plumed2
 CP2K| is freely available from                            https://www.cp2k.org/
 CP2K| Program compiled at                          Wed Nov  3 14:43:39 CET 2021
 CP2K| Program compiled on                                          login-5.saga
 CP2K| Program compiled for                                    Linux-x86-64-foss
 CP2K| Data directory path            /cluster/software/CP2K/8.2-foss-2021a/data
 CP2K| Input file name                                       cp2k_It1_000001.inp

 GLOBAL| Force Environment number                                              1
 GLOBAL| Basis set file name                                           BASIS_SET
 GLOBAL| Potential file name                                      GTH_POTENTIALS
 GLOBAL| MM Potential file name                                     MM_POTENTIAL
 GLOBAL| Coordinate file name                                      __STD_INPUT__
 GLOBAL| Method name                                                        CP2K
 GLOBAL| Project name                                                 It1_000001
 GLOBAL| Run type                                                   ENERGY_FORCE
 GLOBAL| FFT library                                                       FFTW3
 GLOBAL| Diagonalization library                                       ScaLAPACK
 GLOBAL| Orthonormality check for eigenvectors                          DISABLED
 GLOBAL| Matrix multiplication library                                    SCALAP
 GLOBAL| All-to-all communication in single precision                          F
 GLOBAL| FFTs using library dependent lengths                                  F
 GLOBAL| Grid backend                                                       AUTO
 GLOBAL| Global print level                                                  LOW
 GLOBAL| MPI I/O enabled                                                       T
 GLOBAL| Total number of message passing processes                            36
 GLOBAL| Number of threads for this process                                    1
 GLOBAL| This output is from process                                           0
 GLOBAL| CPU model name                Intel(R) Xeon(R) Gold 6230R CPU @ 2.10GHz
 GLOBAL| CPUID                                                              1003

 MEMORY| system memory details [Kb]
 MEMORY|                        rank 0           min           max       average
 MEMORY| MemTotal            197548888     197548888     197548888     197548888
 MEMORY| MemFree             163768280     163768280     163768280     163768280
 MEMORY| Buffers                  1244          1244          1244          1244
 MEMORY| Cached               14382936      14382936      14382936      14382936
 MEMORY| Slab                  1482720       1482720       1482720       1482720
 MEMORY| SReclaimable           647700        647700        647700        647700
 MEMORY| MemLikelyFree       178800160     178800160     178800160     178800160


 GENERATE|  Preliminary Number of Bonds generated:                             0
 GENERATE|  Achieved consistency in connectivity generation.

 *******************************************************************************
 *******************************************************************************
 **                                                                           **
 **     #####                         ##              ##                      **
 **    ##   ##            ##          ##              ##                      **
 **   ##     ##                       ##            ######                    **
 **   ##     ##  ##   ##  ##   #####  ##  ##   ####   ##    #####    #####    **
 **   ##     ##  ##   ##  ##  ##      ## ##   ##      ##   ##   ##  ##   ##   **
 **   ##  ## ##  ##   ##  ##  ##      ####     ###    ##   ######   ######    **
 **    ##  ###   ##   ##  ##  ##      ## ##      ##   ##   ##       ##        **
 **     #######   #####   ##   #####  ##  ##  ####    ##    #####   ##        **
 **           ##                                                    ##        **
 **                                                                           **
 **                                                ... make the atoms dance   **
 **                                                                           **
 **            Copyright (C) by CP2K developers group (2000-2021)             **
 **                      J. Chem. Phys. 152, 194103 (2020)                    **
 **                                                                           **
 *******************************************************************************


 TOTAL NUMBERS AND MAXIMUM NUMBERS

  Total number of            - Atomic kinds:                                   3
                             - Atoms:                                        325
                             - Shell sets:                                   650
                             - Shells:                                      1225
                             - Primitive Cartesian functions:               1625
                             - Cartesian basis functions:                   2750
                             - Spherical basis functions:                   2625

  Maximum angular momentum of- Orbital basis functions:                        2
                             - Local part of the GTH pseudopotential:          2
                             - Non-local part of the GTH pseudopotential:      0


 SCF PARAMETERS         Density guess:                                    ATOMIC
                        --------------------------------------------------------
                        max_scf:                                               5
                        max_scf_history:                                       0
                        max_diis:                                              4
                        --------------------------------------------------------
                        eps_scf:                                        1.00E-05
                        eps_scf_history:                                0.00E+00
                        eps_diis:                                       1.00E-01
                        eps_eigval:                                     1.00E-05
                        --------------------------------------------------------
                        level_shift [a.u.]:                                 0.00
                        --------------------------------------------------------
                        Outer loop SCF in use
                        No variables optimised in outer loop
                        eps_scf                                         1.00E-05
                        max_scf                                              100
                        No outer loop optimization
                        step_size                                       5.00E-01

 Number of electrons:                                                        750
 Number of occupied orbitals:                                                375
 Number of molecular orbitals:                                               375

 Number of orbital functions:                                               2625
 Number of independent orbital functions:                                   2625

 Extrapolation method: initial_guess


 SCF WAVEFUNCTION OPTIMIZATION

  ----------------------------------- OT ---------------------------------------
  Minimizer      : DIIS                : direct inversion
                                         in the iterative subspace
                                         using   7 DIIS vectors
                                         safer DIIS on
  Preconditioner : FULL_SINGLE_INVERSE : inversion of
                                         H + eS - 2*(Sc)(c^T*H*c+const)(Sc)^T
  Precond_solver : DEFAULT
  stepsize       :    0.08000000                  energy_gap     :    0.08000000
  eps_taylor     :   0.10000E-15                  max_taylor     :             4
  ----------------------------------- OT ---------------------------------------

  Step     Update method      Time    Convergence         Total energy    Change
  ------------------------------------------------------------------------------
     1 OT DIIS     0.80E-01    3.0     0.02373987     -1017.5785571512 -1.02E+03
     2 OT DIIS     0.80E-01    3.5     0.01714227     -1050.3330432595 -3.28E+01
     3 OT DIIS     0.80E-01    3.5     0.01350234     -1066.5256428194 -1.62E+01
     4 OT DIIS     0.80E-01    3.7     0.00858625     -1077.5723172263 -1.10E+01
     5 OT DIIS     0.80E-01    3.6     0.00503069     -1082.3624461369 -4.79E+00

  Leaving inner SCF loop after reaching     5 steps.


  Electronic density on regular grids:       -749.9999999998        0.0000000002
  Core density on regular grids:              749.9999999995       -0.0000000005
  Total charge density on r-space grids:       -0.0000000004
  Total charge density g-space grids:          -0.0000000004

  Overlap energy of the core charge distribution:               0.00004707415957
  Self energy of the core charge distribution:              -2653.75076142537137
  Core Hamiltonian energy:                                    814.27137959227548
  Hartree energy:                                            1089.65062784785368
  Exchange-correlation energy:                               -332.28024212719265
  Dispersion energy:                                           -0.25349709865270

  Total energy:                                             -1082.36244613692793

  outer SCF iter =    1 RMS gradient =   0.50E-02 energy =      -1082.3624461369

  ----------------------------------- OT ---------------------------------------
  Minimizer      : DIIS                : direct inversion
                                         in the iterative subspace
                                         using   7 DIIS vectors
                                         safer DIIS on
  Preconditioner : FULL_SINGLE_INVERSE : inversion of
                                         H + eS - 2*(Sc)(c^T*H*c+const)(Sc)^T
  Precond_solver : DEFAULT
  stepsize       :    0.08000000                  energy_gap     :    0.08000000
  eps_taylor     :   0.10000E-15                  max_taylor     :             4
  ----------------------------------- OT ---------------------------------------

  Step     Update method      Time    Convergence         Total energy    Change
  ------------------------------------------------------------------------------
     1 OT DIIS     0.80E-01    7.1     0.00336603     -1084.3369693901 -1.97E+00
     2 OT DIIS     0.80E-01    3.1     0.00260296     -1085.1026301711 -7.66E-01
     3 OT DIIS     0.80E-01    3.1     0.00261080     -1085.8679040195 -7.65E-01
     4 OT DIIS     0.80E-01    3.5     0.00210713     -1086.0824380062 -2.15E-01
     5 OT DIIS     0.80E-01    3.2     0.00106137     -1086.3087814578 -2.26E-01

  Leaving inner SCF loop after reaching     5 steps.


  Electronic density on regular grids:       -749.9999999999        0.0000000001
  Core density on regular grids:              749.9999999995       -0.0000000005
  Total charge density on r-space grids:       -0.0000000004
  Total charge density g-space grids:          -0.0000000004

  Overlap energy of the core charge distribution:               0.00004707415957
  Self energy of the core charge distribution:              -2653.75076142537137
  Core Hamiltonian energy:                                    810.12794789250506
  Hartree energy:                                            1090.91851086348197
  Exchange-correlation energy:                               -333.35102876392068
  Dispersion energy:                                           -0.25349709865270

  Total energy:                                             -1086.30878145779820

  outer SCF iter =    2 RMS gradient =   0.11E-02 energy =      -1086.3087814578

  ----------------------------------- OT ---------------------------------------
  Minimizer      : DIIS                : direct inversion
                                         in the iterative subspace
                                         using   7 DIIS vectors
                                         safer DIIS on
  Preconditioner : FULL_SINGLE_INVERSE : inversion of
                                         H + eS - 2*(Sc)(c^T*H*c+const)(Sc)^T
  Precond_solver : DEFAULT
  stepsize       :    0.08000000                  energy_gap     :    0.08000000
  eps_taylor     :   0.10000E-15                  max_taylor     :             4
  ----------------------------------- OT ---------------------------------------

  Step     Update method      Time    Convergence         Total energy    Change
  ------------------------------------------------------------------------------
     1 OT DIIS     0.80E-01    6.7     0.00063258     -1086.3765642568 -6.78E-02
     2 OT DIIS     0.80E-01    3.5     0.00043221     -1086.4021308144 -2.56E-02
     3 OT DIIS     0.80E-01    3.2     0.00023827     -1086.4199878819 -1.79E-02
     4 OT DIIS     0.80E-01    3.6     0.00004809     -1086.4259710904 -5.98E-03
     5 OT DIIS     0.80E-01    3.6     0.00002996     -1086.4261300214 -1.59E-04

  Leaving inner SCF loop after reaching     5 steps.


  Electronic density on regular grids:       -749.9999999997        0.0000000003
  Core density on regular grids:              749.9999999995       -0.0000000005
  Total charge density on r-space grids:       -0.0000000002
  Total charge density g-space grids:          -0.0000000002

  Overlap energy of the core charge distribution:               0.00004707415957
  Self energy of the core charge distribution:              -2653.75076142537137
  Core Hamiltonian energy:                                    809.65921841931140
  Hartree energy:                                            1091.25629443480943
  Exchange-correlation energy:                               -333.33743142570006
  Dispersion energy:                                           -0.25349709865270

  Total energy:                                             -1086.42613002144367

  outer SCF iter =    3 RMS gradient =   0.30E-04 energy =      -1086.4261300214

  ----------------------------------- OT ---------------------------------------
  Minimizer      : DIIS                : direct inversion
                                         in the iterative subspace
                                         using   7 DIIS vectors
                                         safer DIIS on
  Preconditioner : FULL_SINGLE_INVERSE : inversion of
                                         H + eS - 2*(Sc)(c^T*H*c+const)(Sc)^T
  Precond_solver : DEFAULT
  stepsize       :    0.08000000                  energy_gap     :    0.08000000
  eps_taylor     :   0.10000E-15                  max_taylor     :             4
  ----------------------------------- OT ---------------------------------------

  Step     Update method      Time    Convergence         Total energy    Change
  ------------------------------------------------------------------------------
     1 OT DIIS     0.80E-01    7.4     0.00001468     -1086.4262198969 -8.99E-05
     2 OT DIIS     0.80E-01    3.1     0.00001033     -1086.4262327521 -1.29E-05
     3 OT DIIS     0.80E-01    3.1     0.00000740     -1086.4262395637 -6.81E-06

  *** SCF run converged in     3 steps ***


  Electronic density on regular grids:       -749.9999999998        0.0000000002
  Core density on regular grids:              749.9999999995       -0.0000000005
  Total charge density on r-space grids:       -0.0000000004
  Total charge density g-space grids:          -0.0000000004

  Overlap energy of the core charge distribution:               0.00004707415957
  Self energy of the core charge distribution:              -2653.75076142537137
  Core Hamiltonian energy:                                    809.66742191440903
  Hartree energy:                                            1091.24990334868085
  Exchange-correlation energy:                               -333.33935337694987
  Dispersion energy:                                           -0.25349709865270

  Total energy:                                             -1086.42623956372449

  outer SCF iter =    4 RMS gradient =   0.74E-05 energy =      -1086.4262395637
  outer SCF loop converged in   4 iterations or   18 steps


 ENERGY| Total FORCE_EVAL ( QS ) energy [a.u.]:            -1086.426246799285764

 ATOMIC FORCES in [a.u.]

 # Atom   Kind   Element          X              Y              Z
      1      1      C          -0.01067990    -0.04921095     0.02651640
      2      1      C           0.00560771     0.02847933     0.00920186
      3      2      O           0.00450080     0.02577294    -0.01339503
      4      1      C          -0.00667748    -0.01908498     0.04281083
      5      1      C          -0.02249166    -0.00049178     0.01471223
      6      3      H          -0.00263164     0.01533919    -0.01485967
      7      3      H           0.00733767    -0.00269849    -0.00562928
      8      3      H           0.00770462    -0.00962640    -0.00070363
      9      3      H          -0.00444036    -0.00048229    -0.00831909
     10      3      H          -0.00987945     0.01474317    -0.02020345
     11      3      H           0.00545419    -0.00541092    -0.01289487
     12      3      H          -0.00090153    -0.00163573    -0.01890230
     13      3      H           0.02790948     0.00515525     0.00261026
     14      1      C           0.00739246     0.00938874    -0.01110143
     15      1      C          -0.01209211    -0.02523352    -0.03862845
     16      2      O          -0.00294423     0.06875275    -0.01269932
     17      1      C           0.03703808    -0.05152772     0.00622314
     18      1      C          -0.02997836    -0.03125615     0.02273484
     19      3      H           0.01098747    -0.01664267    -0.01270345
     20      3      H           0.00753849     0.02909781     0.01397958
     21      3      H          -0.00666485    -0.01366194     0.00024373
     22      3      H          -0.00563263     0.00999379     0.01504734
     23      3      H           0.01682689     0.02819221     0.00466018
     24      3      H          -0.01153899    -0.01694085     0.02809381
     25      3      H          -0.00355678     0.00079184    -0.00242056
     26      3      H          -0.00557686     0.00929030    -0.01226136
     27      1      C           0.00309654    -0.06274769     0.00190069
     28      1      C          -0.02245175    -0.02908800    -0.04604649
     29      2      O           0.07159446     0.02158004     0.00164542
     30      1      C          -0.04988307    -0.01764639     0.01115259
     31      1      C           0.01116516    -0.00339906     0.01656220
     32      3      H          -0.01158731     0.00148258    -0.00310598
     33      3      H           0.00375048     0.04574690     0.01053994
     34      3      H          -0.00410868     0.03625989     0.02201173
     35      3      H          -0.00047770     0.00599475    -0.00635285
     36      3      H          -0.00328579     0.00453973     0.00397374
     37      3      H          -0.01215034    -0.00450290     0.00661496
     38      3      H           0.01263122     0.00517223    -0.00080872
     39      3      H           0.01010804    -0.01172031    -0.01102812
     40      1      C           0.02169005    -0.03021711    -0.01749897
     41      1      C          -0.03964300     0.03848700    -0.01533315
     42      2      O           0.01924300    -0.01310291    -0.01301738
     43      1      C          -0.04186815     0.04641211    -0.02104572
     44      1      C           0.00921501     0.02076037    -0.03741383
     45      3      H           0.01551910    -0.03731817     0.00364915
     46      3      H           0.00180101     0.00106801     0.01304139
     47      3      H           0.02641392    -0.01522995     0.03373740
     48      3      H          -0.00993662    -0.00820879     0.00588220
     49      3      H          -0.00489444    -0.01505862     0.03119250
     50      3      H           0.03180533    -0.00142767     0.01969780
     51      3      H          -0.00841230    -0.00072873     0.02899445
     52      3      H          -0.02096536     0.01518422    -0.03327496
     53      1      C           0.04027044    -0.05752901     0.03075173
     54      1      C           0.00226343     0.05517039     0.04812799
     55      2      O           0.03970639    -0.04050913    -0.00696581
     56      1      C          -0.01308514     0.02184642     0.01304496
     57      1      C          -0.03248415     0.01449276     0.01649775
     58      3      H           0.00537054     0.01999085    -0.01758444
     59      3      H          -0.01487803     0.02326149    -0.03328145
     60      3      H          -0.01643438    -0.00504816    -0.01791285
     61      3      H          -0.01334572    -0.01870722    -0.00717909
     62      3      H          -0.00639873    -0.01139460    -0.00138959
     63      3      H          -0.00595295     0.00589060    -0.02705414
     64      3      H           0.00330744    -0.00834728     0.00857333
     65      3      H           0.01527807    -0.00007842    -0.00372206
     66      1      C          -0.00278354    -0.00016672     0.01344769
     67      1      C          -0.00334532     0.02821407    -0.04234015
     68      2      O          -0.01062381    -0.00252428    -0.01030502
     69      1      C           0.02826746    -0.00916421     0.02025645
     70      1      C          -0.02231799    -0.03067842    -0.04362782
     71      3      H          -0.00369580     0.00653674    -0.01151062
     72      3      H          -0.00631488     0.00995971     0.01588072
     73      3      H          -0.00187699    -0.02569519     0.00112044
     74      3      H           0.01183966     0.00078000     0.01742200
     75      3      H           0.01044560    -0.01141789    -0.00661380
     76      3      H          -0.01139027     0.01271544     0.01720254
     77      3      H           0.00620996     0.02186763     0.02926240
     78      3      H           0.01385581    -0.00174635    -0.01508489
     79      1      C          -0.01427679     0.02575053    -0.02594541
     80      1      C          -0.00600127     0.01410596    -0.00833872
     81      2      O          -0.03262124    -0.04208717    -0.00907548
     82      1      C           0.04560967     0.06570993     0.03725212
     83      1      C           0.01571477    -0.01262937     0.00512402
     84      3      H          -0.01166288    -0.00602489     0.01478028
     85      3      H           0.02154735    -0.03273507     0.00181254
     86      3      H           0.00123152     0.00589755    -0.00737581
     87      3      H          -0.01284165     0.01605028     0.00462177
     88      3      H           0.01466123     0.01249398     0.00346451
     89      3      H          -0.00892075    -0.02933335    -0.00055029
     90      3      H          -0.00355905     0.00344830     0.00115446
     91      3      H           0.00396613    -0.01155379    -0.01236129
     92      1      C           0.03404476    -0.00904986    -0.05155789
     93      1      C           0.00871577     0.03323765     0.06664699
     94      2      O          -0.02491445    -0.02270689    -0.00809384
     95      1      C           0.01975822    -0.01768418     0.00501679
     96      1      C           0.00650329    -0.00888494     0.01521530
     97      3      H          -0.01804353     0.01526101     0.00372235
     98      3      H          -0.00309002    -0.00851510     0.00065107
     99      3      H           0.01896426    -0.00299990    -0.00786125
    100      3      H          -0.01053064     0.00856012    -0.04822628
    101      3      H          -0.00126587    -0.00455271     0.00965186
    102      3      H           0.00047972     0.00481750     0.00424556
    103      3      H          -0.03773492     0.00901027     0.00737119
    104      3      H           0.00742766     0.00277373     0.00307353
    105      1      C          -0.08006237    -0.01315524    -0.00127429
    106      1      C           0.02657309     0.06717172     0.05595207
    107      2      O          -0.01259271    -0.01532677    -0.00372023
    108      1      C          -0.02932042    -0.01937125    -0.01404423
    109      1      C           0.03228876     0.00005345     0.02784061
    110      3      H           0.04246491     0.00896289    -0.00696982
    111      3      H           0.01499041    -0.00987940     0.00420193
    112      3      H          -0.01029795    -0.02219409    -0.00170940
    113      3      H           0.00531200    -0.01769294    -0.03256958
    114      3      H           0.01224772     0.00872500    -0.00932792
    115      3      H           0.01044266     0.01015850     0.00670555
    116      3      H          -0.00920691     0.00047741    -0.02100457
    117      3      H          -0.00580195     0.00618981    -0.00255798
    118      1      C           0.02670284    -0.02488209     0.05646214
    119      1      C          -0.03769568     0.00122840    -0.07060995
    120      2      O           0.00802506     0.02780442     0.01159552
    121      1      C          -0.00967921    -0.02376138    -0.00727975
    122      1      C           0.03770746    -0.02620700     0.03394077
    123      3      H          -0.00214594     0.03492701     0.02025079
    124      3      H          -0.01258058    -0.00517247     0.01352779
    125      3      H           0.01477738     0.00807070     0.00436553
    126      3      H          -0.00165132     0.01675173    -0.01018002
    127      3      H           0.00978645    -0.00108311    -0.01847121
    128      3      H          -0.01239112    -0.01290387     0.00570549
    129      3      H           0.00542656     0.00506465    -0.03678544
    130      3      H          -0.02715184    -0.00152444    -0.00362923
    131      1      C           0.00975239     0.03261429     0.02016989
    132      1      C          -0.07559103    -0.04855172    -0.05479461
    133      2      O           0.04108273     0.04227850     0.04162717
    134      1      C          -0.00473238     0.03354769     0.02588111
    135      1      C          -0.02176885    -0.03620392     0.01963120
    136      3      H           0.02986415     0.00033905    -0.01202054
    137      3      H          -0.03110708    -0.03322423    -0.00322525
    138      3      H           0.02414978     0.00277224    -0.00779199
    139      3      H          -0.01747899     0.00342636    -0.00636098
    140      3      H           0.00355738    -0.01985155    -0.01383697
    141      3      H           0.01125190     0.01165971    -0.00234564
    142      3      H           0.01462816     0.01665821    -0.01802599
    143      3      H           0.01148813     0.00054417    -0.00121084
    144      1      C           0.03233603     0.03761076     0.01671885
    145      1      C          -0.02468182    -0.04534571     0.00134794
    146      2      O           0.01816382     0.00213124    -0.01425032
    147      1      C          -0.01182510     0.05767726     0.00504702
    148      1      C          -0.00336732     0.02821850     0.01848771
    149      3      H          -0.01240998     0.00682007    -0.01955849
    150      3      H           0.01348862    -0.02982822    -0.00372642
    151      3      H           0.00803076     0.02173198    -0.01852776
    152      3      H          -0.00345479     0.00181338    -0.00289244
    153      3      H          -0.01602022    -0.03180753     0.00005220
    154      3      H           0.02044008    -0.03128386     0.00464155
    155      3      H          -0.00883786    -0.01614892     0.00624489
    156      3      H          -0.00822094    -0.00940537    -0.00350853
    157      1      C           0.02424679    -0.05669167     0.02400192
    158      1      C           0.04344273     0.00921341    -0.01303285
    159      2      O          -0.01366055     0.01862091     0.01482567
    160      1      C           0.00521871    -0.04969897    -0.01496687
    161      1      C          -0.04880469     0.09035288    -0.02325015
    162      3      H          -0.01408065     0.01263941    -0.01202922
    163      3      H          -0.00516783     0.00825103     0.00042590
    164      3      H          -0.01050418     0.00466339    -0.00838566
    165      3      H          -0.01296363     0.00202890     0.01138989
    166      3      H          -0.00922100    -0.00474484     0.01505886
    167      3      H           0.01134333     0.00703247     0.00359184
    168      3      H           0.01208515    -0.03410536     0.01187431
    169      3      H           0.01998586    -0.00649761    -0.01010547
    170      1      C           0.00454336    -0.01345916     0.02819878
    171      1      C           0.04952638     0.07206554     0.00050124
    172      2      O           0.00471010    -0.01291392    -0.00205598
    173      1      C          -0.03427133    -0.02457802     0.00146954
    174      1      C          -0.00906907    -0.01668433     0.01303653
    175      3      H          -0.02057956    -0.00371387     0.01915558
    176      3      H           0.00112737     0.00356016    -0.02559431
    177      3      H          -0.00594796    -0.01918194    -0.01127612
    178      3      H          -0.01726693     0.00009674    -0.01007948
    179      3      H           0.01055876     0.00672437    -0.01796173
    180      3      H           0.02117413    -0.01290084     0.01501960
    181      3      H          -0.00289455     0.01759633    -0.01077671
    182      3      H          -0.00123440     0.00303526     0.00172935
    183      1      C           0.03508399     0.00922318     0.02091147
    184      1      C          -0.02107566    -0.00160630    -0.01959738
    185      2      O           0.02145108    -0.01219739     0.00639868
    186      1      C          -0.05789951    -0.00772959    -0.02685838
    187      1      C           0.00088794     0.00102834    -0.00503486
    188      3      H          -0.01986206    -0.00538069     0.00262131
    189      3      H          -0.01002687     0.00841219    -0.01368632
    190      3      H           0.02675757    -0.00700622     0.01094070
    191      3      H          -0.00569850     0.00319117    -0.01703887
    192      3      H           0.01124994     0.02101915     0.03787444
    193      3      H           0.00328992    -0.01901835     0.00342905
    194      3      H           0.00749257     0.00464853    -0.00440175
    195      3      H           0.00722749     0.00700837     0.00224986
    196      1      C          -0.01130036     0.05327965    -0.04269501
    197      1      C           0.02574833    -0.03425626     0.00660370
    198      2      O          -0.03110405     0.01708101     0.04162938
    199      1      C           0.01886056    -0.00592200     0.00675817
    200      1      C           0.03479842     0.02708948     0.00055602
    201      3      H          -0.00572228    -0.00101704     0.01113214
    202      3      H          -0.00495035    -0.01257232     0.00085786
    203      3      H           0.01770833    -0.03193282    -0.01054521
    204      3      H          -0.00128237     0.00347410     0.00181939
    205      3      H          -0.00263826     0.02270391    -0.00224261
    206      3      H          -0.02543006    -0.00961295     0.00134403
    207      3      H          -0.00844846    -0.02469963    -0.01386443
    208      3      H          -0.00551337    -0.00303938     0.00002184
    209      1      C          -0.02632955    -0.02795389    -0.04266518
    210      1      C           0.00036986     0.04220459    -0.05044693
    211      2      O          -0.00148593    -0.01665853     0.04214343
    212      1      C           0.02788809     0.04445112     0.01524714
    213      1      C          -0.07176785    -0.01943497     0.03615079
    214      3      H           0.00567075     0.00308163     0.00938879
    215      3      H           0.02627925    -0.00322694     0.02514803
    216      3      H          -0.01398295     0.00508173    -0.01822568
    217      3      H           0.02115166    -0.01010437     0.03708463
    218      3      H           0.01278925     0.00187740     0.01137568
    219      3      H          -0.02676740    -0.01219146    -0.05408138
    220      3      H           0.00605359    -0.00442771    -0.02335002
    221      3      H           0.00902049     0.00127141     0.02179085
    222      1      C           0.03560251     0.02209861    -0.01465880
    223      1      C           0.00557039    -0.06203857     0.14295357
    224      2      O           0.01020268    -0.03950200    -0.02563452
    225      1      C           0.03490834     0.00491600    -0.02786680
    226      1      C          -0.02072938     0.12765315    -0.06325861
    227      3      H           0.01716293    -0.00764118     0.00607536
    228      3      H          -0.02793192     0.01886539    -0.00085933
    229      3      H          -0.01045255     0.04693565    -0.01862867
    230      3      H          -0.01432563     0.01330684    -0.07526555
    231      3      H          -0.03000995    -0.01263389     0.01091337
    232      3      H           0.02397564    -0.01546958     0.01291426
    233      3      H           0.01137941    -0.07119654     0.05755775
    234      3      H          -0.01947179    -0.02408957    -0.01099473
    235      1      C          -0.04356630    -0.00554616    -0.01924607
    236      1      C           0.02571516    -0.03414701    -0.01645304
    237      2      O           0.00000932    -0.00088475     0.01189146
    238      1      C           0.00664448     0.06334398     0.01185285
    239      1      C           0.00583445    -0.03234346    -0.04079226
    240      3      H           0.00841234     0.00506259    -0.00511447
    241      3      H           0.00069675     0.00776290     0.00897349
    242      3      H          -0.00594893    -0.00545641     0.00874996
    243      3      H          -0.00218769     0.02101831     0.01136282
    244      3      H          -0.00463618    -0.00983087     0.00539326
    245      3      H           0.00311439    -0.01584823    -0.00866575
    246      3      H          -0.01200497     0.00616985     0.02298244
    247      3      H           0.00848111    -0.01252990     0.01260615
    248      1      C          -0.05054159     0.03549120     0.01005172
    249      1      C          -0.01316611    -0.01854528    -0.00996366
    250      2      O          -0.03124495     0.04053142    -0.03767655
    251      1      C           0.07565784    -0.00569838    -0.01301090
    252      1      C           0.00784415     0.00404176     0.01397118
    253      3      H           0.00522266    -0.01797493    -0.00164328
    254      3      H           0.01609383     0.00097466    -0.00439862
    255      3      H           0.01117103    -0.00552125    -0.01916983
    256      3      H           0.01941962    -0.00196393     0.02857793
    257      3      H          -0.03651239     0.00516772     0.02205881
    258      3      H           0.00211849    -0.01565870     0.01902556
    259      3      H           0.00024490    -0.00715450     0.01049069
    260      3      H          -0.00651018    -0.00701343    -0.01957147
    261      1      C           0.02491785     0.00009252     0.02515277
    262      1      C           0.01703355    -0.01159411     0.03573377
    263      2      O           0.00921175    -0.04038371    -0.01867384
    264      1      C           0.02306466     0.07244529    -0.03403337
    265      1      C          -0.02822429    -0.04480611     0.08256774
    266      3      H          -0.00953098     0.00333395    -0.01294168
    267      3      H          -0.00134670     0.00228642     0.00217916
    268      3      H          -0.00264989     0.00662067     0.00145969
    269      3      H          -0.03374443     0.01619478    -0.04576712
    270      3      H           0.00966248    -0.01265042    -0.00040261
    271      3      H          -0.00413405    -0.02408126     0.02572517
    272      3      H          -0.01171312     0.02131527    -0.04665793
    273      3      H           0.00204777     0.01831100    -0.00370495
    274      1      C           0.06121727     0.00925890    -0.00964441
    275      1      C           0.00840854    -0.07511406    -0.00732336
    276      2      O           0.01931120     0.04774874     0.01369102
    277      1      C          -0.00055576    -0.05461182     0.05671137
    278      1      C          -0.04012905    -0.04674200     0.01326140
    279      3      H          -0.00403144    -0.04287377    -0.00517468
    280      3      H          -0.03059866     0.02915095     0.01698887
    281      3      H          -0.00649829     0.01082783     0.01935499
    282      3      H          -0.02428036     0.03575599    -0.01296910
    283      3      H          -0.00731487     0.02485968    -0.02955713
    284      3      H          -0.00720669     0.01619391    -0.01893398
    285      3      H           0.03256973     0.03387339    -0.00396252
    286      3      H           0.00336605     0.00520429    -0.02036869
    287      1      C           0.00714853     0.01732578     0.00761928
    288      1      C          -0.00827028    -0.03730590    -0.05399532
    289      2      O           0.00244267     0.03051337     0.02715665
    290      1      C          -0.01763924    -0.00142215     0.00176608
    291      1      C          -0.01183787    -0.04296454    -0.04595936
    292      3      H          -0.01194751     0.01646473     0.00734589
    293      3      H          -0.01568107    -0.01364773     0.00492611
    294      3      H           0.03013172    -0.01929785    -0.00414528
    295      3      H           0.01606945     0.00990323     0.03009612
    296      3      H          -0.00651342    -0.01469950     0.00782426
    297      3      H           0.00932222     0.00225702     0.03034062
    298      3      H          -0.00765887     0.04353346    -0.00735101
    299      3      H           0.01475496     0.00888354    -0.00696401
    300      1      C          -0.00335941     0.05345541    -0.03460311
    301      1      C          -0.00099386    -0.03397004     0.01939153
    302      2      O          -0.02008110    -0.00874984    -0.02558702
    303      1      C          -0.03457014     0.02119285    -0.00703879
    304      1      C          -0.00386601     0.01589676    -0.00046440
    305      3      H           0.00538296     0.00140081    -0.01902675
    306      3      H           0.01906630    -0.03339125     0.02189195
    307      3      H          -0.00166006    -0.01034087    -0.00811352
    308      3      H          -0.00983227     0.00282065     0.00004803
    309      3      H           0.00947043     0.00941138     0.00085513
    310      3      H           0.02501442    -0.00952082     0.02363173
    311      3      H           0.00199316    -0.01528559     0.01317408
    312      3      H           0.00583966     0.00597089     0.01444878
    313      1      C           0.02288207     0.01658679    -0.02127672
    314      1      C          -0.00604368     0.02839577    -0.01767493
    315      2      O          -0.03671473    -0.03875949     0.04128366
    316      1      C          -0.02983490     0.01224902    -0.03437118
    317      1      C           0.03026393    -0.00789900     0.04757149
    318      3      H           0.00897721    -0.01232362    -0.00340314
    319      3      H           0.00084846     0.00653717     0.00512518
    320      3      H          -0.00151049    -0.00523794    -0.01918208
    321      3      H           0.00480647    -0.00280307    -0.00389411
    322      3      H          -0.00158557    -0.00607966     0.00258783
    323      3      H           0.01628874     0.02733563     0.00341780
    324      3      H          -0.00659415    -0.02424878    -0.01881666
    325      3      H          -0.00316098     0.00745587     0.01487184
 SUM OF ATOMIC FORCES          -0.00183531     0.00184607    -0.00134133     0.00292840

 -------------------------------------------------------------------------------
 -                                                                             -
 -                                DBCSR STATISTICS                             -
 -                                                                             -
 -------------------------------------------------------------------------------
 COUNTER                                    TOTAL       BLAS       SMM       ACC
 flops    23 x    23 x   435              1840920       0.0%    100.0%      0.0%
 flops     5 x    23 x    23              8464000       0.0%    100.0%      0.0%
 flops    23 x    23 x   438              9268080       0.0%    100.0%      0.0%
 flops    32 x    23 x   435             12806400       0.0%    100.0%      0.0%
 flops    13 x    23 x    23             13754000       0.0%    100.0%      0.0%
 flops    23 x    32 x   435             15367680       0.0%    100.0%      0.0%
 flops    55 x    55 x    55             39264500       0.0%    100.0%      0.0%
 flops    32 x    23 x   438             64473600       0.0%    100.0%      0.0%
 flops     5 x    32 x    23             64768000       0.0%    100.0%      0.0%
 flops     5 x    23 x    32             64768000       0.0%    100.0%      0.0%
 flops    23 x    32 x   438             77368320       0.0%    100.0%      0.0%
 flops    13 x    32 x    23            105248000       0.0%    100.0%      0.0%
 flops    13 x    23 x    32            105248000       0.0%    100.0%      0.0%
 flops    55 x    55 x   435            178959000       0.0%    100.0%      0.0%
 flops   435 x    55 x    55            215803500       0.0%    100.0%      0.0%
 flops    55 x    55 x    64            228448000       0.0%    100.0%      0.0%
 flops    55 x    64 x    55            228448000       0.0%    100.0%      0.0%
 flops    64 x    55 x    55            228448000       0.0%    100.0%      0.0%
 flops    32 x    32 x   435            235192320       0.0%    100.0%      0.0%
 flops   435 x    55 x   435            457924500       0.0%    100.0%      0.0%
 flops     5 x     5 x    55            789360000       0.0%    100.0%      0.0%
 flops    55 x    55 x   438            900966000       0.0%    100.0%      0.0%
 flops    55 x    64 x   435           1041216000       0.0%    100.0%      0.0%
 flops    64 x    55 x   435           1041216000       0.0%    100.0%      0.0%
 flops     5 x    32 x    32           1081344000       0.0%    100.0%      0.0%
 flops   438 x    55 x    55           1086459000       0.0%    100.0%      0.0%
 flops    32 x    32 x   438           1184071680       0.0%    100.0%      0.0%
 flops   435 x    55 x    64           1255584000       0.0%    100.0%      0.0%
 flops   435 x    64 x    55           1255584000       0.0%    100.0%      0.0%
 flops     5 x    23 x     5           1294348000       0.0%    100.0%      0.0%
 flops    64 x    64 x    55           1329152000       0.0%    100.0%      0.0%
 flops    55 x    64 x    64           1329152000       0.0%    100.0%      0.0%
 flops    64 x    55 x    64           1329152000       0.0%    100.0%      0.0%
 flops    13 x     5 x    55           1549834000       0.0%    100.0%      0.0%
 flops     5 x    13 x    55           1551121000       0.0%    100.0%      0.0%
 flops    13 x    32 x    32           1757184000       0.0%    100.0%      0.0%
 flops   435 x    55 x   438           2305413000       0.0%    100.0%      0.0%
 flops   438 x    55 x   435           2305413000       0.0%    100.0%      0.0%
 flops   435 x    64 x   435           2664288000       0.0%    100.0%      0.0%
 flops    13 x    23 x     5           2743848250       0.0%    100.0%      0.0%
 flops     5 x    23 x    13           2743848250       0.0%    100.0%      0.0%
 flops    13 x    13 x    55           2917886400       0.0%    100.0%      0.0%
 flops     5 x     5 x    64           4592640000       0.0%    100.0%      0.0%
 flops    55 x    64 x   438           5241984000       0.0%    100.0%      0.0%
 flops    64 x    55 x   438           5241984000       0.0%    100.0%      0.0%
 flops    13 x    23 x    13           5310846970       0.0%    100.0%      0.0%
 flops    64 x    64 x   435           6057984000       0.0%    100.0%      0.0%
 flops   438 x    64 x    55           6321216000       0.0%    100.0%      0.0%
 flops   438 x    55 x    64           6321216000       0.0%    100.0%      0.0%
 flops   435 x    64 x    64           7305216000       0.0%    100.0%      0.0%
 flops    64 x    64 x    64           7733248000       0.0%    100.0%      0.0%
 flops    13 x     5 x    64           9017216000       0.0%    100.0%      0.0%
 flops     5 x    13 x    64           9024704000       0.0%    100.0%      0.0%
 flops   438 x    55 x   438          11606562000       0.0%    100.0%      0.0%
 flops   438 x    64 x   435          13413312000       0.0%    100.0%      0.0%
 flops   435 x    64 x   438          13413312000       0.0%    100.0%      0.0%
 flops    13 x    13 x    64          16976793600       0.0%    100.0%      0.0%
 flops     5 x    32 x     5          19809152000       0.0%    100.0%      0.0%
 flops    64 x    64 x   438          30498816000       0.0%    100.0%      0.0%
 flops   438 x    64 x    64          36777984000       0.0%    100.0%      0.0%
 flops    13 x    32 x     5          41992808000       0.0%    100.0%      0.0%
 flops     5 x    32 x    13          41992808000       0.0%    100.0%      0.0%
 flops   438 x    64 x   438          67529088000       0.0%    100.0%      0.0%
 flops    13 x    32 x    13          81279049280       0.0%    100.0%      0.0%
 flops inhomo. stacks                           0       0.0%      0.0%      0.0%
 flops total                       485.270243E+09       0.0%    100.0%      0.0%
 flops max/rank                     14.175932E+09       0.0%    100.0%      0.0%
 matmuls inhomo. stacks                         0       0.0%      0.0%      0.0%
 matmuls total                           49261812       0.0%    100.0%      0.0%
 number of processed stacks                171686       0.0%    100.0%      0.0%
 average stack size                                     0.0     286.9       0.0
 marketing flops                   656.964059E+09
 -------------------------------------------------------------------------------
 # multiplications                            385
 max memory usage/rank             904.265728E+06
 # max total images/rank                        1
 # max 3D layers                                1
 # MPI messages exchanged                  138600
 MPI messages size (bytes):
  total size                        32.527995E+09
  min size                           0.000000E+00
  max size                           1.534752E+06
  average size                     234.689719E+03
 MPI breakdown and total messages size (bytes):
             size <=      128                2040                        0
       128 < size <=     8192                   0                        0
      8192 < size <=    32768               58080               1813136880
     32768 < size <=   131072                   0                        0
    131072 < size <=  4194304               78480              30714932800
   4194304 < size <= 16777216                   0                        0
  16777216 < size                               0                        0
 -------------------------------------------------------------------------------
 -                                                                             -
 -                      DBCSR MESSAGE PASSING PERFORMANCE                      -
 -                                                                             -
 -------------------------------------------------------------------------------
 ROUTINE             CALLS      AVE VOLUME [Bytes]
 MP_Bcast               65                     12.
 MP_Allreduce         2116                     15.
 MP_Alltoall          1617                  58691.
 MP_ISend             9224                 102355.
 MP_IRecv             9224                 101225.
 -------------------------------------------------------------------------------

 -------------------------------------------------------------------------------
 -                                                                             -
 -                                GRID STATISTICS                              -
 -                                                                             -
 -------------------------------------------------------------------------------
 LP    KERNEL             BACKEND                              COUNT     PERCENT
 1     collocate ortho    REF                                1502140      21.17%
 1     integrate ortho    REF                                1461091      20.59%
 2     integrate ortho    REF                                1066216      15.03%
 2     collocate ortho    REF                                1041998      14.69%
 0     collocate ortho    REF                                 722209      10.18%
 0     integrate ortho    REF                                 684198       9.64%
 3     integrate ortho    REF                                 292352       4.12%
 3     collocate ortho    REF                                 250705       3.53%
 4     integrate ortho    REF                                  31177       0.44%
 4     collocate ortho    REF                                  18981       0.27%
 0     collocate general  REF                                  11700       0.16%
 1     integrate general  REF                                  11700       0.16%
 5     integrate ortho    REF                                    999       0.01%
 -------------------------------------------------------------------------------

 MEMORY| Estimated peak process memory [MiB]                                 863

 -------------------------------------------------------------------------------
 -                                                                             -
 -                         MESSAGE PASSING PERFORMANCE                         -
 -                                                                             -
 -------------------------------------------------------------------------------

 ROUTINE             CALLS      AVE VOLUME [Bytes]
 MP_Group                4
 MP_Bcast             2025                 435752.
 MP_Allreduce         5701                   1597.
 MP_Sync                24
 MP_Alltoall           377               34143968.
 MP_SendRecv           140                   2251.
 MP_ISendRecv         2660                 168768.
 MP_Wait              4376
 MP_comm_split          10
 MP_ISend             1404                1039819.
 MP_IRecv             1404                1039819.
 MP_Recv                11                 672000.
 -------------------------------------------------------------------------------


 -------------------------------------------------------------------------------
 -                                                                             -
 -                           R E F E R E N C E S                               -
 -                                                                             -
 -------------------------------------------------------------------------------

 CP2K version 8.2, the CP2K developers group (2021).
 CP2K is freely available from https://www.cp2k.org/ .

 Kuehne,Thomas D.; Iannuzzi,Marcella; Del Ben,Mauro;
 Rybkin,Vladimir V.; Seewald,Patrick; Stein,Frederick; Laino,Teodoro;
 Khaliullin,Rustam Z.; Schuett,Ole; Schiffmann,Florian; Golze,Dorothea;
 Wilhelm,Jan; Chulkov,Sergey; Bani-Hashemian,Mohammad Hossein;
 Weber,Valery; Borstnik,Urban; Taillefumier,Mathieu;
 Jakobovits,Alice Shoshana; Lazzaro,Alfio; Pabst,Hans; Mueller,Tiziano;
 Schade,Robert; Guidon,Manuel; Andermatt,Samuel; Holmberg,Nico;
 Schenter,Gregory K.; Hehn,Anna; Bussy,Augustin; Belleflamme,Fabian;
 Tabacchi,Gloria; Gloess,Andreas; Lass,Michael; Bethune,Iain;
 Mundy,Christopher J.; Plessl,Christian; Watkins,Matt;
 VandeVondele,Joost; Krack,Matthias; Hutter,Juerg.
 The Journal of Chemical Physics, 152 (19), (2020).
 CP2K: An electronic structure and molecular dynamics software package -
 Quickstep: Efficient and accurate electronic structure calculations.
 https://doi.org/10.1063/5.0007045

 Goerigk, Lars; Hansen, Andreas; Bauer, Christoph; Ehrlich, Stephan;
 Najibi, Asim; Grimme, Stefan. , 19 (48), (2017).
 A look at the density functional theory zoo with the advanced GMTKN55 database
 for general main group thermochemistry, kinetics and noncovalent interactions.
 https://doi.org/10.1039/C7CP04913G

 Schuett, Ole; Messmer, Peter; Hutter, Juerg; VandeVondele, Joost.
 Electronic Structure Calculations on Graphics Processing Units, John
 Wiley & Sons, Ltd, 173-190 (2016).
 GPU-Accelerated Sparse Matrix-Matrix Multiplication for
 Linear Scaling Density Functional Theory.
 https://doi.org/10.1002/9781118670712.ch8

 Heinecke, A; Henry, G; Hutchinson, M; Pabst, H.
 Proceedings of Intl. Supercomputing Conference, 981-991 (2016).
 LIBXSMM: Accelerating Small Matrix Multiplications
 by Runtime Code Generation.
 https://doi.org/10.1109/SC.2016.83

 Borstnik, U; VandeVondele, J; Weber, V; Hutter, J.
 PARALLEL COMPUTING, 40 (5-6), 47-58 (2014).
 Sparse matrix multiplication: The distributed block-compressed sparse
 row library.
 https://doi.org/10.1016/j.parco.2014.03.012

 Hutter, J; Iannuzzi, M; Schiffmann, F; VandeVondele, J.
 WIREs Comput Mol Sci., 4 (1), 15-25 (2014).
 CP2K: atomistic simulations of condensed matter systems.
 https://doi.org/10.1002/wcms.1159

 Grimme, S; Ehrlich, S; Goerigk, L.
 JOURNAL OF COMPUTATIONAL CHEMISTRY, 32, 1456 (2011).
 Effect of the damping function in dispersion corrected density functional theory.
 https://doi.org/10.1002/jcc.21759

 Grimme, S; Antony, J; Ehrlich, S; Krieg, H.
 JOURNAL OF CHEMICAL PHYSICS, 132 (15), 154104 (2010).
 A consistent and accurate ab initio parametrization of density
 functional dispersion correction (DFT-D) for the 94 elements H-Pu.
 https://doi.org/10.1063/1.3382344

 VandeVondele, J; Hutter, J.
 JOURNAL OF CHEMICAL PHYSICS, 127 (11), 114105 (2007).
 Gaussian basis sets for accurate calculations on molecular systems in
 gas and condensed phases.
 https://doi.org/10.1063/1.2770708

 Krack, M.
 THEORETICAL CHEMISTRY ACCOUNTS, 114 (1-3), 145-152 (2005).
 Pseudopotentials for H to Kr optimized for gradient-corrected
 exchange-correlation functionals.
 https://doi.org/10.1007/s00214-005-0655-y

 VandeVondele, J; Krack, M; Mohamed, F; Parrinello, M; Chassaing, T;
 Hutter, J. COMPUTER PHYSICS COMMUNICATIONS, 167 (2), 103-128 (2005).
 QUICKSTEP: Fast and accurate density functional calculations using a
 mixed Gaussian and plane waves approach.
 https://doi.org/10.1016/j.cpc.2004.12.014

 Frigo, M; Johnson, SG.
 PROCEEDINGS OF THE IEEE, 93 (2), 216-231 (2005).
 The design and implementation of FFTW3.
 https://doi.org/10.1109/JPROC.2004.840301

 VandeVondele, J; Hutter, J.
 JOURNAL OF CHEMICAL PHYSICS, 118 (10), 4365-4369 (2003).
 An efficient orbital transformation method for electronic structure
 calculations.
 https://doi.org/10.1063/1.1543154

 Hartwigsen, C; Goedecker, S; Hutter, J.
 PHYSICAL REVIEW B, 58 (7), 3641-3662 (1998).
 Relativistic separable dual-space Gaussian pseudopotentials from H to Rn.
 https://doi.org/10.1103/PhysRevB.58.3641

 Lippert, G; Hutter, J; Parrinello, M.
 MOLECULAR PHYSICS, 92 (3), 477-487 (1997).
 A hybrid Gaussian and plane wave density functional scheme.
 https://doi.org/10.1080/002689797170220

 Perdew, JP; Burke, K; Ernzerhof, M.
 PHYSICAL REVIEW LETTERS, 77 (18), 3865-3868 (1996).
 Generalized gradient approximation made simple.
 https://doi.org/10.1103/PhysRevLett.77.3865

 Goedecker, S; Teter, M; Hutter, J.
 PHYSICAL REVIEW B, 54 (3), 1703-1710 (1996).
 Separable dual-space Gaussian pseudopotentials.
 https://doi.org/10.1103/PhysRevB.54.1703


 -------------------------------------------------------------------------------
 -                                                                             -
 -                                T I M I N G                                  -
 -                                                                             -
 -------------------------------------------------------------------------------
 SUBROUTINE                       CALLS  ASD         SELF TIME        TOTAL TIME
                                MAXIMUM       AVERAGE  MAXIMUM  AVERAGE  MAXIMUM
 CP2K                                 1  1.0    0.025    0.031   66.851   66.853
 qs_forces                            1  2.0    0.001    0.001   66.256   66.256
 qs_energies                          1  3.0    0.002    0.002   63.475   63.475
 scf_env_do_scf                       1  4.0    0.000    0.001   62.102   62.103
 scf_env_do_scf_inner_loop           18  5.0    0.001    0.002   50.635   50.649
 rebuild_ks_matrix                   19  6.8    0.000    0.000   49.078   49.086
 qs_ks_build_kohn_sham_matrix        19  7.8    0.003    0.003   49.077   49.086
 qs_ks_update_qs_env                 22  6.0    0.000    0.000   46.382   46.391
 pw_transfer                        362 10.5    0.022    0.030   35.173   37.529
 fft_wrap_pw1pw2                    324 11.6    0.004    0.006   34.806   37.349
 qs_vxc_create                       19  8.8    0.000    0.001   34.743   35.289
 xc_vxc_pw_create                    19  9.8    0.438    0.553   34.742   35.289
 fft_wrap_pw1pw2_400                210 12.7    2.440    3.093   33.150   35.087
 fft3d_ps                           324 13.6   11.320   14.274   27.514   32.810
 mp_alltoall_z22v                   324 15.6   11.573   22.270   11.573   22.270
 xc_rho_set_and_dset_create          19 10.8    0.131    0.168   18.148   19.978
 yz_to_x                            153 14.0    1.852    2.316    8.991   13.961
 qs_rho_update_rho                   19  6.0    0.000    0.000   13.400   13.400
 calculate_rho_elec                  19  7.0    0.098    0.106   13.399   13.400
 init_scf_loop                        4  5.0    0.000    0.000   11.451   11.452
 x_to_yz                            171 15.1    2.753    3.367    7.188   10.844
 sum_up_and_integrate                19  8.8    0.083    0.104    9.864    9.896
 integrate_v_rspace                  19  9.8    0.001    0.001    9.781    9.862
 density_rs2pw                       19  8.0    0.001    0.002    9.458    9.814
 xc_functional_eval                  19 11.8    0.000    0.000    7.689    8.240
 pbe_lda_eval                        19 12.8    7.689    8.240    7.689    8.240
 rs_pw_transfer                     154 10.4    0.003    0.003    6.702    7.443
 potential_pw2rs                     19 10.8    0.009    0.011    6.406    6.488
 mp_waitany                        1404 12.3    2.518    4.983    2.518    4.983
 grid_collocate_task_list            19  8.0    3.524    4.146    3.524    4.146
 rs_pw_transfer_RS2PW_400            20  9.9    1.076    1.396    2.683    3.434
 grid_integrate_task_list            19 10.8    2.946    3.183    2.946    3.183
 pw_scatter_p                       171 14.1    2.462    2.963    2.462    2.963
 mp_sum_d                          1514  8.7    1.014    2.743    1.014    2.743
 qs_ks_update_qs_env_forces           1  3.0    0.000    0.000    2.706    2.707
 pw_gather_p                        153 13.0    2.305    2.644    2.305    2.644
 pw_derive                          114 11.3    1.774    2.222    1.774    2.222
 rs_pw_transfer_PW2RS_400            20 12.6    1.178    1.493    1.892    2.114
 mp_waitall_1                     27612 14.7    1.054    2.020    1.054    2.020
 dbcsr_multiply_generic             385 10.8    0.017    0.019    1.890    1.909
 fft_wrap_pw1pw2_140                 38 12.4    0.067    0.087    1.287    1.863
 qs_scf_new_mos                      18  6.0    0.000    0.000    1.718    1.729
 qs_scf_loop_do_ot                   18  7.0    0.000    0.000    1.718    1.729
 ot_scf_mini                         18  8.0    0.000    0.000    1.603    1.615
 pw_copy                            209 11.4    1.160    1.422    1.160    1.422
 -------------------------------------------------------------------------------

 The number of warnings for this run is : 0

 -------------------------------------------------------------------------------
  **** **** ******  **  PROGRAM ENDED AT                 2023-01-09 17:38:20.335
 ***** ** ***  *** **   PROGRAM RAN ON                                     c10-6
 **    ****   ******    PROGRAM RAN BY                                  marineld
 ***** **    ** ** **   PROGRAM PROCESS ID                                 31124
  **** **  *******  **  PROGRAM STOPPED IN /cluster/projects/nn4654k/sigbjobo/pr
                                           ojects/ML-Cascella/TrainingSets/THF-m
                                           /1-Iteration/inputs
