scf{
    uhf-spin-projection = -4
    spin-symmetry-constraint = Unrestricted Hartree-Fock
    property-request = geometrical-gradient
    disable-spin-zeeman-in-fock-matrix = yes
    diis{
        convergence-tolerance = 1e-06
    }
}
system{
    hamiltonian{
        magnetic-field = (0, 0, 1)
        gauge-origin = (0, 0, 0)
    }
    molecular-charge = 0
    correlation-model = Hartree-Fock
    use-london-orbitals = yes
    gto-contraction-type = normalized primitive
    basis = aug-cc-pVTZ
    charge = 1
     H  -2.457   0.000   0.000
     H   2.457   0.000   0.000
     H  -2.457   4.913   0.000
     H   2.457   4.913   0.000
}
