   9
sisl-version=1 cell= 4.91362818 0.00000000 0.00000000 -2.45681409 4.25911676 0.00000000 0.00000000 0.00000000 40.51491471  nsc= 1 1 1
C   1.24453115  0.70044149  20.01483635
C   -0.00857288  1.42459045  20.11738208
C   -0.00215707  2.85660750  19.91065747
C   -1.22414108  3.54254020  19.90948366
C   3.66954083  0.70328762  19.91066578
C   2.46476052  1.41924892  19.90927211
C   2.45898348  2.83813072  19.94075130
C   1.22414479  3.55174172  19.92445928
H   0.40923518  1.18324433  21.36889591

