    5
 
Si      1.169177    1.005510    1.123330
H      -0.134306    0.737516    1.796546
H       1.196800    2.415251    0.637076
H       2.283660    0.792138    2.091340
H       1.331383    0.078949   -0.033912
