<?xml version="1.0" encoding="utf-8"?>
<!-- Generator: Adobe Illustrator 22.1.0, SVG Export Plug-In . SVG Version: 6.00 Build 0)  -->
<svg version="1.1" id="Layer_1" xmlns="http://www.w3.org/2000/svg" xmlns:xlink="http://www.w3.org/1999/xlink" x="0px" y="0px"
	 viewBox="0 0 94.5 93" style="enable-background:new 0 0 94.5 93;" xml:space="preserve">
<style type="text/css">
	.st0{fill:#FFFFFF;}
</style>
<g>
	<path class="st0" d="M47.2,2.5c24.3,0,44,19.7,44,44s-19.7,44-44,44s-44-19.7-44-44S23,2.5,47.2,2.5 M47.2,0.5
		c-25.4,0-46,20.6-46,46s20.6,46,46,46s46-20.6,46-46S72.7,0.5,47.2,0.5L47.2,0.5z"/>
	<g>
		<g>
			<path class="st0" d="M40.7,59c-0.4,1-0.7,2.1-1.1,3.1c-1.6,3.8-3.2,2-4.2,10.6c-0.3,2-1.6,3.3-1.6,3.3s-1.6,1.9-1.6,3.6
				s1.9,2.1,2.4,1.2s0.7-1.8,0.7-1.8l0.7-1.4l1.3-3.9c2.8-4,4.6-5.7,4.6-8.3c1.1-1.8,3.3-3.8,4-5.5C43.7,59.8,41.8,59.4,40.7,59z"/>
			<path class="st0" d="M61,74.8c-0.7-0.4-2.7-0.8-2.6-4.3c0.1-3.5-0.1-7.9,0.1-8.3c0.2-0.4,1.1-2.5-0.4-4.2
				c-0.4-0.5-0.7-0.9-0.9-1.2c-0.9,0.9-2.2,1.7-4,2.3c0.7,0.5,1.9,1.5,1.5,3c-0.6,2.1-0.4,6,0.7,8.1c1.1,2.1,0.4,4.6,0.4,4.6
				s-0.6,1.1,0.7,1.2s1.8,0.5,2.5,0.9c0.6,0.4,1.6,1,3.9,1.2C64.8,78.1,61.7,75.3,61,74.8z"/>
			<path class="st0" d="M68.1,29.3c-2.1-6.7-5.5-11.6-7.6-11c-2,0.6-2,6.4,0,13l0,0l1.2,3.4l0,0c2.1,5.1,4.7,8.5,6.5,8
				C70.2,42,70.2,36,68.1,29.3z"/>
			<path class="st0" d="M41.3,26.3c0,0.6,0.1,1.1,0.2,1.6c1.4-4.2,6.9-4.2,7-4.2l0,0v-1C44.5,21.9,41.5,23.4,41.3,26.3z"/>
			<g>
				<path class="st0" d="M54,37.6c1.4,0.2,5-1.8,6.9-2.6l-1.2-3.4l-5,1.7c-0.5-0.2-2.4-0.3-2.4-0.3l-4.6,0.5l0.1-2.1l2,0.1
					c0,0,0.1-2.4,0.2-3.5c0-0.8-0.7-2.5-1-3.3h-0.2c-0.3,0-5.6,0-6.3,4.2c0,0.1,0,0.3-0.1,0.4c0.7,1.1,1.7,1.8,1.7,1.8
					c0.4,2-1.3,3-1.3,3c-1.2-1-5-1.6-5-1.6c-3.7-1.1-7-7-8.2-9.3L28,23.9c2.5,9.5,10,13.4,10,13.4s2.3,4.3,4,9.5l-2.7,10.9h0.1
					c0.1,0,4.6,2,10.4,1.4c5.7-0.6,7.6-3.1,8.6-4.9l0.1-0.2l-7.1-8.4C51.8,41.3,54,37.6,54,37.6z"/>
				<path class="st0" d="M26.6,23.2l2.2-1l0,0l2.6-1.2l-0.4-0.5l0,0c12.6-5.5,13.5-8.8,13.5-8.8c-2.9,0.3-14.2,8-14.2,8L30,19.2
					l-5.1,3.5l0.7,1.1L26.6,23.2L26.6,23.2z"/>
			</g>
		</g>
	</g>
</g>
</svg>
