<?xml version="1.0" encoding="utf-8"?>
<!-- Generator: Adobe Illustrator 22.1.0, SVG Export Plug-In . SVG Version: 6.00 Build 0)  -->
<svg version="1.1" id="Layer_1" xmlns="http://www.w3.org/2000/svg" xmlns:xlink="http://www.w3.org/1999/xlink" x="0px" y="0px"
	 viewBox="0 0 135 212" style="enable-background:new 0 0 135 212;" xml:space="preserve">
<style type="text/css">
	.st0{fill:#004466;}
	.st1{fill:#FFFFFF;}
</style>
<path class="st1" d="M122.8,118.4V151c5.3,2,9.1,7.1,9.1,13c0,7.7-6.2,13.9-13.9,13.9c-3.4,0-6.5-1.2-8.9-3.2l-27.8,16
	c0.1,0.8,0.2,1.5,0.2,2.3c0,7.7-6.2,13.9-13.9,13.9c-7.7,0-13.9-6.2-13.9-13.9c0-0.8,0.1-1.5,0.2-2.3l-28-16.1
	c-2.4,2-5.5,3.2-8.9,3.2C9.2,178,3,171.8,3,164.1c0-7.7,6.2-13.9,13.9-13.9c7.7,0,13.9,6.2,13.9,13.9c0,0.8-0.1,1.5-0.2,2.3l28,16.1
	c2.4-2,5.5-3.2,8.9-3.2c3.4,0,6.5,1.2,8.9,3.2l27.8-16c-0.1-0.8-0.2-1.5-0.2-2.3c0-6,3.8-11.1,9.1-13v-32.6c-5.3-2-9.1-7.1-9.1-13
	c0-0.7,0.1-1.5,0.2-2.2L76.5,87.6c-2.4,2-5.6,3.3-9,3.3c-7.7,0-13.9-6.2-13.9-13.9c0-7.7,6.2-13.9,13.9-13.9
	c7.7,0,13.9,6.2,13.9,13.9c0,0.7-0.1,1.5-0.2,2.2L109,94.8c2.4-2,5.6-3.3,9-3.3c7.7,0,13.9,6.2,13.9,13.9
	C131.8,111.4,128.1,116.5,122.8,118.4z M3,106.6c0,7.7,6.2,13.9,13.9,13.9c3.4,0,6.6-1.2,9-3.3l27.7,15.6c-0.1,0.7-0.2,1.4-0.2,2.2
	c0,7.7,6.2,13.9,13.9,13.9c7.7,0,13.9-6.2,13.9-13.9c0-7.7-6.2-13.9-13.9-13.9c-3.4,0-6.6,1.2-9,3.3l-27.7-15.6
	c0.1-0.7,0.2-1.4,0.2-2.2c0-6-3.8-11.1-9.1-13V61c5.3-2,9.1-7.1,9.1-13c0-0.8-0.1-1.6-0.2-2.3l27.8-16c2.4,2,5.5,3.2,8.9,3.2
	c3.4,0,6.5-1.2,8.9-3.2l28,16.1c-0.1,0.7-0.2,1.5-0.2,2.3c0,7.7,6.2,13.9,13.9,13.9c7.7,0,13.9-6.2,13.9-13.9
	c0-7.7-6.2-13.9-13.9-13.9c-3.4,0-6.5,1.2-8.9,3.2L81,21.2c0.1-0.7,0.2-1.5,0.2-2.3C81.2,11.2,75,5,67.3,5
	c-7.7,0-13.9,6.2-13.9,13.9c0,0.8,0.1,1.6,0.2,2.3l-27.8,16c-2.4-2-5.5-3.2-8.9-3.2C9.2,34,3,40.2,3,47.9c0,6,3.8,11.1,9.1,13v32.6
	C6.8,95.5,3,100.6,3,106.6z"/>
</svg>
