\relax 
\providecommand\hyper@newdestlabel[2]{}
\gdef \LT@i {\LT@entry 
    {1}{152.92793pt}\LT@entry 
    {1}{258.72162pt}\LT@entry 
    {1}{12.0pt}}
\@writefile{toc}{\contentsline {section}{\numberline {1}Module phybo\_beta}{2}{section.1}\protected@file@percent }
\newlabel{phybo_beta}{{1}{2}{Module phybo\_beta}{section.1}{}}
\@writefile{toc}{\contentsline {subsection}{\numberline {1.1}Variables}{2}{subsection.1.1}\protected@file@percent }
\@writefile{toc}{\contentsline {subsection}{\numberline {1.2}Class phybo}{2}{subsection.1.2}\protected@file@percent }
\newlabel{phybo_beta:phybo}{{1.2}{2}{Class phybo}{subsection.1.2}{}}
\@writefile{toc}{\contentsline {subsubsection}{\numberline {1.2.1}Methods}{2}{subsubsection.1.2.1}\protected@file@percent }
\newlabel{phybo_beta:phybo:calc_ref_change}{{1.2.1}{2}{Methods}{subsubsection.1.2.1}{}}
\newlabel{phybo_beta:phybo:calc_Psi}{{1.2.1}{2}{Methods}{subsubsection.1.2.1}{}}
\newlabel{phybo_beta:phybo:calc_ED_decs}{{1.2.1}{2}{Methods}{subsubsection.1.2.1}{}}
\newlabel{phybo_beta:phybo:calc_lengths}{{1.2.1}{2}{Methods}{subsubsection.1.2.1}{}}
\gdef \LT@ii {\LT@entry 
    {1}{152.92793pt}\LT@entry 
    {1}{258.72162pt}\LT@entry 
    {1}{12.0pt}}
\newlabel{phybo_beta:phybo:calc_energy_conv}{{1.2.1}{3}{Methods}{subsubsection.1.2.1}{}}
\newlabel{phybo_beta:phybo:calc_E_dec}{{1.2.1}{3}{Methods}{subsubsection.1.2.1}{}}
\@writefile{toc}{\contentsline {subsubsection}{\numberline {1.2.2}Properties}{3}{subsubsection.1.2.2}\protected@file@percent }
\@setckpt{phybo_beta-module}{
\setcounter{page}{4}
\setcounter{equation}{0}
\setcounter{enumi}{0}
\setcounter{enumii}{0}
\setcounter{enumiii}{0}
\setcounter{enumiv}{0}
\setcounter{footnote}{0}
\setcounter{mpfootnote}{0}
\setcounter{part}{0}
\setcounter{section}{1}
\setcounter{subsection}{2}
\setcounter{subsubsection}{2}
\setcounter{paragraph}{0}
\setcounter{subparagraph}{0}
\setcounter{figure}{0}
\setcounter{table}{2}
\setcounter{LT@tables}{2}
\setcounter{LT@chunks}{4}
\setcounter{Item}{0}
\setcounter{Hfootnote}{0}
\setcounter{bookmark@seq@number}{6}
\setcounter{section@level}{3}
}
