\relax 
\providecommand\hyper@newdestlabel[2]{}
\@writefile{toc}{\contentsline {section}{\numberline {1}Module fibo\_beta}{2}{section.1}\protected@file@percent }
\newlabel{fibo_beta}{{1}{2}{Module fibo\_beta}{section.1}{}}
\@writefile{toc}{\contentsline {subsection}{\numberline {1.1}Class fibo}{2}{subsection.1.1}\protected@file@percent }
\newlabel{fibo_beta:fibo}{{1.1}{2}{Class fibo}{subsection.1.1}{}}
\@writefile{toc}{\contentsline {subsubsection}{\numberline {1.1.1}Methods}{2}{subsubsection.1.1.1}\protected@file@percent }
\newlabel{fibo_beta:fibo:help}{{1.1.1}{2}{Methods}{subsubsection.1.1.1}{}}
\newlabel{fibo_beta:fibo:get_time_exit}{{1.1.1}{2}{Methods}{subsubsection.1.1.1}{}}
\newlabel{fibo_beta:fibo:get_data}{{1.1.1}{2}{Methods}{subsubsection.1.1.1}{}}
\newlabel{fibo_beta:fibo:get_pnts}{{1.1.1}{2}{Methods}{subsubsection.1.1.1}{}}
\newlabel{fibo_beta:fibo:axis_data}{{1.1.1}{3}{Methods}{subsubsection.1.1.1}{}}
\newlabel{fibo_beta:fibo:axis_line}{{1.1.1}{3}{Methods}{subsubsection.1.1.1}{}}
\newlabel{fibo_beta:fibo:extract_line}{{1.1.1}{3}{Methods}{subsubsection.1.1.1}{}}
\newlabel{fibo_beta:fibo:extract_grid}{{1.1.1}{4}{Methods}{subsubsection.1.1.1}{}}
\newlabel{fibo_beta:fibo:extract_small_box}{{1.1.1}{4}{Methods}{subsubsection.1.1.1}{}}
\newlabel{fibo_beta:fibo:extract_lower_res}{{1.1.1}{4}{Methods}{subsubsection.1.1.1}{}}
\newlabel{fibo_beta:fibo:calc_slided}{{1.1.1}{5}{Methods}{subsubsection.1.1.1}{}}
\newlabel{fibo_beta:fibo:calc_scalr}{{1.1.1}{5}{Methods}{subsubsection.1.1.1}{}}
\newlabel{fibo_beta:fibo:calc_cross}{{1.1.1}{5}{Methods}{subsubsection.1.1.1}{}}
\newlabel{fibo_beta:fibo:calc_project}{{1.1.1}{6}{Methods}{subsubsection.1.1.1}{}}
\newlabel{fibo_beta:fibo:calc_par_per}{{1.1.1}{6}{Methods}{subsubsection.1.1.1}{}}
\newlabel{fibo_beta:fibo:calc_irr_sol}{{1.1.1}{7}{Methods}{subsubsection.1.1.1}{}}
\newlabel{fibo_beta:fibo:calc_gradx}{{1.1.1}{7}{Methods}{subsubsection.1.1.1}{}}
\newlabel{fibo_beta:fibo:calc_grady}{{1.1.1}{8}{Methods}{subsubsection.1.1.1}{}}
\newlabel{fibo_beta:fibo:calc_gradz}{{1.1.1}{8}{Methods}{subsubsection.1.1.1}{}}
\newlabel{fibo_beta:fibo:calc_divr}{{1.1.1}{8}{Methods}{subsubsection.1.1.1}{}}
\newlabel{fibo_beta:fibo:calc_curl}{{1.1.1}{9}{Methods}{subsubsection.1.1.1}{}}
\newlabel{fibo_beta:fibo:calc_lapl}{{1.1.1}{9}{Methods}{subsubsection.1.1.1}{}}
\newlabel{fibo_beta:fibo:calc_len_scal}{{1.1.1}{9}{Methods}{subsubsection.1.1.1}{}}
\newlabel{fibo_beta:fibo:calc_len_vect}{{1.1.1}{10}{Methods}{subsubsection.1.1.1}{}}
\newlabel{fibo_beta:fibo:find_box}{{1.1.1}{10}{Methods}{subsubsection.1.1.1}{}}
\newlabel{fibo_beta:fibo:find_slice}{{1.1.1}{11}{Methods}{subsubsection.1.1.1}{}}
\newlabel{fibo_beta:fibo:find_common_coord}{{1.1.1}{11}{Methods}{subsubsection.1.1.1}{}}
\newlabel{fibo_beta:fibo:find_critical_squarely_2d}{{1.1.1}{11}{Methods}{subsubsection.1.1.1}{}}
\newlabel{fibo_beta:fibo:find_critical_delaunay_2d}{{1.1.1}{12}{Methods}{subsubsection.1.1.1}{}}
\newlabel{fibo_beta:fibo:find_critical_starlike_2d}{{1.1.1}{12}{Methods}{subsubsection.1.1.1}{}}
\newlabel{fibo_beta:fibo:count_perm}{{1.1.1}{13}{Methods}{subsubsection.1.1.1}{}}
\newlabel{fibo_beta:fibo:count_spot_number}{{1.1.1}{13}{Methods}{subsubsection.1.1.1}{}}
\newlabel{fibo_beta:fibo:count_region_number}{{1.1.1}{13}{Methods}{subsubsection.1.1.1}{}}
\newlabel{fibo_beta:fibo:count_shell_pop}{{1.1.1}{14}{Methods}{subsubsection.1.1.1}{}}
\newlabel{fibo_beta:fibo:draw_canvas}{{1.1.1}{14}{Methods}{subsubsection.1.1.1}{}}
\newlabel{fibo_beta:fibo:draw_lins}{{1.1.1}{14}{Methods}{subsubsection.1.1.1}{}}
\newlabel{fibo_beta:fibo:draw_cuts}{{1.1.1}{15}{Methods}{subsubsection.1.1.1}{}}
\newlabel{fibo_beta:fibo:draw_contour}{{1.1.1}{15}{Methods}{subsubsection.1.1.1}{}}
\newlabel{fibo_beta:fibo:draw_spotted}{{1.1.1}{15}{Methods}{subsubsection.1.1.1}{}}
\newlabel{fibo_beta:fibo:draw_streams}{{1.1.1}{16}{Methods}{subsubsection.1.1.1}{}}
\newlabel{fibo_beta:fibo:draw_quivers}{{1.1.1}{16}{Methods}{subsubsection.1.1.1}{}}
\newlabel{fibo_beta:fibo:draw_scatter}{{1.1.1}{17}{Methods}{subsubsection.1.1.1}{}}
\newlabel{fibo_beta:fibo:draw_heatmap}{{1.1.1}{17}{Methods}{subsubsection.1.1.1}{}}
\newlabel{fibo_beta:fibo:print_vtk_scal}{{1.1.1}{18}{Methods}{subsubsection.1.1.1}{}}
\newlabel{fibo_beta:fibo:print_vtk_vect}{{1.1.1}{18}{Methods}{subsubsection.1.1.1}{}}
\newlabel{fibo_beta:fibo:make_spect}{{1.1.1}{19}{Methods}{subsubsection.1.1.1}{}}
\newlabel{fibo_beta:fibo:stat_minimal}{{1.1.1}{19}{Methods}{subsubsection.1.1.1}{}}
\newlabel{fibo_beta:fibo:frame_MVA}{{1.1.1}{19}{Methods}{subsubsection.1.1.1}{}}
\gdef \LT@i {\LT@entry 
    {1}{152.92793pt}\LT@entry 
    {1}{258.72162pt}\LT@entry 
    {1}{12.0pt}}
\@writefile{toc}{\contentsline {subsubsection}{\numberline {1.1.2}Properties}{20}{subsubsection.1.1.2}\protected@file@percent }
\@writefile{toc}{\contentsline {subsection}{\numberline {1.2}Class from\_HVM}{20}{subsection.1.2}\protected@file@percent }
\newlabel{fibo_beta:from_HVM}{{1.2}{20}{Class from\_HVM}{subsection.1.2}{}}
\@writefile{toc}{\contentsline {subsubsection}{\numberline {1.2.1}Methods}{20}{subsubsection.1.2.1}\protected@file@percent }
\newlabel{fibo_beta:from_HVM:help}{{1.2.1}{20}{Methods}{subsubsection.1.2.1}{}}
\newlabel{fibo_beta:from_HVM:get_meta}{{1.2.1}{20}{Methods}{subsubsection.1.2.1}{}}
\newlabel{fibo_beta:from_HVM:get_meta_A}{{1.2.1}{21}{Methods}{subsubsection.1.2.1}{}}
\newlabel{fibo_beta:from_HVM:get_meta_B}{{1.2.1}{21}{Methods}{subsubsection.1.2.1}{}}
\newlabel{fibo_beta:from_HVM:get_meta_C}{{1.2.1}{21}{Methods}{subsubsection.1.2.1}{}}
\newlabel{fibo_beta:from_HVM:get_EB}{{1.2.1}{21}{Methods}{subsubsection.1.2.1}{}}
\newlabel{fibo_beta:from_HVM:get_Ion}{{1.2.1}{21}{Methods}{subsubsection.1.2.1}{}}
\newlabel{fibo_beta:from_HVM:get_Press}{{1.2.1}{21}{Methods}{subsubsection.1.2.1}{}}
\newlabel{fibo_beta:from_HVM:get_Q}{{1.2.1}{22}{Methods}{subsubsection.1.2.1}{}}
\newlabel{fibo_beta:from_HVM:get_Te}{{1.2.1}{22}{Methods}{subsubsection.1.2.1}{}}
\newlabel{fibo_beta:from_HVM:get_Qe}{{1.2.1}{22}{Methods}{subsubsection.1.2.1}{}}
\newlabel{fibo_beta:from_HVM:get_seg_EB}{{1.2.1}{22}{Methods}{subsubsection.1.2.1}{}}
\newlabel{fibo_beta:from_HVM:get_seg_Ion}{{1.2.1}{23}{Methods}{subsubsection.1.2.1}{}}
\newlabel{fibo_beta:from_HVM:get_seg_Press}{{1.2.1}{23}{Methods}{subsubsection.1.2.1}{}}
\newlabel{fibo_beta:from_HVM:get_seg_Q}{{1.2.1}{23}{Methods}{subsubsection.1.2.1}{}}
\newlabel{fibo_beta:from_HVM:get_seg_Te}{{1.2.1}{23}{Methods}{subsubsection.1.2.1}{}}
\newlabel{fibo_beta:from_HVM:get_seg_Qe}{{1.2.1}{24}{Methods}{subsubsection.1.2.1}{}}
\newlabel{fibo_beta:from_HVM:calc_all}{{1.2.1}{24}{Methods}{subsubsection.1.2.1}{}}
\newlabel{fibo_beta:from_HVM:clean_old_vars}{{1.2.1}{24}{Methods}{subsubsection.1.2.1}{}}
\newlabel{fibo_beta:from_HVM:clean_new_vars}{{1.2.1}{24}{Methods}{subsubsection.1.2.1}{}}
\gdef \LT@ii {\LT@entry 
    {1}{152.92793pt}\LT@entry 
    {1}{258.72162pt}\LT@entry 
    {1}{12.0pt}}
\@writefile{toc}{\contentsline {subsubsection}{\numberline {1.2.2}Properties}{25}{subsubsection.1.2.2}\protected@file@percent }
\@writefile{toc}{\contentsline {subsection}{\numberline {1.3}Class from\_MFL}{25}{subsection.1.3}\protected@file@percent }
\newlabel{fibo_beta:from_MFL}{{1.3}{25}{Class from\_MFL}{subsection.1.3}{}}
\@writefile{toc}{\contentsline {subsubsection}{\numberline {1.3.1}Methods}{25}{subsubsection.1.3.1}\protected@file@percent }
\newlabel{fibo_beta:from_MFL:help}{{1.3.1}{25}{Methods}{subsubsection.1.3.1}{}}
\newlabel{fibo_beta:from_MFL:get_meta}{{1.3.1}{25}{Methods}{subsubsection.1.3.1}{}}
\newlabel{fibo_beta:from_MFL:get_B}{{1.3.1}{26}{Methods}{subsubsection.1.3.1}{}}
\newlabel{fibo_beta:from_MFL:get_E}{{1.3.1}{26}{Methods}{subsubsection.1.3.1}{}}
\newlabel{fibo_beta:from_MFL:get_Ui}{{1.3.1}{26}{Methods}{subsubsection.1.3.1}{}}
\newlabel{fibo_beta:from_MFL:get_Ue}{{1.3.1}{26}{Methods}{subsubsection.1.3.1}{}}
\newlabel{fibo_beta:from_MFL:get_seg_U}{{1.3.1}{27}{Methods}{subsubsection.1.3.1}{}}
\newlabel{fibo_beta:from_MFL:get_seg_EB}{{1.3.1}{27}{Methods}{subsubsection.1.3.1}{}}
\newlabel{fibo_beta:from_MFL:get_seg_DPJ}{{1.3.1}{27}{Methods}{subsubsection.1.3.1}{}}
\@writefile{toc}{\contentsline {subsubsection}{\numberline {1.3.2}Properties}{27}{subsubsection.1.3.2}\protected@file@percent }
\gdef \LT@iii {\LT@entry 
    {1}{152.92793pt}\LT@entry 
    {1}{258.72162pt}\LT@entry 
    {1}{12.0pt}}
\@writefile{toc}{\contentsline {subsection}{\numberline {1.4}Class from\_VTK}{28}{subsection.1.4}\protected@file@percent }
\newlabel{fibo_beta:from_VTK}{{1.4}{28}{Class from\_VTK}{subsection.1.4}{}}
\@writefile{toc}{\contentsline {subsubsection}{\numberline {1.4.1}Methods}{28}{subsubsection.1.4.1}\protected@file@percent }
\newlabel{fibo_beta:from_VTK:get_scal}{{1.4.1}{28}{Methods}{subsubsection.1.4.1}{}}
\newlabel{fibo_beta:from_VTK:get_vect}{{1.4.1}{28}{Methods}{subsubsection.1.4.1}{}}
\gdef \LT@iv {\LT@entry 
    {1}{152.92793pt}\LT@entry 
    {1}{258.72162pt}\LT@entry 
    {1}{12.0pt}}
\@writefile{toc}{\contentsline {subsubsection}{\numberline {1.4.2}Properties}{29}{subsubsection.1.4.2}\protected@file@percent }
\@setckpt{fibo_beta-module}{
\setcounter{page}{30}
\setcounter{equation}{0}
\setcounter{enumi}{0}
\setcounter{enumii}{0}
\setcounter{enumiii}{0}
\setcounter{enumiv}{0}
\setcounter{footnote}{0}
\setcounter{mpfootnote}{0}
\setcounter{part}{0}
\setcounter{section}{1}
\setcounter{subsection}{4}
\setcounter{subsubsection}{2}
\setcounter{paragraph}{0}
\setcounter{subparagraph}{0}
\setcounter{figure}{0}
\setcounter{table}{4}
\setcounter{LT@tables}{4}
\setcounter{LT@chunks}{4}
\setcounter{Item}{0}
\setcounter{Hfootnote}{0}
\setcounter{bookmark@seq@number}{14}
\setcounter{section@level}{3}
}
