\contentsline {section}{Contents}{1}{section*.1}% 
\contentsline {section}{\numberline {1}Module fibo\_beta}{2}{section.1}% 
\contentsline {subsection}{\numberline {1.1}Class fibo}{2}{subsection.1.1}% 
\contentsline {subsubsection}{\numberline {1.1.1}Methods}{2}{subsubsection.1.1.1}% 
\contentsline {subsubsection}{\numberline {1.1.2}Properties}{20}{subsubsection.1.1.2}% 
\contentsline {subsection}{\numberline {1.2}Class from\_HVM}{20}{subsection.1.2}% 
\contentsline {subsubsection}{\numberline {1.2.1}Methods}{20}{subsubsection.1.2.1}% 
\contentsline {subsubsection}{\numberline {1.2.2}Properties}{25}{subsubsection.1.2.2}% 
\contentsline {subsection}{\numberline {1.3}Class from\_MFL}{25}{subsection.1.3}% 
\contentsline {subsubsection}{\numberline {1.3.1}Methods}{25}{subsubsection.1.3.1}% 
\contentsline {subsubsection}{\numberline {1.3.2}Properties}{27}{subsubsection.1.3.2}% 
\contentsline {subsection}{\numberline {1.4}Class from\_VTK}{28}{subsection.1.4}% 
\contentsline {subsubsection}{\numberline {1.4.1}Methods}{28}{subsubsection.1.4.1}% 
\contentsline {subsubsection}{\numberline {1.4.2}Properties}{29}{subsubsection.1.4.2}% 
\contentsline {section}{Index}{30}{section*.2}% 
