{
  "class": "Container",
  "data": {
    "Content": [
      {
        "Key": "mode",
        "Type": "string",
        "IsVector": false,
        "Value": "DEBUG"
      },
      {
        "Key": "table1",
        "Type": "object",
        "IsVector": false,
        "Value": {
          "class": "Container",
          "data": {
            "Content": [
              {
                "Key": "A",
                "Type": "float",
                "IsVector": false,
                "Value": 1.0
              },
              {
                "Key": "B",
                "Type": "float",
                "IsVector": false,
                "Value": 0.87
              },
              {
                "Key": "C",
                "Type": "float",
                "IsVector": false,
                "Value": 0.93
              }
            ]
          }
        }
      },
      {
        "Key": "version",
        "Type": "string",
        "IsVector": false,
        "Value": "1.0"
      }
    ]
  }
}
