178.184.76.252,Irkutsk
176.59.148.253,Irkutsk
188.162.250.9,Irkutsk
109.252.178.53,Moscow
95.216.148.194,
50.25.58.111,
217.74.113.57,
185.18.177.90,
188.113.141.253,
78.26.176.76,
79.105.141.16,
102.157.95.90,
88.156.139.12,
85.140.14.124,
190.255.12.218,
95.102.49.50,
61.230.46.250,
178.67.198.208,
176.62.80.23,
128.72.10.180,
85.251.77.166,
178.155.5.224,
109.252.139.247,
188.106.230.84,
102.191.43.46,
79.170.188.122,
89.68.128.125,
186.132.55.196,
171.235.238.59,
5.206.23.205,
179.189.33.1,
46.147.27.24,
78.107.28.129,
5.153.168.106,
31.40.187.162,
94.25.171.130,
81.222.191.35,
178.134.12.213,
79.133.152.236,
91.105.156.209,
95.54.250.54,
178.90.152.72,
87.80.72.37,
89.187.216.180,
115.187.99.3,
173.19.12.85,
59.149.158.138,
94.254.165.110,
176.59.49.43,
188.163.80.59,
178.66.156.168,
37.248.162.38,
213.182.188.99,
23.227.142.230,
189.142.97.51,
176.107.250.13,
95.67.134.241,
5.58.187.200,
37.113.137.210,
91.105.138.38,
85.187.224.135,
213.235.186.184,
128.71.209.126,
27.33.142.32,
178.134.230.23,
119.30.45.170,
5.129.226.168,
90.253.121.170,
87.116.160.53,
201.191.69.9,
185.3.34.217,
95.137.252.147,
78.182.153.218,
178.66.21.97,
109.40.241.236,
176.55.140.251,
185.205.238.248,
130.43.107.173,
89.209.109.122,
95.108.8.236,
185.90.100.137,
188.244.13.39,
41.81.10.106,
146.120.172.141,
200.138.49.157,
91.187.185.112,
37.252.88.20,
37.215.20.232,
178.90.15.250,
213.200.15.213,
178.217.44.116,
185.32.66.154,
5.166.125.142,
109.252.49.157,
42.104.157.241,
213.151.18.217,
193.108.219.81,
89.151.178.194,
31.23.175.144,
91.195.204.111,