<?xml version="1.0" ?>
<!DOCTYPE svg PUBLIC '-//W3C//DTD SVG 1.1//EN' 'http://www.w3.org/Graphics/SVG/1.1/DTD/svg11.dtd'>
<svg enable-background="new 0 0 26 26" height="26px" id="Layer_1" version="1.1" viewBox="0 0 26 26" width="26px" xml:space="preserve" xmlns="http://www.w3.org/2000/svg" xmlns:xlink="http://www.w3.org/1999/xlink">
  <g><polygon fill="#cccccc" points="23.885,0.58 25.969,2.664 15.133,13.5 25.969,24.336 23.885,26.42 10.965,13.5  "/><polygon fill="#cccccc" points="12.885,0.58 14.969,2.664 4.133,13.5 14.969,24.336 12.885,26.42 -0.035,13.5  "/></g>
</svg>
