<?xml version="1.0" ?>
<svg height="12px" version="1.1" viewBox="0 0 9 12" width="9px" xmlns="http://www.w3.org/2000/svg" xmlns:sketch="http://www.bohemiancoding.com/sketch/ns" xmlns:xlink="http://www.w3.org/1999/xlink"><title/><desc/><defs/>
  <g fill="none" fill-rule="evenodd" id="Page-1" stroke="none" stroke-width="1">
    <g fill="#287FB8" id="Core" transform="translate(-260.000000, -90.000000)">
      <g id="chevron-right" transform="translate(260.500000, 90.000000)"><path d="M1,0 L-0.4,1.4 L4.2,6 L-0.4,10.6 L1,12 L7,6 L1,0 Z" id="Shape"/></g>
    </g>
  </g>
</svg>
