{
	"ENV_PROD": "https://gitlab.com/api/v4/",
	"ENV_DEV": "https://gitlab.com/api/v4/",
	"SIA_GROUP_ID": "4722880",
	"DEV_SUBGROUP_ID": "7699314",
	"GESTION_SUBGROUP_ID": "7776709",
	"BDE_SUBGROUP_ID": "296242",
	"GESTION_PROJECT_ID": "15333613",
	"SIA_ACCOUNT_ID": 3738263
}
