<?xml version="1.0" encoding="UTF-8"?>
<svg id="Layer_1" data-name="Layer 1" xmlns="http://www.w3.org/2000/svg" xmlns:xlink="http://www.w3.org/1999/xlink" viewBox="0 0 895.908709990720126 814.15093994140625">
  <defs>
    <style>
      .cls-1 {
        fill: url(#linear-gradient-17);
      }

      .cls-2 {
        stroke: url(#linear-gradient-2);
      }

      .cls-2, .cls-3, .cls-4 {
        fill: #003456;
        stroke-width: 1.075469970703125px;
      }

      .cls-5 {
        fill: url(#linear-gradient-18);
      }

      .cls-6 {
        fill: url(#linear-gradient-20);
      }

      .cls-7 {
        fill: url(#linear-gradient-6);
      }

      .cls-3 {
        stroke: url(#linear-gradient);
      }

      .cls-8 {
        fill: url(#linear-gradient-11);
      }

      .cls-9 {
        fill: url(#linear-gradient-10);
      }

      .cls-10 {
        stroke: url(#linear-gradient-4);
      }

      .cls-10, .cls-11, .cls-12, .cls-13 {
        fill: none;
      }

      .cls-10, .cls-12 {
        stroke-width: 2.15093994140625px;
      }

      .cls-14 {
        fill: url(#linear-gradient-16);
      }

      .cls-15 {
        fill: url(#linear-gradient-21);
      }

      .cls-16 {
        fill: url(#linear-gradient-5);
      }

      .cls-17 {
        fill: url(#linear-gradient-7);
      }

      .cls-11 {
        stroke: url(#linear-gradient-14);
      }

      .cls-11, .cls-13 {
        stroke-width: 1.613209962844849px;
      }

      .cls-18 {
        fill: url(#linear-gradient-24);
      }

      .cls-12 {
        stroke: url(#linear-gradient-15);
      }

      .cls-19 {
        fill: url(#linear-gradient-9);
      }

      .cls-20 {
        fill: url(#linear-gradient-22);
      }

      .cls-13 {
        stroke: url(#linear-gradient-25);
      }

      .cls-21 {
        fill: url(#linear-gradient-23);
      }

      .cls-22 {
        fill: url(#linear-gradient-19);
      }

      .cls-4 {
        stroke: url(#linear-gradient-3);
      }

      .cls-23 {
        fill: url(#linear-gradient-8);
      }

      .cls-24 {
        fill: url(#linear-gradient-12);
      }

      .cls-25 {
        fill: url(#linear-gradient-13);
      }

      .cls-26 {
        fill: url(#linear-gradient-26);
      }
    </style>
    <linearGradient id="linear-gradient" x1="-174.357689861075414" y1="671.368180788322206" x2="-174.357689861075386" y2="384.78323498763308" gradientTransform="translate(424.5 935.65093994140625) scale(1 -1)" gradientUnits="userSpaceOnUse">
      <stop offset="0" stop-color="#003456"/>
      <stop offset=".421875" stop-color="#003456" stop-opacity=".800000011920929"/>
      <stop offset="1" stop-color="#003456" stop-opacity=".600000023841858"/>
    </linearGradient>
    <linearGradient id="linear-gradient-2" x1="15.392192904870171" y1="667.985315316782362" x2="15.392192904870184" y2="451.636977135855091" xlink:href="#linear-gradient"/>
    <linearGradient id="linear-gradient-3" x1="232.571378501177605" y1="669.907063791550172" x2="232.571378501177605" y2="440.087871853080856" xlink:href="#linear-gradient"/>
    <linearGradient id="linear-gradient-4" x1="-134.359517035141835" y1="977.650939941404431" x2="-134.359517035141778" y2="163.5" gradientTransform="translate(305.530719268064786 -163.5) rotate(-180) scale(1 -1)" gradientUnits="userSpaceOnUse">
      <stop offset=".036458299160004" stop-color="#003456"/>
      <stop offset=".572916984558105" stop-color="#003456" stop-opacity=".800000011920929"/>
      <stop offset="1" stop-color="#003456" stop-opacity=".600000023841858"/>
    </linearGradient>
    <linearGradient id="linear-gradient-5" x1="-362.158276907303843" y1="164.867807583425929" x2="-362.158276907303843" y2="531.651304906096811" gradientTransform="translate(424.5 935.65093994140625) scale(1 -1)" gradientUnits="userSpaceOnUse">
      <stop offset="0" stop-color="#003456"/>
      <stop offset=".000099999997765" stop-color="#003456" stop-opacity=".779999971389771"/>
      <stop offset=".552083015441895" stop-color="#003456"/>
    </linearGradient>
    <linearGradient id="linear-gradient-6" x1="-417.44487008429769" y1="164.867807583467766" x2="-417.44487008429769" y2="531.651304906085784" xlink:href="#linear-gradient-5"/>
    <linearGradient id="linear-gradient-7" x1="-397.545899009212917" y1="164.867807583437752" x2="-397.545899009212917" y2="531.651304906095675" xlink:href="#linear-gradient-5"/>
    <linearGradient id="linear-gradient-8" x1="-346.779538618024162" y1="164.867807583435024" x2="-346.779538618024162" y2="531.651304906093969" xlink:href="#linear-gradient-5"/>
    <linearGradient id="linear-gradient-9" x1="-391.947543091268926" y1="164.867807583435024" x2="-391.947543091268926" y2="531.651304906094197" xlink:href="#linear-gradient-5"/>
    <linearGradient id="linear-gradient-10" x1="-315.252816926203195" y1="164.867807583435024" x2="-315.252816926203195" y2="531.651304906090672" xlink:href="#linear-gradient-5"/>
    <linearGradient id="linear-gradient-11" x1="-274.065314736203618" y1="164.867807583429567" x2="-274.065314736203618" y2="531.65130490609431" xlink:href="#linear-gradient-5"/>
    <linearGradient id="linear-gradient-12" x1="-278.344030496699816" y1="164.867807583429567" x2="-278.344030496699816" y2="531.651304906072482" xlink:href="#linear-gradient-5"/>
    <linearGradient id="linear-gradient-13" x1="-319.842098275433273" y1="164.867807583431386" x2="-319.842098275433273" y2="531.651304906097266" xlink:href="#linear-gradient-5"/>
    <linearGradient id="linear-gradient-14" x1="-333.333024626394035" y1="165.309872719698433" x2="-333.333024626394035" y2="531.579470542963122" gradientTransform="translate(424.5 935.65093994140625) scale(1 -1)" gradientUnits="userSpaceOnUse">
      <stop offset=".036458299160004" stop-color="#003456"/>
      <stop offset="1" stop-color="#003456" stop-opacity=".899999976158142"/>
    </linearGradient>
    <linearGradient id="linear-gradient-15" x1="31.518688629568715" y1="935.65093994140625" x2="31.518688629568764" y2="121.5" gradientTransform="translate(424.5 935.65093994140625) scale(1 -1)" gradientUnits="userSpaceOnUse">
      <stop offset=".036458299160004" stop-color="#003456"/>
      <stop offset=".572916984558105" stop-color="#003456" stop-opacity=".899999976158142"/>
      <stop offset="1" stop-color="#003456" stop-opacity=".800000011920929"/>
    </linearGradient>
    <linearGradient id="linear-gradient-16" x1="409.066844547664914" y1="892.283276911397479" x2="409.066844547664914" y2="525.499648672425565" gradientTransform="translate(424.5 935.65093994140625) scale(1 -1)" gradientUnits="userSpaceOnUse">
      <stop offset="0" stop-color="#003456"/>
      <stop offset=".000099999997765" stop-color="#003456" stop-opacity=".629999995231628"/>
      <stop offset=".161457996368408" stop-color="#003456" stop-opacity=".800000011920929"/>
      <stop offset=".375" stop-color="#003456" stop-opacity=".850932002067566"/>
      <stop offset=".625" stop-color="#003456" stop-opacity=".910558998584747"/>
      <stop offset=".859375" stop-color="#003456" stop-opacity=".966459989547729"/>
      <stop offset="1" stop-color="#003456"/>
    </linearGradient>
    <linearGradient id="linear-gradient-17" x1="464.353385057224841" y1="892.283276911437497" x2="464.353385057224841" y2="525.499648672411922" xlink:href="#linear-gradient-16"/>
    <linearGradient id="linear-gradient-18" x1="444.453988240504259" y1="892.28327691141385" x2="444.453988240504259" y2="525.499648672420221" xlink:href="#linear-gradient-16"/>
    <linearGradient id="linear-gradient-19" x1="393.687713509472815" y1="892.283276911392022" x2="393.687713509472815" y2="525.499648672423973" xlink:href="#linear-gradient-16"/>
    <linearGradient id="linear-gradient-20" x1="438.856070602305408" y1="892.283276911393841" x2="438.856070602305408" y2="525.499648672423746" xlink:href="#linear-gradient-16"/>
    <linearGradient id="linear-gradient-21" x1="362.161452752139667" y1="892.283276911392022" x2="362.161452752139667" y2="525.499648672429203" xlink:href="#linear-gradient-16"/>
    <linearGradient id="linear-gradient-22" x1="320.97376509737569" y1="892.283276911393841" x2="320.97376509737569" y2="525.499648672419312" xlink:href="#linear-gradient-16"/>
    <linearGradient id="linear-gradient-23" x1="325.252219025262093" y1="892.283276911393841" x2="325.252219025262093" y2="525.499648672455237" xlink:href="#linear-gradient-16"/>
    <linearGradient id="linear-gradient-24" x1="366.750613916858129" y1="892.283276911392022" x2="366.750613916858129" y2="525.499648672442277" xlink:href="#linear-gradient-16"/>
    <linearGradient id="linear-gradient-25" x1="380.241831178451321" y1="891.841159924289968" x2="380.241831178451321" y2="525.571463470276058" gradientTransform="translate(424.5 935.65093994140625) scale(1 -1)" gradientUnits="userSpaceOnUse">
      <stop offset=".000099999997765" stop-color="#003456" stop-opacity=".800000011920929"/>
      <stop offset=".380207977294922" stop-color="#003456"/>
      <stop offset="1" stop-color="#003456"/>
      <stop offset="1" stop-color="#003456"/>
    </linearGradient>
    <linearGradient id="linear-gradient-26" x1="43.80485651586423" y1="394.159685376821471" x2="43.804856515864238" y2="264.977541887824827" gradientTransform="translate(424.5 935.65093994140625) scale(1 -1)" gradientUnits="userSpaceOnUse">
      <stop offset=".000099999997765" stop-color="#003456" stop-opacity=".800000011920929"/>
      <stop offset=".520833015441895" stop-color="#003456" stop-opacity=".904156982898712"/>
      <stop offset="1" stop-color="#003456"/>
      <stop offset="1" stop-color="#003456"/>
    </linearGradient>
  </defs>
  <path class="cls-3" d="m243.284254072997101,551.020477813859543c-58.746858814827647,0-104.069287024216464-43.444881118753983-104.069287024216464-100.638810729635225,0-24.605239403786982,6.982475648814216-43.474948230017617,16.824850698445516-56.700593336769089,13.533102047862485-18.14757449062472,32.464276079055708-26.482753765347297,45.382486064077966-26.482753765347297l-.030023472498215,3.30602943746544c-12.30333974156747,0-29.788826841582704,7.581625026037727-43.014482858025076,25.114329273208568-9.534939927903906,12.918209985023168-16.039811078529965,30.679668654917805-16.039811078529965,54.671477894599775,0,56.285894122889658,43.982554381322188,97.362761125896213,101.49965088985482,97.362761125896213,62.130128871945999,0,99.669310036681054-43.075958972678563,99.669310036681054-97.824633848162193,0-46.136083951530964-22.699119829692791-92.226412654641535-81.737681990323836-92.226412654641535l-34.510519737728828.154437600538586v104.391024752210797c0,11.37959429703551,4.999104545375303,14.840061335040446,11.456791277922093,14.840061335040446v3.383270057120171l-38.691724670758049.230238140840811-.061487024346206-3.444757081464559c6.459104992511129,0,11.625542394418517-3.629218154501359,11.625542394418517-15.008812451536869v-179.946991579868154c0-11.381012557001668-4.460034842224559-15.50214872565175-11.825735243379313-15.50214872565175l-.061487024344387-2.645403945589351h54.332579221023479c51.980296881203685,0,79.355354358622208,15.994044920415945,79.355354358622208,46.443519073259267,0,25.528984848318942-19.686190178612378,41.215594647005673-57.209639567423437,45.213734947580633,49.826789130378529,5.844234749056341,84.890713906601377,41.83048670984499,84.890713906601377,94.118240532161508,0,67.974319982235102-52.979842866039689,101.269390929626752-117.263479488810844,101.269390929626752l-.476164418840199-.061487024346206-.045755248422211-.015709956536739Zm10.794725706695317-284.044872906925775h-26.83596595488234v87.181509222074965l26.897452979226728.215924624884792c48.904461945812727,0,63.530038735319977-18.670912417852378,63.530038735319977-43.891043884478677,0-25.221549726590638-14.147972291317274-42.738500378452954-63.591525759664364-43.50638996248108Z"/>
  <path class="cls-2" d="m429.535913044836889,359.678181980414593l34.663539078303074-92.242122611181003h1.846050809714143l75.663252739193922,197.156485290618548c4.305575422300535,11.37959429703551,12.071661521375063,16.577495250790889,18.530766513886192,16.577495250790889v3.075834935390958h-39.984414080747229v-3.075834935390958c6.459104992512948,0,9.457742947019142-4.289865465761977,5.15212388594955-15.363464720421689-19.069879855807812-49.826789130378529-42.984448475835961-93.210183224783577-94.348413214853281-103.052558274413968l-39.985854160095187,103.03684831787541c-3.99814030057496,11.073555615888836,1.231180566259354,15.379174676960247,7.690285558770483,15.379174676960247v3.075834935390958l-28.682016764596483-.291725165187017c-74.356249813245086.291725165187017-70.665522815013901-125.814605207803652,37.909521570772995-125.814605207803652,7.074018874734975,0,15.070299475883076.616310322804566,21.529404468394205,1.538637507371277h.015753595307615Zm-1.538659326753987,3.075834935392777c-6.150229791435777-.922327184567621-13.225645106751472-1.538637507371277-19.992185220989995-1.538637507371277-105.190356068700567,0-107.651320760638555,119.954660502206934-38.4471948333412,119.954660502206934,6.459104992511129,0,14.072193570396848-3.982430344034583,18.685204114426597-15.670899842147264l39.754175939904599-102.745123152688393Zm4.614494262146764-3.075834935392777c38.754629955068594,7.381410357693312,60.591469545192012,32.295524962557465,78.431608914090248,66.128269172520959l-52.287753822316517-135.332395099818314-26.14385509177373,69.204125927297355Z"/>
  <path class="cls-4" d="m603.854594500532585,268.312631305379c-6.459104992511129,0-11.6884694981145,4.675937647723913-11.6884694981145,16.055531944760332v197.24799578746206c50.227174828300122,8.735608611412317,37.755127609003466,7.982010723957501,64.729777569116777,9.642204020054123,19.330141469145019,1.184007057872805,25.850733486002355-1.582952676440982,33.541019044774657-3.121612003196788,29.281220690279952-6.427641440664956,68.17309457122974-40.414823251167036,51.256787924397941-83.475028628537984h2.93706365262733c7.690372836306778,19.992185220989995,11.458231357270051,56.684839741461474-31.233051874029115,79.968784522727219-16.917790364945176,9.227504806174693-52.273440306355042,14.702817409159252-78.417295398128772,8.551147538375517-20.745783108444812-4.614450623379525-39.18508276425564-8.930062962359443-69.249881175717746-8.930062962359443v-3.185935547473491c6.45910499250931,0,10.748970458273106-5.400952142028473,10.748970458273106-16.780546439065802v-179.901214512062325c0-11.381012557000759-5.320875002445973-16.055553764143951-11.779979994958921-16.055553764143951v-2.814133242702155h39.155059291759244v2.798423286162688Z"/>
  <g>
    <circle class="cls-10" cx="439.890225393512992" cy="407.075469970703125" r="405.999983635461149"/>
    <path class="cls-16" d="m90.792397110129059,474.742398469979889c-39.369669298750523-27.682514418529536-54.338295899653531-58.695408707160823-56.901348034867624-70.742763434669541,0,38.447194833343019,14.609708642432452,56.13289660170085,26.143871456311899,65.360401407877362,9.227210244491289,7.381410357695131,24.349701687100605,6.663596260137638,30.757476578555725,5.38236202679218Z"/>
    <path class="cls-7" d="m13.129671925756156,488.582913820184331c.768887820850068,4.613054182796986-.615166168850919,13.994952950744846-12.303047907305881,14.609866832965054-.256304804406682-3.845142779382513,1.845457595209155-12.148902141027065,12.303047907305881-14.609866832965054Z"/>
    <path class="cls-17" d="m19.281195879410916,524.723581562127947c14.76357348413876,9.842418688398539,20.248592985615687-24.350694469078007,21.530263606640801-39.985810521329768-2.460664675403677,8.612634562721723-16.660408910303886,22.81207878108944-23.837066167765443,26.143855091775549-7.997025187629333,4.921929383874158-1.794308867783911,11.278046883515344,2.306802561124641,13.841955429554218Z"/>
    <path class="cls-23" d="m39.273542018357148,474.742398469979889c12.303050634729516,19.478818752288134,44.906021628707094,61.053342267457992,76.893838727235561,71.510587560542263-18.967208744004893-1.537175608636971-60.899930177971328-17.993093251317987-76.893838727235561-71.510587560542263Z"/>
    <path class="cls-19" d="m13.129671925756156,615.458530217783846c31.987810279972109-18.454965973582148,33.833310150237594-86.121894472858912,30.757480669692086-117.648111591423003,5.126246096426257,22.55469732644633,13.071933000732315,73.202244408486877,3.844717301395576,95.347959199685647s-26.912898375734585,24.093313014434898-34.602197971087662,22.300152391737356Z"/>
    <path class="cls-9" d="m150.001117737531786,616.995749465189874c-46.751957886654054,1.229740486911396-73.818571095829611-30.756909274570717-81.507869327471781-46.905391795524338,18.850376851933106,41.215594647006583,45.275952921294447,53.057061666308073,56.132460214019375,53.826369510301447,11.072999221596547,1.844654369133423,21.530266334066255-3.845142779384332,25.375409113452406-6.920977714777109Z"/>
    <path class="cls-8" d="m164.610973660805939,748.484420045588195c5.638314311774593-1.025249219286707,16.916372104980837-.614870243454789,16.916372104980837,9.227504806174693-2.654000782917137.600556727496951-8.215096294423347.746397490705931-10.39720925778056-3.081595252790066.859400080871637,2.109236220523599,1.338433748718671,5.988722710453658-1.90613048378691,9.231781405458605-3.075834935392777-.255897736524275-8.303748451951833-3.690705178847566-4.613032363413367-15.377690958843232-17.955945749916282-14.233744290148024-33.001512953942438-33.435238670743274-45.268948899001771-53.826369510301447,10.47584631801692,5.895684856723165,32.043292882559399,18.608007133540013,34.50281749514761,22.300152391737356,8.612612743336285,1.229740486909577,10.76613140385416,7.688845479420706,10.76613140385416,10.764680414813483-7.997742499881497-1.229740486909577-10.50873903952197-7.688845479422525-10.76613140385416-10.764680414813483-2.459524612588211-3.692145258197343-24.02697117713069-16.404467535014192-34.50281749514761-22.300152391737356,12.267435945059333,20.391130839558173,27.313003149085489,39.592625220153423,45.268948899001771,53.826369510301447Z"/>
    <path class="cls-24" d="m141.542931685039548,752.328122745624569c0,5.383802106138319,1.844643459442523,16.610398881986839,9.226075636519454,18.455009612351205,0-5.382318388021304-1.844643459440704-16.608915163869824-9.226075636519454-18.455009612351205Z"/>
    <path class="cls-25" d="m101.557524822316736,703.885555341461441c-1.794164314364025,4.101084154677665-2.921964638839199,14.917258315927029,6.920410410792101,25.374547247780356,1.025281948361226-6.663596260134,1.076612049417236-21.068971825478002-6.920410410792101-25.374547247780356Z"/>
    <path class="cls-11" d="m33.890904521841549,429.374182283090704c-.768885093426434,14.353881818906302-5.99766047565754,46.290521552071368-20.761232596085392,59.208731537093627m0,0c.768887820850068,4.613054182796986-.615166168850919,13.994952950744846-12.303047907305881,14.609866832965054-.256304804406682-3.845142779382513,1.845457595209155-12.148902141027065,12.303047907305881-14.609866832965054Zm66.128704196491526,106.114123332617964c4.787205596854619,22.284398796429741,17.888163833264116,63.068144193668559,40.083648639556486,99.961013382484452m45.268948899001771,53.826369510301447c5.638314311774593-1.025249219286707,16.916372104980837-.614870243454789,16.916372104980837,9.227504806174693-2.819871740715826.637736957974994-8.920069684447299.762194724782603-10.764713143888002-3.845186418153389,1.025281948361226,1.794600702047319,2.152089490858998,6.304667391974363-1.538626597679468,9.995372570821928-3.075834935392777-.255897736524275-8.303748451951833-3.690705178847566-4.613032363413367-15.377690958843232Zm0,0c-17.955945749916282-14.233744290148024-33.00165477993869-33.435238670743274-45.268948899001771-53.826369510301447m22.20090692323538,32.295524962555646c-1.538626597677649,2.819893560101264-3.692145258195524,11.841467019303309,0,25.374547247782175m0,0c0,5.383802106138319,1.844643459442523,16.610398881986839,9.226075636519454,18.455009612351205,0-5.382318388021304-1.844643459440704-16.608915163869824-9.226075636519454-18.455009612351205Zm-22.20090692323538-57.670072210337821c10.47584631801692,5.895684856723165,32.043292882559399,18.608007133540013,34.50281749514761,22.300152391737356m0,0c.25739236433219,3.075834935390958,2.768388903972664,9.534939927903906,10.76613140385416,10.764680414813483,0-3.075834935392777-2.153518660517875-9.534939927903906-10.76613140385416-10.764680414813483Zm-45.366907023842941-39.985854160097006c-2.819435353034351,1.025292858053945-8.150740021072124,7.84332671872653-6.920410410792101,26.913206574534343m0,0c-1.794164314364025,4.101084154677665-2.921964638839199,14.917258315927029,6.920410410792101,25.374547247780356,1.025281948361226-6.663596260134,1.076612049417236-21.068971825478002-6.920410410792101-25.374547247780356ZM33.890904521841549,403.999635035310348c2.56319668863398,12.047354727508718,17.531823289536987,43.060249016140006,56.90149258828751,70.742763434669541-6.407774891455119,1.281234233345458-21.530266334064436,1.999048330902951-30.757476578555725-5.38236202679218-11.534162813879448-9.227504806176512-26.144016009731786-26.913206574534343-26.144016009731786-65.360401407877362Zm6.920554964210169,80.738136005487831c-1.281670621025114,15.63511605225176-6.766690122502041,49.828229209728306-21.530263606640801,39.985810521329768-4.101111428908553-2.563908546038874-10.303827748753974-8.920026045680061-2.306802561124641-13.841955429554218,7.176657257461557-3.331776310686109,21.376401492361765-17.531220529053826,23.837066167765443-26.143855091775549Zm-1.537917467694569-9.99537257081829c12.303050634729516,19.478818752288134,44.906021628707094,61.053342267457992,76.893838727235561,71.510587560542263-18.967208744004893-1.537175608636971-60.899930177971328-17.993093251317987-76.893838727235561-71.510587560542263Zm4.613610577091094,23.068020156380953c3.075829480545508,31.526217118564091,1.230329610280023,99.193145617840855-30.757480669692086,117.646715150842283,7.689299595353077,1.794557063278262,25.374982271750923-.153041159957866,34.602197971087662-22.298755951156636s1.281528795030681-72.793261873239317-3.844717301395576-95.347959199685647Zm24.606095814611763,72.279939043304694c7.689298231642169,16.148482520953621,34.755911440817727,48.135132282435734,81.507869327471781,46.905391795524338-3.845142779386151,3.075834935392777-14.302409891855859,8.765632083910532-25.375409113452406,6.920977714777109-10.856507292724928-.769307843993374-37.282083362086269-12.610774863294864-56.132460214019375-53.826369510301447Z"/>
  </g>
  <circle class="cls-12" cx="456.018677719877815" cy="407.075469970703125" r="406.000016364537032"/>
  <path class="cls-14" d="m805.116462364491781,339.408563290811799c39.369587476059678,27.682492599144098,54.33829589965535,58.695386887775385,56.900764366346266,70.742741615284103,0-38.447194833343019-14.609823194201454-56.132896601701759-26.143811453006492-65.360401407877362-9.227504806176512-7.381410357694222-24.349298028493649-6.6635744407522-30.756952913339774-5.382340207406742Z"/>
  <path class="cls-1" d="m882.778807073355892,325.568026121222829c-.769351482760612-4.613032363414277.614870243454789-13.994974770129375,12.30333974156747-14.609845013584163.255897736524275,3.845142779386151-1.8460944484832,12.148902141030703-12.30333974156747,14.609845013584163Z"/>
  <path class="cls-5" d="m876.627137202572158,289.427336559894684c-14.762907992924738-9.842375049630391-20.248213873817804,24.350716288459807-21.530844547743982,39.985832340712477,2.460964691936169-8.612612743336285,16.660408910305705-22.81207878108944,23.837328000376147-26.143855091772821,7.997764319265116-4.921907564490539,1.7946007020455-11.278068702898963-2.306483452632165-13.841977248939656Z"/>
  <path class="cls-22" d="m856.634908342814924,339.408563290811799c-12.303339741569289-19.478840571672663-44.906299825854148-61.053364086841611-76.894389666684219-71.51063119931132,18.968376081053066,1.53719742802059,60.900344746269184,17.993136890086134,76.894389666684219,71.51063119931132Z"/>
  <path class="cls-6" d="m882.778807073355892,198.693827983586743c-31.988089840830071,18.453569533003247-33.832787848730732,86.120476212894573-30.756952913337955,117.646693331458664-5.126333373962552-22.554675507063621-13.072603946793606-73.202266227870496-3.845099140618913-95.347981019070176,9.227504806176512-22.14571479119877,26.913162935767104-24.093313014434898,34.602052053956868-22.298712312388488Z"/>
  <path class="cls-15" d="m745.907730827399973,197.155190476216376c46.750997833754809-1.229762306294106,73.818642008827737,30.758327534535965,81.507443849479387,46.905391795524338-18.851075072223466-41.215594647006583-45.27661841250665-53.057061666308982-56.132896601699031-53.826369510302357-11.072115536542697-1.844654369131604-21.529360829628786,3.845142779386151-25.374547247780356,6.920977714778019Z"/>
  <path class="cls-20" d="m731.297907633200339,65.66695628350044c-5.638303402081874,1.025276493515776-16.916350285597218.615164805140012-16.916350285597218-9.2273575253339,2.653978963533518-.600867653719433,8.213645305380851-.746724781467492,10.397154709322422,3.080695203196228-.859378261489837-2.109470778899777-1.338401019644152-5.98765356063268,1.90614139347781-9.2320759671411,3.075834935390958.256246846668546,8.303759361644552,3.690857914535627,4.613054182796986,15.378738289278772,17.955956659609001,14.232915153551403,33.000509262274136,33.434922289671704,45.268065213947921,53.825660380319277-10.475835408324201-5.895281198118937-32.042376468429211-18.608301695227055-34.50334116036538-22.299301435758025-8.611238122141003-1.230187784283771-10.76472405358254-7.6892927767949-10.76472405358254-10.765127712187677,7.996280601148101,1.230335065126383,10.508739039520151,7.689445512483871,10.76472405358254,10.765127712187677,2.460964691936169,3.69099974053097,24.027505752041179,16.404020237639088,34.50334116036538,22.299301435758025-12.267555951673785-20.390738090647574-27.31210855433892-39.592745226767875-45.268065213947921-53.825660380319277Z"/>
  <path class="cls-21" d="m754.365971428350349,61.822233527258504c0-5.382634769091965-1.8460944484832-16.60907062698243-9.227504806176512-18.454570497247005,0,5.38263749651378,1.846007170946905,16.60907062698152,9.227504806176512,18.454570497247005Z"/>
  <path class="cls-18" d="m794.350341870328521,110.265395509635709c1.794600702049138-4.101105974060374,2.922837414203968-14.9174328709978-6.919537635427332-25.374978180614562-1.025249219284888,6.664158109276286-1.076742965720769,21.068813634943581,6.919537635427332,25.374978180614562Z"/>
  <path class="cls-13" d="m862.017226730838047,384.776757658314637c.769351482758793-14.353881818906302,5.997275909012387-46.29052155206864,20.761580342517846-59.208731537091808m0,0c-.769351482760612-4.613032363414277.614870243454789-13.994974770129375,12.30333974156747-14.609845013584163.255897736524275,3.845142779386151-1.8460944484832,12.148902141030703-12.30333974156747,14.609845013584163Zm-66.128269172520959-106.114101513234345c-4.787521977923461-22.284442435197889-17.888752956632743-63.068187832435797-40.084565053686674-99.961307944168766m-45.268065213947921-53.825660380319277c-5.638303402081874,1.025276493515776-16.916350285597218.615164805140012-16.916350285597218-9.2273575253339,2.818409841982429-.63833153618998,8.92002604568188-.763165687373657,10.764680414813483,3.844717301395576-1.025292858053945-1.794164314364934-2.153529570208775-6.305240150804821,1.538615687986749-9.996098065340448,3.075834935390958.256246846668546,8.303759361644552,3.690857914535627,4.613054182796986,15.378738289278772Zm0,0c17.955956659609001,14.233056979548564,33.000509262274136,33.434922289671704,45.268065213947921,53.825660380319277m-22.20000141879791-32.295399501098473c1.538615687986749-2.81944080788071,3.690705178845747-11.841597935607751,0-25.37498363546274m0,0c0-5.382634769091965-1.8460944484832-16.60907062698243-9.227504806176512-18.454570497247005,0,5.38263749651378,1.846007170946905,16.60907062698152,9.227504806176512,18.454570497247005Zm22.20000141879791,57.670383136561213c-10.475835408324201-5.895139372121776-32.042376468429211-18.608301695227055-34.50334116036538-22.299148700069964m0,0c-.255985014062389-3.075834935391867-2.76844345243444-9.534945382749356-10.76472405358254-10.765280447875739,0,3.075834935392777,2.153485931441537,9.534939927903906,10.76472405358254,10.765280447875739Zm45.368172548118309,39.984686823048833c2.818453480749668-1.025281948362135,8.150761840457562-7.843163073347569,6.919537635427332-26.912759277162877m0,0c1.794600702049138-4.101105974060374,2.922837414203968-14.9174328709978-6.919537635427332-25.374978180614562-1.025249219284888,6.664158109276286-1.076742965720769,21.068813634943581,6.919537635427332,25.374978180614562Zm67.666884860509526,299.885909396460193c-2.562468466690916-12.047354727508718-17.531176890286588-43.060249016140006-56.900764366346266-70.742741615284103,6.407654884846124-1.281234233345458,21.529448107163262-1.99907015028748,30.756952913339774,5.382340207406742,11.533988258805039,9.227504806175602,26.143811453006492,26.913206574534343,26.143811453006492,65.360401407877362Zm-6.920934076009871-80.738136005488741c1.282630673926178-15.63511605225267,6.767936554819244-49.828207390342868,21.530844547743982-39.985832340712477,4.101084154677665,2.563908546040693,10.30424777189728,8.920069684449118,2.306483452632165,13.841977248939656-7.176919090070442,3.331776310683381-21.376363308439977,17.531242348436535-23.837328000376147,26.143855091772821Zm1.538615687986749,9.995394390204638c-12.303339741569289-19.478840571672663-44.906299825854148-61.053364086841611-76.894389666684219-71.51063119931132,18.966892362936051,1.53719742802059,60.900344746269184,17.993136890086134,76.894389666684219,71.51063119931132Zm-4.613054182796986-23.068041975766391c-3.075834935392777-31.526217118564091-1.231136927492116-99.193123798455417,30.756952913337955-117.646693331458664-7.688889118189763-1.794600702046409-25.374547247780356.152997521189718-34.602052053956868,22.298712312388488-9.227504806174693,22.14571479119968-1.281234233343639,72.793305512006555,3.845099140618913,95.347981019070176Zm-24.606679483138578-72.279939043304694c-7.688801840651649-16.147064260988373-34.756446015724578-48.135154101818443-81.507443849479387-46.905391795524338,3.84518641815157-3.075834935391867,14.302431711237659-8.765632083909622,25.374547247780356-6.920977714778019,10.856278189192381.769307843993374,37.281821529475565,12.610774863295774,56.132896601699031,53.826369510302357Z"/>
  <path class="cls-26" d="m366.676493079306056,585.576752800008762v-29.70015286466878c0-.417535733811746-.243067938683453-.626303600714891-.73212761351715-.626303600714891h-2.456644453888657v-.942335559770072h10.666013159991053v.942335559770072h-2.456644453888657c-.489059674831879,0-.732171252284388.208767866903145-.732171252284388.626303600714891v29.70015286466878c0,.48761959548392.24311157745251.732171252284388.732171252284388.732171252284388h2.456644453888657v.940895480420295h-10.666013159991053v-.940895480420295h2.456644453888657c.489059674833697,0,.73212761351715-.244551656800468.73212761351715-.732171252284388Zm35.787499191177631,1.673066732704683l-19.660443305392619-29.176793118058413v27.50372638535373c0,.48761959548392.243067938681634.732171252284388.732127613515331.732171252284388h2.456644453888657v.940895480420295h-8.156434880316738v-.940895480420295h2.458084533238434c.48761959548392,0,.732127613515331-.244551656800468.732127613515331-.732171252284388v-29.70015286466878c0-.417535733811746-.244508018031411-.626303600714891-.732127613515331-.626303600714891h-2.458084533238434v-.942335559770072h7.686008959490209l16.8362731460129,24.889764172225114v-23.215300998939711c0-.489059674833697-.243067938681634-.732127613515331-.730687534165554-.732127613515331h-2.458084533238434v-.942335559770072h8.156434880316738v.942335559770072h-2.456644453888657c-.489059674833697,0-.73212761351715.208767866903145-.73212761351715.626303600714891v31.373219597373463h-1.673066732704683Zm19.393068572842822.627743680064668c-2.300810412769351,0-4.601620825538703-.627743680064668-6.902431238306235-1.883231040192186-.766427685295639-.38323566202962-1.288390991325286-.574853493046248-1.568639160484963-.574853493046248-.521919667262409,0-.800771395841366.366085626143104-.836511546969632,1.098213239658435l-.051493746435881.732127613515331h-.993829306205953v-8.732728452712763h.940939119189352c.314591879707223,2.68544251538151,1.306981106563398,4.671661048445458,2.981444279850621,5.961492119116883,1.707366804483172,1.255487360127518,3.712175452783413,1.881790960842409,6.012942226785526,1.881790960842409,2.335110484546021,0,4.095411114814851-.626303600714891,5.280858252037433-1.881790960842409,1.219747208999252-1.255530998894756,1.830340853173766-2.736936261815572,1.830340853173766-4.444303066298744,0-2.719786225929056-1.56868279925402-4.77604498189794-4.706004758991185-6.170259986023666l-6.223150173038448-2.771279972363118c-1.881834599609647-.836511546967813-3.293199639625527-1.969024858406556-4.235535199395599-3.398980013660548-.940895480422114-1.464298865799719-1.411365040017699-3.032938026284683-1.411365040017699-4.706004758989366,0-2.543878351450985.853661582859786-4.723111156112282,2.562468466690916-6.534861894047935,1.707366804484991-1.847534527831158,4.165451337721606-2.771279972361299,7.372857159134583-2.771279972361299,1.881834599609647,0,3.816559386235895.626347239482129,5.804174359880562,1.881834599609647.662087390610395.383235662031439,1.11536327554677.574853493044429,1.358474852999279.574853493044429.453275884936374,0,.697827541736842-.366085626141285.732127613515331-1.098213239656616l.052933825785658-1.045323052643653h.993785667436896v9.045923891841085h-.942335559770072c-.278851728578957-2.68404607480079-1.149663347325259-4.653070933205527-2.613962213126797-5.908601932100282-1.428515075904215-1.289787431907826-3.188772067403988-1.934724786628067-5.280814613268376-1.934724786628067-2.056258755968884,0-3.660681706349351.574853493046248-4.81034505367461,1.725956919721284-1.115406914315827,1.115363275548589-1.673066732706502,2.405194346221833-1.673066732706502,3.869449573254315,0,1.428558714673272.383235662031439,2.718346146579279,1.149663347327078,3.868053132671776.802211475189324,1.151103426675036,1.969068497173794,2.057698835318661,3.503407585880268,2.719786225929056l6.274643919474329,2.771236333594061c2.092042545864388.940895480422114,3.660681706347532,2.177836364080576,4.706004758991185,3.712175452785232,1.081019564999224,1.498598937578208,1.620132906919025,3.12017192384701,1.620132906919025,4.863278879458449,0,2.475234569128588-.992389226856176,4.618727222661619-2.980047839268082,6.430477960595454-1.986218533062129,1.813190817285431-4.635920897317192,2.719786225929056-7.947667013411774,2.719786225929056Zm41.558769919860424-.627743680064668h-10.718946985774892v-.940895480420295h3.399023652427786l-3.660681706349351-10.091203305712042h-11.5040084250777l-3.659241626997755,10.091203305712042h3.398980013658729v.940895480420295h-7.89621690574495v-.940895480420295h1.934724786626248c.48761959548392,0,.819361511079478-.244551656800468.993829306205953-.732171252284388l11.502568345727923-31.268792025153743h1.778847106739704l11.502568345726104,31.268792025153743c.174467795126475.48761959548392.506209710722032.732171252284388.993829306205953.732171252284388h1.934724786626248v.940895480420295Zm-16.680439104891775-26.77159877183658l-5.227924426253594,14.275201119904523h10.404355106069488l-5.176430679815894-14.275201119904523Zm31.080097991605726,26.77159877183658v-.940895480420295h2.458084533238434c.487619595482101,0,.732127613515331-.244551656800468.732127613515331-.732171252284388v-29.70015286466878c0-.417535733811746-.24450801803323-.626303600714891-.732127613515331-.626303600714891h-2.458084533238434v-.942335559770072h10.667453239339011v.942335559770072h-2.458084533236615c-.48761959548392,0-.732127613515331.208767866903145-.732127613515331.626303600714891v29.908964370342801h10.405751546648389c.906595408643625,0,1.394215004127545-.383235662031439,1.464298865801538-1.149706986096135l.783621359951212-6.118766239585966h1.202597173110917v2.458084533238434c0,3.067238098063171.157274120469083,5.316554764396642.470425920826528,6.745113479069914-1.11536327554677-.313195439126503-3.050088062174837-.470469559595585-5.804174359880562-.470469559595585h-15.999761599045087Zm36.975782848330709-22.588997398226638h6.640685906848375v.942335559770072h-1.934724786626248c-.314591879707223,0-.557659818390675.24311157745251-.732127613515331.73212761351715l-9.045880253072028,24.209130305145663c-.104383933452482.313195439126503-.278851728578957.783621359953031-.523359746610367,1.41136504001588l-.574853493046248,1.411408678783118c-.104383933454301.314548240939985-.261701692690622.73212761351715-.470469559595585,1.255487360127518-.208767866904964.557659818390675-.383235662031439.975239190967841-.523359746612186,1.25404728077956-.138684005230971.314591879705404-.313151800357446.680677505848507-.52191966726059,1.098213239656616-.244551656802287.523359746614005-.593443608286179,1.010979342097926-1.046719493224373,1.464298865801538-.453319523703613.487575956716682-.923789083299198.73212761351715-1.411408678783118.73212761351715-.487575956714863,0-1.01093570332705-.313151800357446-1.568639160484963-.940939119191171-.523359746610367-.593399969515303-.836511546967813-1.238337324237364-.940895480420295-1.934724786626248,3.171622031515653-1.359871293579999,5.333704800284977-3.624941555221085,6.483411786381112-6.798003666086515l.889401733984414-2.405150707452776-7.73889914650681-20.757260104470333c-.174467795126475-.489016036064641-.418975813159705-.73212761351715-.73212761351715-.73212761351715h-1.934724786626248v-.942335559770072h8.888606132601126v.942335559770072h-2.613962213126797l6.012942226785526,16.523121345657273,6.065876052571184-16.523121345657273h-2.666852400143398v-.942335559770072Zm11.149356156194699,20.026528931537541c-1.951918461285459-2.126342617642877-2.92855409283402-5.036306595236965-2.92855409283402-8.731332012133862,0-3.69498177812784.976635631548561-6.606385835071706,2.92855409283402-8.732728452712763,1.951874822514583-2.126342617642877,4.495753173967387-3.188772067403988,7.633075133704551-3.188772067403988s5.682640390539746,1.062429449761112,7.634558851823385,3.188772067403988c1.987614973642849,2.126342617641058,2.980004200499025,5.037746674584923,2.980004200499025,8.732728452712763,0,3.695025416896897-.992389226856176,6.604989394490985-2.980004200499025,8.731332012133862-1.95191846128364,2.126342617642877-4.497236892086221,3.190212146753765-7.634558851823385,3.190212146753765s-5.681200311189968-1.063869529110889-7.633075133704551-3.190212146753765Zm2.927114013482424-16.574615092093154c-1.254090919546798,1.917574750737913-1.881834599609647,4.53153696386471-1.881834599609647,7.843283079959292,0,3.311789754863639.627743680062849,5.94290200388059,1.881834599609647,7.894776826395173,1.255487360127518,1.917574750739732,2.824170159379719,2.875663905817419,4.705961120222128,2.875663905817419,1.883274678959424,0,3.451913839444387-.958089155077687,4.706004758991185-2.875663905817419,1.289831070673245-1.951874822514583,1.934724786626248-4.582987071531534,1.934724786626248-7.894776826395173,0-3.311746116094582-.644893715953003-5.925708329221379-1.934724786626248-7.843283079959292-1.254090919546798-1.951874822516402-2.822730080031761-2.92855409283402-4.706004758991185-2.92855409283402-1.881790960842409,0-3.45047376009461.976679270317618-4.705961120222128,2.92855409283402Zm41.065433645748271,3.869449573254315v13.698994825042973c0,.418975813159705.243111577450691.627743680064668.732171252284388.627743680064668h2.456644453888657v.940895480420295h-9.411965879213312v-.940895480420295h1.725956919721284c.48761959548392,0,.73212761351715-.208767866904964.73212761351715-.627743680064668v-14.3796723308933c0-1.777407027388108-.400385697921593-3.084388133951506-1.202597173110917-3.92089968091932-.76642768529382-.872295336865136-1.795997142628039-1.306981106563398-3.085828213301284-1.306981106563398-1.811750737935654,0-3.310349675513862,1.079623124418504-4.495796812736444,3.241705893189646-1.185403498453525,2.126342617642877-1.777407027389927,5.193580715706048-1.777407027389927,9.201757932958571v7.05966172000808c0,.48761959548392.243067938683453.732171252284388.730687534167373.732171252284388h1.725956919721284v.940895480420295h-9.411965879211493v-.940895480420295h2.458084533238434c.487619595482101,0,.732171252282569-.208767866904964.732171252282569-.627743680064668v-19.345895064454453c0-.489016036064641-.244551656800468-.73212761351715-.732171252282569-.73212761351715h-2.458084533238434v-.942335559770072h2.562468466689097c2.092042545866207,0,3.554901332316149-.104383933452482,4.392852958633739-.313151800357446v7.11115546644578c1.184007057872805-4.950512777024414,3.799365711580322-7.424307266801407,7.841843000611334-7.424307266801407,1.813190817285431,0,3.347529905990086.662043751843157,4.601620825536884,1.986174894294891,1.255487360127518,1.289831070671426,1.883231040192186,3.277489683083331,1.883231040192186,5.961492119116883Zm-126.824122651165453,49.772458864010332c0-1.98621853306031-.451879444355654-3.554857693547092-1.358474852999279-4.706004758989366-.872251698096079-1.149663347325259-2.109192581752723-1.724516840371507-3.712175452783413-1.724516840371507-1.568639160484963,0-2.77123633359588.400385697919774-3.60918795991347,1.202597173110917-.836511546967813.800771395839547-1.254090919546798,1.811750737935654-1.254090919546798,3.032938026282864,0,1.219747209001071.225961541562356,2.299370333421393.67923742649873,3.241705893191465-.592003528934583.52191966726059-1.394215004125726.783621359951212-2.405194346220014.783621359951212-1.25404728077956,0-1.881790960842409-.940895480420295-1.881790960842409-2.822730080029942,0-1.917574750739732.679193787731492-3.486257549991933,2.03910872007873-4.706004758991185,1.394215004127545-1.255487360127518,3.520557621770422-1.883231040190367,6.37902785292863-1.883231040190367,2.892813941703935,0,5.142130608039224.68063386707945,6.745113479069914,2.03910872007873,1.638723022157137,1.35987129357818,2.458084533236615,2.981444279848802,2.458084533236615,4.863278879460267,0,2.613962213126797-1.221187288349029,5.316554764394823-3.660681706349351,8.104984772648095-.244551656800468.278851728578957-.819361511077659.906595408641806-1.725956919721284,1.881834599609647-.870855257515359.940895480422114-1.377064968237391,1.498598937580027-1.515748973466543,1.673023093939264l-7.79039289294451,8.418180211774597h12.025884453571052c.83655518573687,0,1.32417478122079-.383235662031439,1.464298865801538-1.149706986096135l.67923742649873-4.548686999753045h1.202597173110917v2.509578279674315c0,3.067238098063171.174424156359237,5.385198546722677.523359746610367,6.953881345974878-1.185447137220763-.313195439124684-3.190255785521003-.470469559593766-6.014425944902541-.470469559593766h-14.901548359386652l11.870050412449928-13.072647585562663c2.509578279674315-2.788430008253272,3.763669199221113-5.994395750314652,3.763669199221113-9.620733746118276Zm19.603232880328505,23.321125011743788c-3.207362182643919,0-5.821324395768897-1.359871293579999-7.843283079959292-4.078217440157459-1.987658612411906-2.754086297705726-2.980047839268082-6.536345612164951-2.980047839268082-11.34669066583956,0-4.846128843571933.992389226856176-8.628344519260281,2.980047839268082-11.34669066583956,2.021958684190395-2.754129936474783,4.635920897315373-4.131151265943117,7.843283079959292-4.131151265943117,3.20596574206138,0,5.821368034537954,1.377021329468334,7.843326718728349,4.131151265943117,2.020518604840618,2.718346146579279,3.031497946936724,6.500561822267628,3.031497946936724,11.34669066583956,0,4.81034505367461-1.010979342096107,8.592604368133834-3.031497946936724,11.34669066583956-2.021958684190395,2.71834614657746-4.637360976666969,4.078217440157459-7.843326718728349,4.078217440157459Zm-4.863278879458449-25.882197037852166c-1.289831070675064,2.579662141348308-1.934724786628067,6.064435973221407-1.934724786628067,10.457288931855146,0,4.391369240514905.644893715953003,7.877626790505019,1.934724786628067,10.457245293086089,1.324131142451733,2.579662141346489,2.945704128720536,3.869449573252496,4.863278879458449,3.869449573252496,1.916134671388136,0,3.537707657658757-1.289787431906007,4.86183880011049-3.869449573252496,1.325571221801511-2.57961850258107,1.987658612411906-6.065876052571184,1.987658612411906-10.457245293086089,0-4.392852958633739-.662087390610395-7.877626790506838-1.987658612411906-10.457288931855146-1.324131142451733-2.579618502579251-2.945704128722355-3.869449573252496-4.86183880011049-3.869449573252496-1.917574750737913,0-3.539147737006715,1.289831070673245-4.863278879458449,3.869449573252496Zm33.668313331514582,2.561072026108377c0-1.98621853306031-.453319523705431-3.554857693547092-1.359914932349056-4.706004758989366-.872251698096079-1.149663347325259-2.109148942983666-1.724516840371507-3.712131814016175-1.724516840371507-1.568682799252201,0-2.771279972363118.400385697919774-3.60779151933275,1.202597173110917-.836511546967813.800771395839547-1.255487360125699,1.811750737935654-1.255487360125699,3.032938026282864,0,1.219747209001071.225917902793299,2.299370333421393.679193787729673,3.241705893191465-.591959890167345.52191966726059-1.394171365358488.783621359951212-2.405150707452776.783621359951212-1.254090919544979,0-1.881834599609647-.940895480420295-1.881834599609647-2.822730080029942,0-1.917574750739732.67923742649873-3.486257549991933,2.03910872007873-4.706004758991185,1.394215004125726-1.255487360127518,3.520557621768603-1.883231040190367,6.37902785292863-1.883231040190367,2.892813941703935,0,5.142130608037405.68063386707945,6.745113479068095,2.03910872007873,1.638723022158956,1.35987129357818,2.458084533238434,2.981444279848802,2.458084533238434,4.863278879460267,0,2.613962213126797-1.219747208999252,5.316554764394823-3.660681706347532,8.104984772648095-.24450801803323.278851728578957-.819361511079478.906595408641806-1.725956919723103,1.881834599609647-.870855257515359.940895480422114-1.375624888887614,1.498598937580027-1.515748973468362,1.673023093939264l-7.790392892942691,8.418180211774597h12.025928092340109c.836511546967813,0,1.324131142451733-.383235662031439,1.464255227030662-1.149706986096135l.679237426500549-4.548686999753045h1.202597173109098v2.509578279674315c0,3.067238098063171.174467795126475,5.385198546722677.523359746612186,6.953881345974878-1.185447137220763-.313195439124684-3.190212146753765-.470469559593766-6.012942226785526-.470469559593766h-14.903032077503667l11.870094051218985-13.072647585562663c2.509534640905258-2.788430008253272,3.765065639801833-5.994395750314652,3.765065639801833-9.620733746118276Zm24.09902969306313-7.581625026035908h1.724516840373326v21.648101917806343h4.392809319866501v1.620132906919025h-4.392809319866501v5.385198546720858c0,.418975813159705.261701692690622.627743680062849.785061439300989.627743680062849h3.607747880565512v.993829306207772h-12.602178025968897v-.993829306207772h3.60779151933275c.489016036064641,0,.73212761351715-.243067938681634.73212761351715-.732127613515331v-5.280814613268376h-14.431122438561943l16.576055171441112-23.268234824725369Zm-13.596007332171212,21.648101917806343h11.451074599292042v-16.052695424830745l-11.451074599292042,16.052695424830745Z"/>
</svg>