[
  ["Strict-Transport-Security", "max-age=31536000"],
  ["Content-Security-Policy", [
    "default-src 'self'",
    "object-src 'none'",
    "base-uri 'none'",
    "form-action 'self'",
    "connect-src 'self' http://getto.workstation:12081 ws://getto.workstation:12080",
    "img-src 'self' data:",
    "font-src 'self' https://fonts.gstatic.com/ https://use.fontawesome.com/",
    "script-src 'self'",
    "style-src 'self' https://use.fontawesome.com/ https://css.getto.systems/ 'sha256-OlnaRV41aq4G4QB8aZszLJlkNcDuCDMAjy+fGE1iAOc='"
  ]],
  ["X-Content-Type-Options", "nosniff"],
  ["X-Frame-Options", "DENY"],
  ["X-XSS-Protection", "1; mode=block"],
  ["Referrer-Policy", "same-origin"]
]
