{
    "title": "月配列俺式 (@shun-fix9)",
    "rules": [
        {
            "description": "月配列俺式-親指改",
            "manipulators": [
                {
                    "type": "basic",
                    "from": {"pointing_button": "button2"},
                    "to": [{"pointing_button": "button1"}]
                },

                {
                    "type": "basic",
                    "conditions": [
                        {"type": "input_source_if","input_sources": [{"language": "ja"}]},
                        {"type": "variable_if","name": "space_shift","value": 0},
                        {"type": "variable_if","name": "d_shift","value": 0},
                        {"type": "variable_if","name": "k_shift","value": 0}
                    ],
                    "from": {"key_code": "spacebar"},
                    "to": [
                        {"set_variable": {"name":"space_shift", "value": 1}}
                    ],
                    "to_after_key_up": [
                        {"set_variable": {"name":"space_shift", "value": 0}}
                    ]
                },

                {
                    "type": "basic",
                    "conditions": [
                        {"type": "input_source_if","input_sources": [{"language": "ja"}]},
                        {"type": "variable_if","name": "d_shift","value": 0},
                        {"type": "variable_if","name": "k_shift","value": 0},
                        {"type": "variable_if","name": "space_shift","value": 0}
                    ],
                    "from": {"key_code": "q"},
                    "to": [{"key_code": "s"},{"key_code": "o", "repeat": false}]
                },
                {
                    "type": "basic",
                    "conditions": [
                        {"type": "input_source_if","input_sources": [{"language": "ja"}]},
                        {"type": "variable_if","name": "d_shift","value": 0},
                        {"type": "variable_if","name": "k_shift","value": 0},
                        {"type": "variable_if","name": "space_shift","value": 0}
                    ],
                    "from": {"key_code": "w"},
                    "to": [{"key_code": "k"},{"key_code": "o", "repeat": false}]
                },
                {
                    "type": "basic",
                    "conditions": [
                        {"type": "input_source_if","input_sources": [{"language": "ja"}]},
                        {"type": "variable_if","name": "d_shift","value": 0},
                        {"type": "variable_if","name": "k_shift","value": 0},
                        {"type": "variable_if","name": "space_shift","value": 0}
                    ],
                    "from": {"key_code": "e"},
                    "to": [{"key_code": "s"},{"key_code": "i", "repeat": false}]
                },
                {
                    "type": "basic",
                    "conditions": [
                        {"type": "input_source_if","input_sources": [{"language": "ja"}]},
                        {"type": "variable_if","name": "d_shift","value": 0},
                        {"type": "variable_if","name": "k_shift","value": 0},
                        {"type": "variable_if","name": "space_shift","value": 0}
                    ],
                    "from": {"key_code": "r"},
                    "to": [{"key_code": "t"},{"key_code": "e", "repeat": false}]
                },
                {
                    "type": "basic",
                    "conditions": [
                        {"type": "input_source_if","input_sources": [{"language": "ja"}]},
                        {"type": "variable_if","name": "d_shift","value": 0},
                        {"type": "variable_if","name": "k_shift","value": 0},
                        {"type": "variable_if","name": "space_shift","value": 0}
                    ],
                    "from": {"key_code": "t"},
                    "to": [{"key_code": "y"},{"key_code": "o", "repeat": false}]
                },
                {
                    "type": "basic",
                    "conditions": [
                        {"type": "input_source_if","input_sources": [{"language": "ja"}]},
                        {"type": "variable_if","name": "d_shift","value": 0},
                        {"type": "variable_if","name": "k_shift","value": 0},
                        {"type": "variable_if","name": "space_shift","value": 0}
                    ],
                    "from": {"key_code": "y"},
                    "to": [{"key_code": "t"},{"key_code": "u", "repeat": false}]
                },
                {
                    "type": "basic",
                    "conditions": [
                        {"type": "input_source_if","input_sources": [{"language": "ja"}]},
                        {"type": "variable_if","name": "d_shift","value": 0},
                        {"type": "variable_if","name": "k_shift","value": 0},
                        {"type": "variable_if","name": "space_shift","value": 0}
                    ],
                    "from": {"key_code": "u"},
                    "to": [{"key_code": "n"},{"key_code": "n", "repeat": false}]
                },
                {
                    "type": "basic",
                    "conditions": [
                        {"type": "input_source_if","input_sources": [{"language": "ja"}]},
                        {"type": "variable_if","name": "d_shift","value": 0},
                        {"type": "variable_if","name": "k_shift","value": 0},
                        {"type": "variable_if","name": "space_shift","value": 0}
                    ],
                    "from": {"key_code": "i"},
                    "to": [{"key_code": "i", "repeat": false}]
                },
                {
                    "type": "basic",
                    "conditions": [
                        {"type": "input_source_if","input_sources": [{"language": "ja"}]},
                        {"type": "variable_if","name": "d_shift","value": 0},
                        {"type": "variable_if","name": "k_shift","value": 0},
                        {"type": "variable_if","name": "space_shift","value": 0}
                    ],
                    "from": {"key_code": "o"},
                    "to": [{"key_code": "n"},{"key_code": "o", "repeat": false}]
                },
                {
                    "type": "basic",
                    "conditions": [
                        {"type": "input_source_if","input_sources": [{"language": "ja"}]},
                        {"type": "variable_if","name": "d_shift","value": 0},
                        {"type": "variable_if","name": "k_shift","value": 0},
                        {"type": "variable_if","name": "space_shift","value": 0}
                    ],
                    "from": {"key_code": "p"},
                    "to": [{"key_code": "r"},{"key_code": "i", "repeat": false}]
                },
                {
                    "type": "basic",
                    "conditions": [
                        {"type": "input_source_if","input_sources": [{"language": "ja"}]},
                        {"type": "variable_if","name": "d_shift","value": 0},
                        {"type": "variable_if","name": "k_shift","value": 0},
                        {"type": "variable_if","name": "space_shift","value": 0}
                    ],
                    "from": {"key_code": "open_bracket"},
                    "to": [{"key_code": "t"},{"key_code": "i", "repeat": false}]
                },
                {
                    "type": "basic",
                    "conditions": [
                        {"type": "input_source_if","input_sources": [{"language": "ja"}]},
                        {"type": "variable_if","name": "d_shift","value": 0},
                        {"type": "variable_if","name": "k_shift","value": 0},
                        {"type": "variable_if","name": "space_shift","value": 0}
                    ],
                    "from": {"key_code": "close_bracket"},
                    "to": [{"key_code": "d"},{"key_code": "i", "repeat": false}]
                },

                {
                    "type": "basic",
                    "conditions": [
                        {"type": "input_source_if","input_sources": [{"language": "ja"}]},
                        {"type": "variable_if","name": "d_shift","value": 0},
                        {"type": "variable_if","name": "k_shift","value": 0},
                        {"type": "variable_if","name": "space_shift","value": 0}
                    ],
                    "from": {"key_code": "open_bracket", "modifiers": {"mandatory": ["shift"]}},
                    "to": [{"key_code": "open_bracket", "repeat": false}]
                },
                {
                    "type": "basic",
                    "conditions": [
                        {"type": "input_source_if","input_sources": [{"language": "ja"}]},
                        {"type": "variable_if","name": "d_shift","value": 0},
                        {"type": "variable_if","name": "k_shift","value": 0},
                        {"type": "variable_if","name": "space_shift","value": 0}
                    ],
                    "from": {"key_code": "close_bracket", "modifiers": {"mandatory": ["shift"]}},
                    "to": [{"key_code": "close_bracket", "repeat": false}]
                },

                {
                    "type": "basic",
                    "conditions": [
                        {"type": "input_source_if","input_sources": [{"language": "ja"}]},
                        {"type": "variable_if","name": "d_shift","value": 0},
                        {"type": "variable_if","name": "k_shift","value": 0},
                        {"type": "variable_if","name": "space_shift","value": 0}
                    ],
                    "from": {"key_code": "a"},
                    "to": [{"key_code": "h"},{"key_code": "a", "repeat": false}]
                },
                {
                    "type": "basic",
                    "conditions": [
                        {"type": "input_source_if","input_sources": [{"language": "ja"}]},
                        {"type": "variable_if","name": "d_shift","value": 0},
                        {"type": "variable_if","name": "k_shift","value": 0},
                        {"type": "variable_if","name": "space_shift","value": 0}
                    ],
                    "from": {"key_code": "s"},
                    "to": [{"key_code": "k"},{"key_code": "a", "repeat": false}]
                },
                {
                    "type": "basic",
                    "conditions": [
                        {"type": "input_source_if","input_sources": [{"language": "ja"}]},
                        {"type": "variable_if","name": "d_shift","value": 0},
                        {"type": "variable_if","name": "k_shift","value": 0},
                        {"type": "variable_if","name": "space_shift","value": 0}
                    ],
                    "from": {"key_code": "d"},
                    "to": [
                        {"set_variable": {"name":"d_shift", "value": 1}}
                    ],
                    "to_after_key_up": [
                        {"set_variable": {"name":"d_shift", "value": 0}}
                    ]
                },
                {
                    "type": "basic",
                    "conditions": [
                        {"type": "input_source_if","input_sources": [{"language": "ja"}]},
                        {"type": "variable_if","name": "d_shift","value": 0},
                        {"type": "variable_if","name": "k_shift","value": 0},
                        {"type": "variable_if","name": "space_shift","value": 0}
                    ],
                    "from": {"key_code": "f"},
                    "to": [{"key_code": "t"},{"key_code": "o", "repeat": false}]
                },
                {
                    "type": "basic",
                    "conditions": [
                        {"type": "input_source_if","input_sources": [{"language": "ja"}]},
                        {"type": "variable_if","name": "d_shift","value": 0},
                        {"type": "variable_if","name": "k_shift","value": 0},
                        {"type": "variable_if","name": "space_shift","value": 0}
                    ],
                    "from": {"key_code": "g"},
                    "to": [{"key_code": "t"},{"key_code": "a", "repeat": false}]
                },
                {
                    "type": "basic",
                    "conditions": [
                        {"type": "input_source_if","input_sources": [{"language": "ja"}]},
                        {"type": "variable_if","name": "d_shift","value": 0},
                        {"type": "variable_if","name": "k_shift","value": 0},
                        {"type": "variable_if","name": "space_shift","value": 0}
                    ],
                    "from": {"key_code": "h"},
                    "to": [{"key_code": "k"},{"key_code": "u", "repeat": false}]
                },
                {
                    "type": "basic",
                    "conditions": [
                        {"type": "input_source_if","input_sources": [{"language": "ja"}]},
                        {"type": "variable_if","name": "d_shift","value": 0},
                        {"type": "variable_if","name": "k_shift","value": 0},
                        {"type": "variable_if","name": "space_shift","value": 0}
                    ],
                    "from": {"key_code": "j"},
                    "to": [{"key_code": "u", "repeat": false}]
                },
                {
                    "type": "basic",
                    "conditions": [
                        {"type": "input_source_if","input_sources": [{"language": "ja"}]},
                        {"type": "variable_if","name": "d_shift","value": 0},
                        {"type": "variable_if","name": "k_shift","value": 0},
                        {"type": "variable_if","name": "space_shift","value": 0}
                    ],
                    "from": {"key_code": "k"},
                    "to": [
                        {"set_variable": {"name":"k_shift", "value": 1}}
                    ],
                    "to_after_key_up": [
                        {"set_variable": {"name":"k_shift", "value": 0}}
                    ]
                },
                {
                    "type": "basic",
                    "conditions": [
                        {"type": "input_source_if","input_sources": [{"language": "ja"}]},
                        {"type": "variable_if","name": "d_shift","value": 0},
                        {"type": "variable_if","name": "k_shift","value": 0},
                        {"type": "variable_if","name": "space_shift","value": 0}
                    ],
                    "from": {"key_code": "l"},
                    "to": [{"key_code": "k"},{"key_code": "i", "repeat": false}]
                },
                {
                    "type": "basic",
                    "conditions": [
                        {"type": "input_source_if","input_sources": [{"language": "ja"}]},
                        {"type": "variable_if","name": "d_shift","value": 0},
                        {"type": "variable_if","name": "k_shift","value": 0},
                        {"type": "variable_if","name": "space_shift","value": 0}
                    ],
                    "from": {"key_code": "semicolon"},
                    "to": [{"key_code": "r"},{"key_code": "e", "repeat": false}]
                },
                {
                    "type": "basic",
                    "conditions": [
                        {"type": "input_source_if","input_sources": [{"language": "ja"}]},
                        {"type": "variable_if","name": "d_shift","value": 0},
                        {"type": "variable_if","name": "k_shift","value": 0},
                        {"type": "variable_if","name": "space_shift","value": 0}
                    ],
                    "from": {"key_code": "quote"},
                    "to": [{"key_code": "b"},{"key_code": "u", "repeat": false}]
                },

                {
                    "type": "basic",
                    "conditions": [
                        {"type": "input_source_if","input_sources": [{"language": "ja"}]},
                        {"type": "variable_if","name": "d_shift","value": 0},
                        {"type": "variable_if","name": "k_shift","value": 0},
                        {"type": "variable_if","name": "space_shift","value": 0}
                    ],
                    "from": {"key_code": "z"},
                    "to": [{"key_code": "s"},{"key_code": "u", "repeat": false}]
                },
                {
                    "type": "basic",
                    "conditions": [
                        {"type": "input_source_if","input_sources": [{"language": "ja"}]},
                        {"type": "variable_if","name": "d_shift","value": 0},
                        {"type": "variable_if","name": "k_shift","value": 0},
                        {"type": "variable_if","name": "space_shift","value": 0}
                    ],
                    "from": {"key_code": "x"},
                    "to": [{"key_code": "k"},{"key_code": "e", "repeat": false}]
                },
                {
                    "type": "basic",
                    "conditions": [
                        {"type": "input_source_if","input_sources": [{"language": "ja"}]},
                        {"type": "variable_if","name": "d_shift","value": 0},
                        {"type": "variable_if","name": "k_shift","value": 0},
                        {"type": "variable_if","name": "space_shift","value": 0}
                    ],
                    "from": {"key_code": "c"},
                    "to": [{"key_code": "n"},{"key_code": "i", "repeat": false}]
                },
                {
                    "type": "basic",
                    "conditions": [
                        {"type": "input_source_if","input_sources": [{"language": "ja"}]},
                        {"type": "variable_if","name": "d_shift","value": 0},
                        {"type": "variable_if","name": "k_shift","value": 0},
                        {"type": "variable_if","name": "space_shift","value": 0}
                    ],
                    "from": {"key_code": "v"},
                    "to": [{"key_code": "n"},{"key_code": "a", "repeat": false}]
                },
                {
                    "type": "basic",
                    "conditions": [
                        {"type": "input_source_if","input_sources": [{"language": "ja"}]},
                        {"type": "variable_if","name": "d_shift","value": 0},
                        {"type": "variable_if","name": "k_shift","value": 0},
                        {"type": "variable_if","name": "space_shift","value": 0}
                    ],
                    "from": {"key_code": "b"},
                    "to": [{"key_code": "s"},{"key_code": "a", "repeat": false}]
                },
                {
                    "type": "basic",
                    "conditions": [
                        {"type": "input_source_if","input_sources": [{"language": "ja"}]},
                        {"type": "variable_if","name": "d_shift","value": 0},
                        {"type": "variable_if","name": "k_shift","value": 0},
                        {"type": "variable_if","name": "space_shift","value": 0}
                    ],
                    "from": {"key_code": "n"},
                    "to": [{"key_code": "l"},{"key_code": "t"},{"key_code": "u", "repeat": false}]
                },
                {
                    "type": "basic",
                    "conditions": [
                        {"type": "input_source_if","input_sources": [{"language": "ja"}]},
                        {"type": "variable_if","name": "d_shift","value": 0},
                        {"type": "variable_if","name": "k_shift","value": 0},
                        {"type": "variable_if","name": "space_shift","value": 0}
                    ],
                    "from": {"key_code": "m"},
                    "to": [{"key_code": "r"},{"key_code": "u", "repeat": false}]
                },
                {
                    "type": "basic",
                    "conditions": [
                        {"type": "input_source_if","input_sources": [{"language": "ja"}]},
                        {"type": "variable_if","name": "d_shift","value": 0},
                        {"type": "variable_if","name": "k_shift","value": 0},
                        {"type": "variable_if","name": "space_shift","value": 0}
                    ],
                    "from": {"key_code": "slash"},
                    "to": [{"key_code": "g"},{"key_code": "u", "repeat": false}]
                },
                {
                    "type": "basic",
                    "conditions": [
                        {"type": "input_source_if","input_sources": [{"language": "ja"}]},
                        {"type": "variable_if","name": "d_shift","value": 0},
                        {"type": "variable_if","name": "k_shift","value": 0},
                        {"type": "variable_if","name": "space_shift","value": 0}
                    ],
                    "from": {"key_code": "hyphen"},
                    "to": [{"key_code": "slash", "repeat": false}]
                },

                {
                    "type": "basic",
                    "conditions": [
                        {"type": "input_source_if","input_sources": [{"language": "ja"}]},
                        {"type": "variable_if","name": "d_shift","value": 0},
                        {"type": "variable_if","name": "k_shift","value": 1},
                        {"type": "variable_if","name": "space_shift","value": 0}
                    ],
                    "from": {"key_code": "tab"},
                    "to": [{"key_code": "p"},{"key_code": "u", "repeat": false}]
                },
                {
                    "type": "basic",
                    "conditions": [
                        {"type": "input_source_if","input_sources": [{"language": "ja"}]},
                        {"type": "variable_if","name": "d_shift","value": 0},
                        {"type": "variable_if","name": "k_shift","value": 1},
                        {"type": "variable_if","name": "space_shift","value": 0}
                    ],
                    "from": {"key_code": "q"},
                    "to": [{"key_code": "z"},{"key_code": "o", "repeat": false}]
                },
                {
                    "type": "basic",
                    "conditions": [
                        {"type": "input_source_if","input_sources": [{"language": "ja"}]},
                        {"type": "variable_if","name": "d_shift","value": 0},
                        {"type": "variable_if","name": "k_shift","value": 1},
                        {"type": "variable_if","name": "space_shift","value": 0}
                    ],
                    "from": {"key_code": "w"},
                    "to": [{"key_code": "h"},{"key_code": "i", "repeat": false}]
                },
                {
                    "type": "basic",
                    "conditions": [
                        {"type": "input_source_if","input_sources": [{"language": "ja"}]},
                        {"type": "variable_if","name": "d_shift","value": 0},
                        {"type": "variable_if","name": "k_shift","value": 1},
                        {"type": "variable_if","name": "space_shift","value": 0}
                    ],
                    "from": {"key_code": "e"},
                    "to": [{"key_code": "h"},{"key_code": "o", "repeat": false}]
                },
                {
                    "type": "basic",
                    "conditions": [
                        {"type": "input_source_if","input_sources": [{"language": "ja"}]},
                        {"type": "variable_if","name": "d_shift","value": 0},
                        {"type": "variable_if","name": "k_shift","value": 1},
                        {"type": "variable_if","name": "space_shift","value": 0}
                    ],
                    "from": {"key_code": "r"},
                    "to": [{"key_code": "h"},{"key_code": "u", "repeat": false}]
                },
                {
                    "type": "basic",
                    "conditions": [
                        {"type": "input_source_if","input_sources": [{"language": "ja"}]},
                        {"type": "variable_if","name": "d_shift","value": 0},
                        {"type": "variable_if","name": "k_shift","value": 1},
                        {"type": "variable_if","name": "space_shift","value": 0}
                    ],
                    "from": {"key_code": "t"},
                    "to": [{"key_code": "m"},{"key_code": "e", "repeat": false}]
                },
                {
                    "type": "basic",
                    "conditions": [
                        {"type": "input_source_if","input_sources": [{"language": "ja"}]},
                        {"type": "variable_if","name": "d_shift","value": 0},
                        {"type": "variable_if","name": "k_shift","value": 1},
                        {"type": "variable_if","name": "space_shift","value": 0}
                    ],
                    "from": {"key_code": "open_bracket"},
                    "to": [{"key_code": "l"},{"key_code": "o", "repeat": false}]
                },
                {
                    "type": "basic",
                    "conditions": [
                        {"type": "input_source_if","input_sources": [{"language": "ja"}]},
                        {"type": "variable_if","name": "d_shift","value": 0},
                        {"type": "variable_if","name": "k_shift","value": 1},
                        {"type": "variable_if","name": "space_shift","value": 0}
                    ],
                    "from": {"key_code": "close_bracket"},
                    "to": [{"key_code": "v"},{"key_code": "u", "repeat": false}]
                },

                {
                    "type": "basic",
                    "conditions": [
                        {"type": "input_source_if","input_sources": [{"language": "ja"}]},
                        {"type": "variable_if","name": "d_shift","value": 0},
                        {"type": "variable_if","name": "k_shift","value": 1},
                        {"type": "variable_if","name": "space_shift","value": 0}
                    ],
                    "from": {"key_code": "left_control"},
                    "to": [{"key_code": "p"},{"key_code": "a", "repeat": false}]
                },
                {
                    "type": "basic",
                    "conditions": [
                        {"type": "input_source_if","input_sources": [{"language": "ja"}]},
                        {"type": "variable_if","name": "d_shift","value": 0},
                        {"type": "variable_if","name": "k_shift","value": 1},
                        {"type": "variable_if","name": "space_shift","value": 0}
                    ],
                    "from": {"key_code": "a"},
                    "to": [{"key_code": "d"},{"key_code": "o", "repeat": false}]
                },
                {
                    "type": "basic",
                    "conditions": [
                        {"type": "input_source_if","input_sources": [{"language": "ja"}]},
                        {"type": "variable_if","name": "d_shift","value": 0},
                        {"type": "variable_if","name": "k_shift","value": 1},
                        {"type": "variable_if","name": "space_shift","value": 0}
                    ],
                    "from": {"key_code": "s"},
                    "to": [{"key_code": "w"},{"key_code": "o", "repeat": false}]
                },
                {
                    "type": "basic",
                    "conditions": [
                        {"type": "input_source_if","input_sources": [{"language": "ja"}]},
                        {"type": "variable_if","name": "d_shift","value": 0},
                        {"type": "variable_if","name": "k_shift","value": 1},
                        {"type": "variable_if","name": "space_shift","value": 0}
                    ],
                    "from": {"key_code": "d"},
                    "to": [{"key_code": "r"},{"key_code": "a", "repeat": false}]
                },
                {
                    "type": "basic",
                    "conditions": [
                        {"type": "input_source_if","input_sources": [{"language": "ja"}]},
                        {"type": "variable_if","name": "d_shift","value": 0},
                        {"type": "variable_if","name": "k_shift","value": 1},
                        {"type": "variable_if","name": "space_shift","value": 0}
                    ],
                    "from": {"key_code": "f"},
                    "to": [{"key_code": "a", "repeat": false}]
                },
                {
                    "type": "basic",
                    "conditions": [
                        {"type": "input_source_if","input_sources": [{"language": "ja"}]},
                        {"type": "variable_if","name": "d_shift","value": 0},
                        {"type": "variable_if","name": "k_shift","value": 1},
                        {"type": "variable_if","name": "space_shift","value": 0}
                    ],
                    "from": {"key_code": "g"},
                    "to": [{"key_code": "y"},{"key_code": "o", "repeat": false}]
                },
                {
                    "type": "basic",
                    "conditions": [
                        {"type": "input_source_if","input_sources": [{"language": "ja"}]},
                        {"type": "variable_if","name": "d_shift","value": 0},
                        {"type": "variable_if","name": "k_shift","value": 1},
                        {"type": "variable_if","name": "space_shift","value": 0}
                    ],
                    "from": {"key_code": "h"},
                    "to": [{"key_code": "b"},{"key_code": "i", "repeat": false}]
                },
                {
                    "type": "basic",
                    "conditions": [
                        {"type": "input_source_if","input_sources": [{"language": "ja"}]},
                        {"type": "variable_if","name": "d_shift","value": 0},
                        {"type": "variable_if","name": "k_shift","value": 1},
                        {"type": "variable_if","name": "space_shift","value": 0}
                    ],
                    "from": {"key_code": "j"},
                    "to": [{"key_code": "b"},{"key_code": "a", "repeat": false}]
                },
                {
                    "type": "basic",
                    "conditions": [
                        {"type": "input_source_if","input_sources": [{"language": "ja"}]},
                        {"type": "variable_if","name": "d_shift","value": 0},
                        {"type": "variable_if","name": "k_shift","value": 1},
                        {"type": "variable_if","name": "space_shift","value": 0}
                    ],
                    "from": {"key_code": "l"},
                    "to": [{"key_code": "j"},{"key_code": "i", "repeat": false}]
                },
                {
                    "type": "basic",
                    "conditions": [
                        {"type": "input_source_if","input_sources": [{"language": "ja"}]},
                        {"type": "variable_if","name": "d_shift","value": 0},
                        {"type": "variable_if","name": "k_shift","value": 1},
                        {"type": "variable_if","name": "space_shift","value": 0}
                    ],
                    "from": {"key_code": "semicolon"},
                    "to": [{"key_code": "l"},{"key_code": "u", "repeat": false}]
                },
                {
                    "type": "basic",
                    "conditions": [
                        {"type": "input_source_if","input_sources": [{"language": "ja"}]},
                        {"type": "variable_if","name": "d_shift","value": 0},
                        {"type": "variable_if","name": "k_shift","value": 1},
                        {"type": "variable_if","name": "space_shift","value": 0}
                    ],
                    "from": {"key_code": "quote"},
                    "to": [{"key_code": "l"},{"key_code": "e", "repeat": false}]
                },

                {
                    "type": "basic",
                    "conditions": [
                        {"type": "input_source_if","input_sources": [{"language": "ja"}]},
                        {"type": "variable_if","name": "d_shift","value": 0},
                        {"type": "variable_if","name": "k_shift","value": 1},
                        {"type": "variable_if","name": "space_shift","value": 0}
                    ],
                    "from": {"key_code": "left_shift"},
                    "to": [{"key_code": "p"},{"key_code": "i", "repeat": false}]
                },
                {
                    "type": "basic",
                    "conditions": [
                        {"type": "input_source_if","input_sources": [{"language": "ja"}]},
                        {"type": "variable_if","name": "d_shift","value": 0},
                        {"type": "variable_if","name": "k_shift","value": 1},
                        {"type": "variable_if","name": "space_shift","value": 0}
                    ],
                    "from": {"key_code": "z"},
                    "to": [{"key_code": "z"},{"key_code": "u", "repeat": false}]
                },
                {
                    "type": "basic",
                    "conditions": [
                        {"type": "input_source_if","input_sources": [{"language": "ja"}]},
                        {"type": "variable_if","name": "d_shift","value": 0},
                        {"type": "variable_if","name": "k_shift","value": 1},
                        {"type": "variable_if","name": "space_shift","value": 0}
                    ],
                    "from": {"key_code": "x"},
                    "to": [{"key_code": "h"},{"key_code": "e", "repeat": false}]
                },
                {
                    "type": "basic",
                    "conditions": [
                        {"type": "input_source_if","input_sources": [{"language": "ja"}]},
                        {"type": "variable_if","name": "d_shift","value": 0},
                        {"type": "variable_if","name": "k_shift","value": 1},
                        {"type": "variable_if","name": "space_shift","value": 0}
                    ],
                    "from": {"key_code": "c"},
                    "to": [{"key_code": "s"},{"key_code": "e", "repeat": false}]
                },
                {
                    "type": "basic",
                    "conditions": [
                        {"type": "input_source_if","input_sources": [{"language": "ja"}]},
                        {"type": "variable_if","name": "d_shift","value": 0},
                        {"type": "variable_if","name": "k_shift","value": 1},
                        {"type": "variable_if","name": "space_shift","value": 0}
                    ],
                    "from": {"key_code": "v"},
                    "to": [{"key_code": "g"},{"key_code": "a", "repeat": false}]
                },
                {
                    "type": "basic",
                    "conditions": [
                        {"type": "input_source_if","input_sources": [{"language": "ja"}]},
                        {"type": "variable_if","name": "d_shift","value": 0},
                        {"type": "variable_if","name": "k_shift","value": 1},
                        {"type": "variable_if","name": "space_shift","value": 0}
                    ],
                    "from": {"key_code": "b"},
                    "to": [{"key_code": "z"},{"key_code": "a", "repeat": false}]
                },
                {
                    "type": "basic",
                    "conditions": [
                        {"type": "input_source_if","input_sources": [{"language": "ja"}]},
                        {"type": "variable_if","name": "d_shift","value": 0},
                        {"type": "variable_if","name": "k_shift","value": 1},
                        {"type": "variable_if","name": "space_shift","value": 0}
                    ],
                    "from": {"key_code": "n"},
                    "to": [{"key_code": "b"},{"key_code": "o", "repeat": false}]
                },
                {
                    "type": "basic",
                    "conditions": [
                        {"type": "input_source_if","input_sources": [{"language": "ja"}]},
                        {"type": "variable_if","name": "d_shift","value": 0},
                        {"type": "variable_if","name": "k_shift","value": 1},
                        {"type": "variable_if","name": "space_shift","value": 0}
                    ],
                    "from": {"key_code": "period"},
                    "to": [{"key_code": "l"},{"key_code": "a", "repeat": false}]
                },
                {
                    "type": "basic",
                    "conditions": [
                        {"type": "input_source_if","input_sources": [{"language": "ja"}]},
                        {"type": "variable_if","name": "d_shift","value": 0},
                        {"type": "variable_if","name": "k_shift","value": 1},
                        {"type": "variable_if","name": "space_shift","value": 0}
                    ],
                    "from": {"key_code": "slash"},
                    "to": [{"key_code": "l"},{"key_code": "i", "repeat": false}]
                },

                {
                    "type": "basic",
                    "conditions": [
                        {"type": "input_source_if","input_sources": [{"language": "ja"}]},
                        {"type": "variable_if","name": "d_shift","value": 1},
                        {"type": "variable_if","name": "k_shift","value": 0},
                        {"type": "variable_if","name": "space_shift","value": 0}
                    ],
                    "from": {"key_code": "tab"},
                    "to": [{"key_code": "n"},{"key_code": "y"},{"key_code": "a", "repeat": false}]
                },
                {
                    "type": "basic",
                    "conditions": [
                        {"type": "input_source_if","input_sources": [{"language": "ja"}]},
                        {"type": "variable_if","name": "d_shift","value": 1},
                        {"type": "variable_if","name": "k_shift","value": 0},
                        {"type": "variable_if","name": "space_shift","value": 0}
                    ],
                    "from": {"key_code": "t"},
                    "to": [{"key_code": "l"},{"key_code": "y"},{"key_code": "a", "repeat": false}]
                },
                {
                    "type": "basic",
                    "conditions": [
                        {"type": "input_source_if","input_sources": [{"language": "ja"}]},
                        {"type": "variable_if","name": "d_shift","value": 1},
                        {"type": "variable_if","name": "k_shift","value": 0},
                        {"type": "variable_if","name": "space_shift","value": 0}
                    ],
                    "from": {"key_code": "y"},
                    "to": [{"key_code": "n"},{"key_code": "u", "repeat": false}]
                },
                {
                    "type": "basic",
                    "conditions": [
                        {"type": "input_source_if","input_sources": [{"language": "ja"}]},
                        {"type": "variable_if","name": "d_shift","value": 1},
                        {"type": "variable_if","name": "k_shift","value": 0},
                        {"type": "variable_if","name": "space_shift","value": 0}
                    ],
                    "from": {"key_code": "u"},
                    "to": [{"key_code": "e", "repeat": false}]
                },
                {
                    "type": "basic",
                    "conditions": [
                        {"type": "input_source_if","input_sources": [{"language": "ja"}]},
                        {"type": "variable_if","name": "d_shift","value": 1},
                        {"type": "variable_if","name": "k_shift","value": 0},
                        {"type": "variable_if","name": "space_shift","value": 0}
                    ],
                    "from": {"key_code": "i"},
                    "to": [{"key_code": "m"},{"key_code": "i", "repeat": false}]
                },
                {
                    "type": "basic",
                    "conditions": [
                        {"type": "input_source_if","input_sources": [{"language": "ja"}]},
                        {"type": "variable_if","name": "d_shift","value": 1},
                        {"type": "variable_if","name": "k_shift","value": 0},
                        {"type": "variable_if","name": "space_shift","value": 0}
                    ],
                    "from": {"key_code": "o"},
                    "to": [{"key_code": "y"},{"key_code": "a", "repeat": false}]
                },
                {
                    "type": "basic",
                    "conditions": [
                        {"type": "input_source_if","input_sources": [{"language": "ja"}]},
                        {"type": "variable_if","name": "d_shift","value": 1},
                        {"type": "variable_if","name": "k_shift","value": 0},
                        {"type": "variable_if","name": "space_shift","value": 0}
                    ],
                    "from": {"key_code": "p"},
                    "to": [{"key_code": "g"},{"key_code": "i", "repeat": false}]
                },
                {
                    "type": "basic",
                    "conditions": [
                        {"type": "input_source_if","input_sources": [{"language": "ja"}]},
                        {"type": "variable_if","name": "d_shift","value": 1},
                        {"type": "variable_if","name": "k_shift","value": 0},
                        {"type": "variable_if","name": "space_shift","value": 0}
                    ],
                    "from": {"key_code": "open_bracket"},
                    "to": [{"key_code": "b"},{"key_code": "e", "repeat": false}]
                },
                {
                    "type": "basic",
                    "conditions": [
                        {"type": "input_source_if","input_sources": [{"language": "ja"}]},
                        {"type": "variable_if","name": "d_shift","value": 1},
                        {"type": "variable_if","name": "k_shift","value": 0},
                        {"type": "variable_if","name": "space_shift","value": 0}
                    ],
                    "from": {"key_code": "close_bracket"},
                    "to": [{"key_code": "d"},{"key_code": "u", "repeat": false}]
                },

                {
                    "type": "basic",
                    "conditions": [
                        {"type": "input_source_if","input_sources": [{"language": "ja"}]},
                        {"type": "variable_if","name": "d_shift","value": 1},
                        {"type": "variable_if","name": "k_shift","value": 0},
                        {"type": "variable_if","name": "space_shift","value": 0}
                    ],
                    "from": {"key_code": "left_control"},
                    "to": [{"key_code": "n"},{"key_code": "y"},{"key_code": "u", "repeat": false}]
                },
                {
                    "type": "basic",
                    "conditions": [
                        {"type": "input_source_if","input_sources": [{"language": "ja"}]},
                        {"type": "variable_if","name": "d_shift","value": 1},
                        {"type": "variable_if","name": "k_shift","value": 0},
                        {"type": "variable_if","name": "space_shift","value": 0}
                    ],
                    "from": {"key_code": "a"},
                    "to": [{"key_code": "u"},{"key_code": "l"},{"key_code": "o", "repeat": false}]
                },
                {
                    "type": "basic",
                    "conditions": [
                        {"type": "input_source_if","input_sources": [{"language": "ja"}]},
                        {"type": "variable_if","name": "d_shift","value": 1},
                        {"type": "variable_if","name": "k_shift","value": 0},
                        {"type": "variable_if","name": "space_shift","value": 0}
                    ],
                    "from": {"key_code": "s"},
                    "to": [{"key_code": "d"},{"key_code": "e", "repeat": false}]
                },
                {
                    "type": "basic",
                    "conditions": [
                        {"type": "input_source_if","input_sources": [{"language": "ja"}]},
                        {"type": "variable_if","name": "d_shift","value": 1},
                        {"type": "variable_if","name": "k_shift","value": 0},
                        {"type": "variable_if","name": "space_shift","value": 0}
                    ],
                    "from": {"key_code": "f"},
                    "to": [{"key_code": "d"},{"key_code": "a", "repeat": false}]
                },
                {
                    "type": "basic",
                    "conditions": [
                        {"type": "input_source_if","input_sources": [{"language": "ja"}]},
                        {"type": "variable_if","name": "d_shift","value": 1},
                        {"type": "variable_if","name": "k_shift","value": 0},
                        {"type": "variable_if","name": "space_shift","value": 0}
                    ],
                    "from": {"key_code": "g"},
                    "to": [{"key_code": "l"},{"key_code": "y"},{"key_code": "u", "repeat": false}]
                },
                {
                    "type": "basic",
                    "conditions": [
                        {"type": "input_source_if","input_sources": [{"language": "ja"}]},
                        {"type": "variable_if","name": "d_shift","value": 1},
                        {"type": "variable_if","name": "k_shift","value": 0},
                        {"type": "variable_if","name": "space_shift","value": 0}
                    ],
                    "from": {"key_code": "h"},
                    "to": [{"key_code": "m"},{"key_code": "a", "repeat": false}]
                },
                {
                    "type": "basic",
                    "conditions": [
                        {"type": "input_source_if","input_sources": [{"language": "ja"}]},
                        {"type": "variable_if","name": "d_shift","value": 1},
                        {"type": "variable_if","name": "k_shift","value": 0},
                        {"type": "variable_if","name": "space_shift","value": 0}
                    ],
                    "from": {"key_code": "j"},
                    "to": [{"key_code": "o", "repeat": false}]
                },
                {
                    "type": "basic",
                    "conditions": [
                        {"type": "input_source_if","input_sources": [{"language": "ja"}]},
                        {"type": "variable_if","name": "d_shift","value": 1},
                        {"type": "variable_if","name": "k_shift","value": 0},
                        {"type": "variable_if","name": "space_shift","value": 0}
                    ],
                    "from": {"key_code": "k"},
                    "to": [{"key_code": "m"},{"key_code": "o", "repeat": false}]
                },
                {
                    "type": "basic",
                    "conditions": [
                        {"type": "input_source_if","input_sources": [{"language": "ja"}]},
                        {"type": "variable_if","name": "d_shift","value": 1},
                        {"type": "variable_if","name": "k_shift","value": 0},
                        {"type": "variable_if","name": "space_shift","value": 0}
                    ],
                    "from": {"key_code": "l"},
                    "to": [{"key_code": "w"},{"key_code": "a", "repeat": false}]
                },
                {
                    "type": "basic",
                    "conditions": [
                        {"type": "input_source_if","input_sources": [{"language": "ja"}]},
                        {"type": "variable_if","name": "d_shift","value": 1},
                        {"type": "variable_if","name": "k_shift","value": 0},
                        {"type": "variable_if","name": "space_shift","value": 0}
                    ],
                    "from": {"key_code": "semicolon"},
                    "to": [{"key_code": "y"},{"key_code": "u", "repeat": false}]
                },
                {
                    "type": "basic",
                    "conditions": [
                        {"type": "input_source_if","input_sources": [{"language": "ja"}]},
                        {"type": "variable_if","name": "d_shift","value": 1},
                        {"type": "variable_if","name": "k_shift","value": 0},
                        {"type": "variable_if","name": "space_shift","value": 0}
                    ],
                    "from": {"key_code": "quote"},
                    "to": [{"key_code": "g"},{"key_code": "o", "repeat": false}]
                },
                {
                    "type": "basic",
                    "conditions": [
                        {"type": "input_source_if","input_sources": [{"language": "ja"}]},
                        {"type": "variable_if","name": "d_shift","value": 1},
                        {"type": "variable_if","name": "k_shift","value": 0},
                        {"type": "variable_if","name": "space_shift","value": 0}
                    ],
                    "from": {"key_code": "return_or_enter"},
                    "to": [{"key_code": "p"},{"key_code": "o", "repeat": false}]
                },

                {
                    "type": "basic",
                    "conditions": [
                        {"type": "input_source_if","input_sources": [{"language": "ja"}]},
                        {"type": "variable_if","name": "d_shift","value": 1},
                        {"type": "variable_if","name": "k_shift","value": 0},
                        {"type": "variable_if","name": "space_shift","value": 0}
                    ],
                    "from": {"key_code": "left_shift"},
                    "to": [{"key_code": "n"},{"key_code": "y"},{"key_code": "o", "repeat": false}]
                },
                {
                    "type": "basic",
                    "conditions": [
                        {"type": "input_source_if","input_sources": [{"language": "ja"}]},
                        {"type": "variable_if","name": "d_shift","value": 1},
                        {"type": "variable_if","name": "k_shift","value": 0},
                        {"type": "variable_if","name": "space_shift","value": 0}
                    ],
                    "from": {"key_code": "x"},
                    "to": [{"key_code": "m"},{"key_code": "y"},{"key_code": "a", "repeat": false}]
                },
                {
                    "type": "basic",
                    "conditions": [
                        {"type": "input_source_if","input_sources": [{"language": "ja"}]},
                        {"type": "variable_if","name": "d_shift","value": 1},
                        {"type": "variable_if","name": "k_shift","value": 0},
                        {"type": "variable_if","name": "space_shift","value": 0}
                    ],
                    "from": {"key_code": "c"},
                    "to": [{"key_code": "m"},{"key_code": "y"},{"key_code": "u", "repeat": false}]
                },
                {
                    "type": "basic",
                    "conditions": [
                        {"type": "input_source_if","input_sources": [{"language": "ja"}]},
                        {"type": "variable_if","name": "d_shift","value": 1},
                        {"type": "variable_if","name": "k_shift","value": 0},
                        {"type": "variable_if","name": "space_shift","value": 0}
                    ],
                    "from": {"key_code": "v"},
                    "to": [{"key_code": "m"},{"key_code": "y"},{"key_code": "o", "repeat": false}]
                },
                {
                    "type": "basic",
                    "conditions": [
                        {"type": "input_source_if","input_sources": [{"language": "ja"}]},
                        {"type": "variable_if","name": "d_shift","value": 1},
                        {"type": "variable_if","name": "k_shift","value": 0},
                        {"type": "variable_if","name": "space_shift","value": 0}
                    ],
                    "from": {"key_code": "b"},
                    "to": [{"key_code": "l"},{"key_code": "y"},{"key_code": "o", "repeat": false}]
                },
                {
                    "type": "basic",
                    "conditions": [
                        {"type": "input_source_if","input_sources": [{"language": "ja"}]},
                        {"type": "variable_if","name": "d_shift","value": 1},
                        {"type": "variable_if","name": "k_shift","value": 0},
                        {"type": "variable_if","name": "space_shift","value": 0}
                    ],
                    "from": {"key_code": "n"},
                    "to": [{"key_code": "m"},{"key_code": "u", "repeat": false}]
                },
                {
                    "type": "basic",
                    "conditions": [
                        {"type": "input_source_if","input_sources": [{"language": "ja"}]},
                        {"type": "variable_if","name": "d_shift","value": 1},
                        {"type": "variable_if","name": "k_shift","value": 0},
                        {"type": "variable_if","name": "space_shift","value": 0}
                    ],
                    "from": {"key_code": "m"},
                    "to": [{"key_code": "r"},{"key_code": "o", "repeat": false}]
                },
                {
                    "type": "basic",
                    "conditions": [
                        {"type": "input_source_if","input_sources": [{"language": "ja"}]},
                        {"type": "variable_if","name": "d_shift","value": 1},
                        {"type": "variable_if","name": "k_shift","value": 0},
                        {"type": "variable_if","name": "space_shift","value": 0}
                    ],
                    "from": {"key_code": "comma"},
                    "to": [{"key_code": "n"},{"key_code": "e", "repeat": false}]
                },
                {
                    "type": "basic",
                    "conditions": [
                        {"type": "input_source_if","input_sources": [{"language": "ja"}]},
                        {"type": "variable_if","name": "d_shift","value": 1},
                        {"type": "variable_if","name": "k_shift","value": 0},
                        {"type": "variable_if","name": "space_shift","value": 0}
                    ],
                    "from": {"key_code": "period"},
                    "to": [{"key_code": "hyphen", "repeat": false}]
                },
                {
                    "type": "basic",
                    "conditions": [
                        {"type": "input_source_if","input_sources": [{"language": "ja"}]},
                        {"type": "variable_if","name": "d_shift","value": 1},
                        {"type": "variable_if","name": "k_shift","value": 0},
                        {"type": "variable_if","name": "space_shift","value": 0}
                    ],
                    "from": {"key_code": "slash"},
                    "to": [{"key_code": "z"},{"key_code": "e", "repeat": false}]
                },
                {
                    "type": "basic",
                    "conditions": [
                        {"type": "input_source_if","input_sources": [{"language": "ja"}]},
                        {"type": "variable_if","name": "d_shift","value": 1},
                        {"type": "variable_if","name": "k_shift","value": 0},
                        {"type": "variable_if","name": "space_shift","value": 0}
                    ],
                    "from": {"key_code": "right_shift"},
                    "to": [{"key_code": "p"},{"key_code": "e", "repeat": false}]
                },

                {
                    "type": "basic",
                    "conditions": [
                        {"type": "input_source_if","input_sources": [{"language": "ja"}]},
                        {"type": "variable_if","name": "d_shift","value": 0},
                        {"type": "variable_if","name": "k_shift","value": 0},
                        {"type": "variable_if","name": "space_shift","value": 1}
                    ],
                    "from": {"key_code": "tab"},
                    "to": [{"key_code": "s"},{"key_code": "h"},{"key_code": "e", "repeat": false}]
                },
                {
                    "type": "basic",
                    "conditions": [
                        {"type": "input_source_if","input_sources": [{"language": "ja"}]},
                        {"type": "variable_if","name": "d_shift","value": 0},
                        {"type": "variable_if","name": "k_shift","value": 0},
                        {"type": "variable_if","name": "space_shift","value": 1}
                    ],
                    "from": {"key_code": "q"},
                    "to": [{"key_code": "s"},{"key_code": "h"},{"key_code": "a", "repeat": false}]
                },
                {
                    "type": "basic",
                    "conditions": [
                        {"type": "input_source_if","input_sources": [{"language": "ja"}]},
                        {"type": "variable_if","name": "d_shift","value": 0},
                        {"type": "variable_if","name": "k_shift","value": 0},
                        {"type": "variable_if","name": "space_shift","value": 1}
                    ],
                    "from": {"key_code": "w"},
                    "to": [{"key_code": "j"},{"key_code": "a", "repeat": false}]
                },
                {
                    "type": "basic",
                    "conditions": [
                        {"type": "input_source_if","input_sources": [{"language": "ja"}]},
                        {"type": "variable_if","name": "d_shift","value": 0},
                        {"type": "variable_if","name": "k_shift","value": 0},
                        {"type": "variable_if","name": "space_shift","value": 1}
                    ],
                    "from": {"key_code": "e"},
                    "to": [{"key_code": "k"},{"key_code": "y"},{"key_code": "a", "repeat": false}]
                },
                {
                    "type": "basic",
                    "conditions": [
                        {"type": "input_source_if","input_sources": [{"language": "ja"}]},
                        {"type": "variable_if","name": "d_shift","value": 0},
                        {"type": "variable_if","name": "k_shift","value": 0},
                        {"type": "variable_if","name": "space_shift","value": 1}
                    ],
                    "from": {"key_code": "r"},
                    "to": [{"key_code": "g"},{"key_code": "y"},{"key_code": "a", "repeat": false}]
                },
                {
                    "type": "basic",
                    "conditions": [
                        {"type": "input_source_if","input_sources": [{"language": "ja"}]},
                        {"type": "variable_if","name": "d_shift","value": 0},
                        {"type": "variable_if","name": "k_shift","value": 0},
                        {"type": "variable_if","name": "space_shift","value": 1}
                    ],
                    "from": {"key_code": "t"},
                    "to": [{"key_code": "h"},{"key_code": "y"},{"key_code": "a", "repeat": false}]
                },
                {
                    "type": "basic",
                    "conditions": [
                        {"type": "input_source_if","input_sources": [{"language": "ja"}]},
                        {"type": "variable_if","name": "d_shift","value": 0},
                        {"type": "variable_if","name": "k_shift","value": 0},
                        {"type": "variable_if","name": "space_shift","value": 1}
                    ],
                    "from": {"key_code": "y"},
                    "to": [{"key_code": "b"},{"key_code": "y"},{"key_code": "a", "repeat": false}]
                },
                {
                    "type": "basic",
                    "conditions": [
                        {"type": "input_source_if","input_sources": [{"language": "ja"}]},
                        {"type": "variable_if","name": "d_shift","value": 0},
                        {"type": "variable_if","name": "k_shift","value": 0},
                        {"type": "variable_if","name": "space_shift","value": 1}
                    ],
                    "from": {"key_code": "u"},
                    "to": [{"key_code": "r"},{"key_code": "y"},{"key_code": "a", "repeat": false}]
                },
                {
                    "type": "basic",
                    "conditions": [
                        {"type": "input_source_if","input_sources": [{"language": "ja"}]},
                        {"type": "variable_if","name": "d_shift","value": 0},
                        {"type": "variable_if","name": "k_shift","value": 0},
                        {"type": "variable_if","name": "space_shift","value": 1}
                    ],
                    "from": {"key_code": "i"},
                    "to": [{"key_code": "f"},{"key_code": "a", "repeat": false}]
                },
                {
                    "type": "basic",
                    "conditions": [
                        {"type": "input_source_if","input_sources": [{"language": "ja"}]},
                        {"type": "variable_if","name": "d_shift","value": 0},
                        {"type": "variable_if","name": "k_shift","value": 0},
                        {"type": "variable_if","name": "space_shift","value": 1}
                    ],
                    "from": {"key_code": "o"},
                    "to": [{"key_code": "c"},{"key_code": "h"},{"key_code": "a", "repeat": false}]
                },
                {
                    "type": "basic",
                    "conditions": [
                        {"type": "input_source_if","input_sources": [{"language": "ja"}]},
                        {"type": "variable_if","name": "d_shift","value": 0},
                        {"type": "variable_if","name": "k_shift","value": 0},
                        {"type": "variable_if","name": "space_shift","value": 1}
                    ],
                    "from": {"key_code": "p"},
                    "to": [{"key_code": "c"},{"key_code": "h"},{"key_code": "u", "repeat": false}]
                },
                {
                    "type": "basic",
                    "conditions": [
                        {"type": "input_source_if","input_sources": [{"language": "ja"}]},
                        {"type": "variable_if","name": "d_shift","value": 0},
                        {"type": "variable_if","name": "k_shift","value": 0},
                        {"type": "variable_if","name": "space_shift","value": 1}
                    ],
                    "from": {"key_code": "open_bracket"},
                    "to": [{"key_code": "c"},{"key_code": "h"},{"key_code": "e", "repeat": false}]
                },
                {
                    "type": "basic",
                    "conditions": [
                        {"type": "input_source_if","input_sources": [{"language": "ja"}]},
                        {"type": "variable_if","name": "d_shift","value": 0},
                        {"type": "variable_if","name": "k_shift","value": 0},
                        {"type": "variable_if","name": "space_shift","value": 1}
                    ],
                    "from": {"key_code": "close_bracket"},
                    "to": [{"key_code": "c"},{"key_code": "h"},{"key_code": "o", "repeat": false}]
                },

                {
                    "type": "basic",
                    "conditions": [
                        {"type": "input_source_if","input_sources": [{"language": "ja"}]},
                        {"type": "variable_if","name": "d_shift","value": 0},
                        {"type": "variable_if","name": "k_shift","value": 0},
                        {"type": "variable_if","name": "space_shift","value": 1}
                    ],
                    "from": {"key_code": "left_control"},
                    "to": [{"key_code": "j"},{"key_code": "e", "repeat": false}]
                },
                {
                    "type": "basic",
                    "conditions": [
                        {"type": "input_source_if","input_sources": [{"language": "ja"}]},
                        {"type": "variable_if","name": "d_shift","value": 0},
                        {"type": "variable_if","name": "k_shift","value": 0},
                        {"type": "variable_if","name": "space_shift","value": 1}
                    ],
                    "from": {"key_code": "a"},
                    "to": [{"key_code": "s"},{"key_code": "h"},{"key_code": "u", "repeat": false}]
                },
                {
                    "type": "basic",
                    "conditions": [
                        {"type": "input_source_if","input_sources": [{"language": "ja"}]},
                        {"type": "variable_if","name": "d_shift","value": 0},
                        {"type": "variable_if","name": "k_shift","value": 0},
                        {"type": "variable_if","name": "space_shift","value": 1}
                    ],
                    "from": {"key_code": "s"},
                    "to": [{"key_code": "j"},{"key_code": "u", "repeat": false}]
                },
                {
                    "type": "basic",
                    "conditions": [
                        {"type": "input_source_if","input_sources": [{"language": "ja"}]},
                        {"type": "variable_if","name": "d_shift","value": 0},
                        {"type": "variable_if","name": "k_shift","value": 0},
                        {"type": "variable_if","name": "space_shift","value": 1}
                    ],
                    "from": {"key_code": "d"},
                    "to": [{"key_code": "k"},{"key_code": "y"},{"key_code": "u", "repeat": false}]
                },
                {
                    "type": "basic",
                    "conditions": [
                        {"type": "input_source_if","input_sources": [{"language": "ja"}]},
                        {"type": "variable_if","name": "d_shift","value": 0},
                        {"type": "variable_if","name": "k_shift","value": 0},
                        {"type": "variable_if","name": "space_shift","value": 1}
                    ],
                    "from": {"key_code": "f"},
                    "to": [{"key_code": "g"},{"key_code": "y"},{"key_code": "u", "repeat": false}]
                },
                {
                    "type": "basic",
                    "conditions": [
                        {"type": "input_source_if","input_sources": [{"language": "ja"}]},
                        {"type": "variable_if","name": "d_shift","value": 0},
                        {"type": "variable_if","name": "k_shift","value": 0},
                        {"type": "variable_if","name": "space_shift","value": 1}
                    ],
                    "from": {"key_code": "g"},
                    "to": [{"key_code": "h"},{"key_code": "y"},{"key_code": "u", "repeat": false}]
                },
                {
                    "type": "basic",
                    "conditions": [
                        {"type": "input_source_if","input_sources": [{"language": "ja"}]},
                        {"type": "variable_if","name": "d_shift","value": 0},
                        {"type": "variable_if","name": "k_shift","value": 0},
                        {"type": "variable_if","name": "space_shift","value": 1}
                    ],
                    "from": {"key_code": "h"},
                    "to": [{"key_code": "b"},{"key_code": "y"},{"key_code": "u", "repeat": false}]
                },
                {
                    "type": "basic",
                    "conditions": [
                        {"type": "input_source_if","input_sources": [{"language": "ja"}]},
                        {"type": "variable_if","name": "d_shift","value": 0},
                        {"type": "variable_if","name": "k_shift","value": 0},
                        {"type": "variable_if","name": "space_shift","value": 1}
                    ],
                    "from": {"key_code": "j"},
                    "to": [{"key_code": "r"},{"key_code": "y"},{"key_code": "u", "repeat": false}]
                },
                {
                    "type": "basic",
                    "conditions": [
                        {"type": "input_source_if","input_sources": [{"language": "ja"}]},
                        {"type": "variable_if","name": "d_shift","value": 0},
                        {"type": "variable_if","name": "k_shift","value": 0},
                        {"type": "variable_if","name": "space_shift","value": 1}
                    ],
                    "from": {"key_code": "k"},
                    "to": [{"key_code": "f"},{"key_code": "i", "repeat": false}]
                },
                {
                    "type": "basic",
                    "conditions": [
                        {"type": "input_source_if","input_sources": [{"language": "ja"}]},
                        {"type": "variable_if","name": "d_shift","value": 0},
                        {"type": "variable_if","name": "k_shift","value": 0},
                        {"type": "variable_if","name": "space_shift","value": 1}
                    ],
                    "from": {"key_code": "l"},
                    "to": [{"key_code": "f"},{"key_code": "o", "repeat": false}]
                },
                {
                    "type": "basic",
                    "conditions": [
                        {"type": "input_source_if","input_sources": [{"language": "ja"}]},
                        {"type": "variable_if","name": "d_shift","value": 0},
                        {"type": "variable_if","name": "k_shift","value": 0},
                        {"type": "variable_if","name": "space_shift","value": 1}
                    ],
                    "from": {"key_code": "semicolon"},
                    "to": [{"key_code": "p"},{"key_code": "y"},{"key_code": "a", "repeat": false}]
                },
                {
                    "type": "basic",
                    "conditions": [
                        {"type": "input_source_if","input_sources": [{"language": "ja"}]},
                        {"type": "variable_if","name": "d_shift","value": 0},
                        {"type": "variable_if","name": "k_shift","value": 0},
                        {"type": "variable_if","name": "space_shift","value": 1}
                    ],
                    "from": {"key_code": "quote"},
                    "to": [{"key_code": "p"},{"key_code": "y"},{"key_code": "u", "repeat": false}]
                },
                {
                    "type": "basic",
                    "conditions": [
                        {"type": "input_source_if","input_sources": [{"language": "ja"}]},
                        {"type": "variable_if","name": "d_shift","value": 0},
                        {"type": "variable_if","name": "k_shift","value": 0},
                        {"type": "variable_if","name": "space_shift","value": 1}
                    ],
                    "from": {"key_code": "return_or_enter"},
                    "to": [{"key_code": "p"},{"key_code": "y"},{"key_code": "o", "repeat": false}]
                },

                {
                    "type": "basic",
                    "conditions": [
                        {"type": "input_source_if","input_sources": [{"language": "ja"}]},
                        {"type": "variable_if","name": "d_shift","value": 0},
                        {"type": "variable_if","name": "k_shift","value": 0},
                        {"type": "variable_if","name": "space_shift","value": 1}
                    ],
                    "from": {"key_code": "left_shift"},
                    "to": [{"key_code": "spacebar"}]
                },
                {
                    "type": "basic",
                    "conditions": [
                        {"type": "input_source_if","input_sources": [{"language": "ja"}]},
                        {"type": "variable_if","name": "d_shift","value": 0},
                        {"type": "variable_if","name": "k_shift","value": 0},
                        {"type": "variable_if","name": "space_shift","value": 1}
                    ],
                    "from": {"key_code": "z"},
                    "to": [{"key_code": "s"},{"key_code": "h"},{"key_code": "o", "repeat": false}]
                },
                {
                    "type": "basic",
                    "conditions": [
                        {"type": "input_source_if","input_sources": [{"language": "ja"}]},
                        {"type": "variable_if","name": "d_shift","value": 0},
                        {"type": "variable_if","name": "k_shift","value": 0},
                        {"type": "variable_if","name": "space_shift","value": 1}
                    ],
                    "from": {"key_code": "x"},
                    "to": [{"key_code": "j"},{"key_code": "o", "repeat": false}]
                },
                {
                    "type": "basic",
                    "conditions": [
                        {"type": "input_source_if","input_sources": [{"language": "ja"}]},
                        {"type": "variable_if","name": "d_shift","value": 0},
                        {"type": "variable_if","name": "k_shift","value": 0},
                        {"type": "variable_if","name": "space_shift","value": 1}
                    ],
                    "from": {"key_code": "c"},
                    "to": [{"key_code": "k"},{"key_code": "y"},{"key_code": "o", "repeat": false}]
                },
                {
                    "type": "basic",
                    "conditions": [
                        {"type": "input_source_if","input_sources": [{"language": "ja"}]},
                        {"type": "variable_if","name": "d_shift","value": 0},
                        {"type": "variable_if","name": "k_shift","value": 0},
                        {"type": "variable_if","name": "space_shift","value": 1}
                    ],
                    "from": {"key_code": "v"},
                    "to": [{"key_code": "g"},{"key_code": "y"},{"key_code": "o", "repeat": false}]
                },
                {
                    "type": "basic",
                    "conditions": [
                        {"type": "input_source_if","input_sources": [{"language": "ja"}]},
                        {"type": "variable_if","name": "d_shift","value": 0},
                        {"type": "variable_if","name": "k_shift","value": 0},
                        {"type": "variable_if","name": "space_shift","value": 1}
                    ],
                    "from": {"key_code": "b"},
                    "to": [{"key_code": "h"},{"key_code": "y"},{"key_code": "o", "repeat": false}]
                },
                {
                    "type": "basic",
                    "conditions": [
                        {"type": "input_source_if","input_sources": [{"language": "ja"}]},
                        {"type": "variable_if","name": "d_shift","value": 0},
                        {"type": "variable_if","name": "k_shift","value": 0},
                        {"type": "variable_if","name": "space_shift","value": 1}
                    ],
                    "from": {"key_code": "n"},
                    "to": [{"key_code": "b"},{"key_code": "y"},{"key_code": "o", "repeat": false}]
                },
                {
                    "type": "basic",
                    "conditions": [
                        {"type": "input_source_if","input_sources": [{"language": "ja"}]},
                        {"type": "variable_if","name": "d_shift","value": 0},
                        {"type": "variable_if","name": "k_shift","value": 0},
                        {"type": "variable_if","name": "space_shift","value": 1}
                    ],
                    "from": {"key_code": "m"},
                    "to": [{"key_code": "r"},{"key_code": "y"},{"key_code": "o", "repeat": false}]
                },
                {
                    "type": "basic",
                    "conditions": [
                        {"type": "input_source_if","input_sources": [{"language": "ja"}]},
                        {"type": "variable_if","name": "d_shift","value": 0},
                        {"type": "variable_if","name": "k_shift","value": 0},
                        {"type": "variable_if","name": "space_shift","value": 1}
                    ],
                    "from": {"key_code": "comma"},
                    "to": [{"key_code": "f"},{"key_code": "e", "repeat": false}]
                },
                {
                    "type": "basic",
                    "conditions": [
                        {"type": "input_source_if","input_sources": [{"language": "ja"}]},
                        {"type": "variable_if","name": "d_shift","value": 0},
                        {"type": "variable_if","name": "k_shift","value": 0},
                        {"type": "variable_if","name": "space_shift","value": 1}
                    ],
                    "from": {"key_code": "period"},
                    "to": [{"key_code": "t"},{"key_code": "h"},{"key_code": "i", "repeat": false}]
                },
                {
                    "type": "basic",
                    "conditions": [
                        {"type": "input_source_if","input_sources": [{"language": "ja"}]},
                        {"type": "variable_if","name": "d_shift","value": 0},
                        {"type": "variable_if","name": "k_shift","value": 0},
                        {"type": "variable_if","name": "space_shift","value": 1}
                    ],
                    "from": {"key_code": "slash"},
                    "to": [{"key_code": "d"},{"key_code": "h"},{"key_code": "i", "repeat": false}]
                }
            ]
        }
    ]
}
