[
    {
      "name": "Lenovo IdeaPad 3 14ITL6",
      "price": "13 999",
      "path": "./images/LenovoIdeaPad-14ITL6.jpg",
      "article": "1",
      "color": "Grey",
      "isFavourite": false
    },
    {
      "name": "ASUS X515EA-BQ2066",
      "price": "23 999",
      "path": "./images/ASUS-X515EA-BQ2066.jpg",
      "article": "2",
      "color": "Grey",
      "isFavourite": false
    },
    {
      "name": "Apple MacBook Pro 16",
      "price": "114 999",
      "path": "./images/AppleMacBookPro-16.jpg",
      "article": "3",
      "color": "Silver",
      "isFavourite": false
    },
    {
      "name": "ASUS X515JA-EJ1814",
      "price": "36 599",
      "path": "./images/ASUS-X515JA-EJ1814.jpg",
      "article": "4",
      "color": "Black",
      "isFavourite": false
    },
    {
      "name": "Apple MacBook Pro 15",
      "price": "114 999",
      "path": "./images/AppleMacBookPro-15.jpg",
      "article": "5",
      "color": "Black",
      "isFavourite": false
    },
    {
      "name": "Apple MacBook Air 13",
      "price": "42 999",
      "path": "./images/AppleMacBookAir-13.jpg",
      "article": "6",
      "color": "Dark grey",
      "isFavourite": false
    },
    {
      "name": "Apple MacBook Pro 14",
      "price": "110 999",
      "path": "./images/AppleMacBookPro-14.jpg",
      "article": "7",
      "color": "Grey",
      "isFavourite": false
    },
    {
      "name": "Apple MacBook Air 13.6",
      "price": "70 560",
      "path": "./images/AppleMacBookAir-13.6.jpg",
      "article": "8",
      "color": "Gold",
      "isFavourite": false
    },
    {
      "name": "Acer A315-35-P4VA",
      "price": "16 999",
      "path": "./images/Acer-A315-35-P4VA.jpg",
      "article": "9",
      "color": "Dark grey",
      "isFavourite": false
    },
    {
      "name": "Samsung Galaxy Book Pro NP950XDB",
      "price": "54 799",
      "path": "./images/SamsungGalaxy-NP950XDB.jpg",
      "article": "10",
      "color": "White",
      "isFavourite": false
    }
  ]
  