{
  "project_info": {
    "project_number": "371146636133",
    "project_id": "doctoroncalls-a7528",
    "storage_bucket": "doctoroncalls-a7528.appspot.com"
  },
  "client": [
    {
      "client_info": {
        "mobilesdk_app_id": "1:371146636133:android:010a0df2fd7af340647f8c",
        "android_client_info": {
          "package_name": "in.doctor.oncalls"
        }
      },
      "oauth_client": [
        {
          "client_id": "371146636133-f3a2cm9vm4frcpc36419db33ck6740fd.apps.googleusercontent.com",
          "client_type": 3
        }
      ],
      "api_key": [
        {
          "current_key": "AIzaSyBrIijpUAWYhXx4VRPhij972Oz1sqoffjE"
        }
      ],
      "services": {
        "appinvite_service": {
          "other_platform_oauth_client": [
            {
              "client_id": "371146636133-f3a2cm9vm4frcpc36419db33ck6740fd.apps.googleusercontent.com",
              "client_type": 3
            }
          ]
        }
      }
    }
  ],
  "configuration_version": "1"
}