module gitlab.com/dotpe/mindbenders

go 1.18

require (
	github.com/aws/aws-sdk-go v1.44.213
	github.com/bwmarrin/snowflake v0.3.0
	github.com/confluentinc/confluent-kafka-go v1.9.2
	github.com/dgrijalva/jwt-go v3.2.0+incompatible
	github.com/emirpasic/gods v1.18.1
	github.com/gin-contrib/cors v1.4.0
	github.com/gin-gonic/gin v1.9.0
	github.com/go-redis/redis/v8 v8.11.5
	github.com/go-redis/redis_rate/v9 v9.1.2
	github.com/google/pprof v0.0.0-20230228050547-1710fef4ab10
	github.com/prometheus/client_golang v1.14.0
	github.com/rs/xid v1.4.0
	github.com/sirupsen/logrus v1.9.0
	github.com/snowzach/rotatefilehook v0.0.0-20220211133110-53752135082d
	github.com/streadway/amqp v1.0.0
	github.com/zsais/go-gin-prometheus v0.1.0
	golang.org/x/net v0.7.0
)

require (
	github.com/beorn7/perks v1.0.1 // indirect
	github.com/bytedance/sonic v1.8.3 // indirect
	github.com/cespare/xxhash/v2 v2.2.0 // indirect
	github.com/chenzhuoyu/base64x v0.0.0-20221115062448-fe3a3abad311 // indirect
	github.com/dgryski/go-rendezvous v0.0.0-20200823014737-9f7001d12a5f // indirect
	github.com/gin-contrib/sse v0.1.0 // indirect
	github.com/go-playground/locales v0.14.1 // indirect
	github.com/go-playground/universal-translator v0.18.1 // indirect
	github.com/go-playground/validator/v10 v10.11.2 // indirect
	github.com/goccy/go-json v0.10.0 // indirect
	github.com/golang/protobuf v1.5.2 // indirect
	github.com/jmespath/go-jmespath v0.4.0 // indirect
	github.com/json-iterator/go v1.1.12 // indirect
	github.com/klauspost/cpuid/v2 v2.2.4 // indirect
	github.com/leodido/go-urn v1.2.2 // indirect
	github.com/mattn/go-isatty v0.0.17 // indirect
	github.com/matttproud/golang_protobuf_extensions v1.0.4 // indirect
	github.com/modern-go/concurrent v0.0.0-20180306012644-bacd9c7ef1dd // indirect
	github.com/modern-go/reflect2 v1.0.2 // indirect
	github.com/pelletier/go-toml/v2 v2.0.7 // indirect
	github.com/prometheus/client_model v0.3.0 // indirect
	github.com/prometheus/common v0.41.0 // indirect
	github.com/prometheus/procfs v0.9.0 // indirect
	github.com/twitchyliquid64/golang-asm v0.15.1 // indirect
	github.com/ugorji/go/codec v1.2.10 // indirect
	golang.org/x/arch v0.2.0 // indirect
	golang.org/x/crypto v0.6.0 // indirect
	golang.org/x/sys v0.5.0 // indirect
	golang.org/x/text v0.7.0 // indirect
	google.golang.org/protobuf v1.28.1 // indirect
	gopkg.in/natefinch/lumberjack.v2 v2.2.1 // indirect
	gopkg.in/yaml.v3 v3.0.1 // indirect
)
