<?xml version="1.0" encoding="UTF-8"?>
<!DOCTYPE svg PUBLIC "-//W3C//DTD SVG 1.1//EN" "http://www.w3.org/Graphics/SVG/1.1/DTD/svg11.dtd">
<svg xmlns="http://www.w3.org/2000/svg" version="1.1" width="148px" height="79px" style="shape-rendering:geometricPrecision; text-rendering:geometricPrecision; image-rendering:optimizeQuality; fill-rule:evenodd; clip-rule:evenodd" xmlns:xlink="http://www.w3.org/1999/xlink">
<g><path style="opacity:0.947" fill="#cd09aa" d="M 19.5,10.5 C 18.7784,10.0825 18.2784,9.4158 18,8.5C 14.1207,16.2585 10.2874,23.9252 6.5,31.5C 6.5,23.5 6.5,15.5 6.5,7.5C 10.8333,7.5 15.1667,7.5 19.5,7.5C 19.5,8.5 19.5,9.5 19.5,10.5 Z"/></g>
<g><path style="opacity:0.89" fill="#cb0aaa" d="M 62.5,7.5 C 63.8333,7.5 65.1667,7.5 66.5,7.5C 66.8039,8.14987 67.1373,8.81654 67.5,9.5C 63.5643,20.8072 59.731,32.1405 56,43.5C 55.8138,40.9644 55.3138,38.631 54.5,36.5C 54.5,31.1667 54.5,25.8333 54.5,20.5C 55.3213,23.6414 55.8213,26.9748 56,30.5C 58.1196,23.1813 60.6196,16.0146 63.5,9C 62.944,8.61742 62.6107,8.11742 62.5,7.5 Z"/></g>
<g><path style="opacity:0.899" fill="#d108aa" d="M 66.5,7.5 C 67.8333,7.5 69.1667,7.5 70.5,7.5C 70.5121,11.3487 69.5121,15.1821 67.5,19C 67.7284,19.3988 68.0618,19.5654 68.5,19.5C 68.5,19.8333 68.5,20.1667 68.5,20.5C 63.8174,30.7033 59.9841,41.37 57,52.5C 56.3292,53.2524 55.4959,53.5858 54.5,53.5C 54.5,47.8333 54.5,42.1667 54.5,36.5C 55.3138,38.631 55.8138,40.9644 56,43.5C 59.731,32.1405 63.5643,20.8072 67.5,9.5C 67.1373,8.81654 66.8039,8.14987 66.5,7.5 Z"/></g>
<g><path style="opacity:0.899" fill="#e004a8" d="M 70.5,7.5 C 74.8333,7.5 79.1667,7.5 83.5,7.5C 82.3679,11.5628 81.0346,15.5628 79.5,19.5C 75.8333,19.5 72.1667,19.5 68.5,19.5C 68.0618,19.5654 67.7284,19.3988 67.5,19C 69.5121,15.1821 70.5121,11.3487 70.5,7.5 Z"/></g>
<g><path style="opacity:0.796" fill="#ee00a7" d="M 83.5,7.5 C 85.5,7.5 87.5,7.5 89.5,7.5C 89.5,11.5 89.5,15.5 89.5,19.5C 86.1667,19.5 82.8333,19.5 79.5,19.5C 81.0346,15.5628 82.3679,11.5628 83.5,7.5 Z"/></g>
<g><path style="opacity:0.923" fill="#a70fb3" d="M 117.5,7.5 C 115.49,9.02308 115.156,10.8564 116.5,13C 114.292,13.1909 112.292,13.6909 110.5,14.5C 110.167,14.5 109.833,14.5 109.5,14.5C 108.811,13.2264 107.977,13.2264 107,14.5C 106.505,12.5273 106.338,10.5273 106.5,8.5C 110.064,7.57734 113.731,7.24401 117.5,7.5 Z"/></g>
<g><path style="opacity:1" fill="#a315ae" d="M 42.5,7.5 C 43.9516,8.30192 45.6183,8.80192 47.5,9C 43.0821,15.6701 39.5821,22.8367 37,30.5C 36.8195,27.3054 36.3195,24.3054 35.5,21.5C 35.5,16.8333 35.5,12.1667 35.5,7.5C 37.8333,7.5 40.1667,7.5 42.5,7.5 Z"/></g>
<g><path style="opacity:0.955" fill="#ab13ad" d="M 42.5,7.5 C 44.5,7.5 46.5,7.5 48.5,7.5C 48.5,8.83333 48.5,10.1667 48.5,11.5C 44.4433,20.6303 40.61,29.9637 37,39.5C 36.8171,36.6353 36.3171,33.9686 35.5,31.5C 35.5,28.1667 35.5,24.8333 35.5,21.5C 36.3195,24.3054 36.8195,27.3054 37,30.5C 39.5821,22.8367 43.0821,15.6701 47.5,9C 45.6183,8.80192 43.9516,8.30192 42.5,7.5 Z"/></g>
<g><path style="opacity:0.995" fill="#c30cab" d="M 62.5,7.5 C 62.6107,8.11742 62.944,8.61742 63.5,9C 60.6196,16.0146 58.1196,23.1813 56,30.5C 55.8213,26.9748 55.3213,23.6414 54.5,20.5C 54.5,16.1667 54.5,11.8333 54.5,7.5C 57.1667,7.5 59.8333,7.5 62.5,7.5 Z"/></g>
<g><path style="opacity:0.954" fill="#b012ad" d="M 48.5,11.5 C 48.5,14.5 48.5,17.5 48.5,20.5C 43.1158,32.2692 37.4492,43.9358 31.5,55.5C 27.6286,55.815 23.9619,55.4816 20.5,54.5C 22.3924,51.7235 24.0591,48.7235 25.5,45.5C 24.0065,44.8589 23.0065,43.8589 22.5,42.5C 32.5332,45.6443 36.8666,41.9777 35.5,31.5C 36.3171,33.9686 36.8171,36.6353 37,39.5C 40.61,29.9637 44.4433,20.6303 48.5,11.5 Z"/></g>
<g><path style="opacity:0.893" fill="#09b6f6" d="M 119.5,7.5 C 129.395,6.6095 136.395,10.6095 140.5,19.5C 139.685,20.4293 138.852,21.4293 138,22.5C 137.861,27.5956 137.361,31.929 136.5,35.5C 137.921,27.0961 135.588,20.0961 129.5,14.5C 126.786,11.1543 123.452,8.82097 119.5,7.5 Z"/></g>
<g><path style="opacity:0.931" fill="#c00dab" d="M 19.5,10.5 C 19.5,15.1667 19.5,19.8333 19.5,24.5C 18.6981,23.0484 18.1981,21.3817 18,19.5C 14.7395,27.6797 11.2395,35.6797 7.5,43.5C 6.51658,39.7016 6.18325,35.7016 6.5,31.5C 10.2874,23.9252 14.1207,16.2585 18,8.5C 18.2784,9.4158 18.7784,10.0825 19.5,10.5 Z"/></g>
<g><path style="opacity:0.997" fill="#da0bab" d="M 106.5,8.5 C 106.338,10.5273 106.505,12.5273 107,14.5C 107.977,13.2264 108.811,13.2264 109.5,14.5C 100.616,19.6212 97.4494,27.2879 100,37.5C 100.754,40.6844 102.254,43.3511 104.5,45.5C 104.733,47.0618 105.4,48.3951 106.5,49.5C 106.565,49.9382 106.399,50.2716 106,50.5C 103.277,46.2443 102.11,46.5776 102.5,51.5C 93.8971,44.5301 90.7305,35.5301 93,24.5C 94.9471,16.8977 99.4471,11.5644 106.5,8.5 Z"/></g>
<g><path style="opacity:0.935" fill="#0bbffd" d="M 109.5,14.5 C 109.833,14.5 110.167,14.5 110.5,14.5C 115.114,13.7682 119.114,14.7682 122.5,17.5C 110.615,19.5893 105.948,26.5893 108.5,38.5C 106.331,40.3403 104.998,42.6737 104.5,45.5C 102.254,43.3511 100.754,40.6844 100,37.5C 97.4494,27.2879 100.616,19.6212 109.5,14.5 Z"/></g>
<g><path style="opacity:1" fill="#6c25b9" d="M 117.5,7.5 C 118.167,7.5 118.833,7.5 119.5,7.5C 123.452,8.82097 126.786,11.1543 129.5,14.5C 130.014,16.6175 130.347,18.7841 130.5,21C 128.96,23.8105 127.96,27.9772 127.5,33.5C 128.689,27.1076 127.023,21.7743 122.5,17.5C 119.114,14.7682 115.114,13.7682 110.5,14.5C 112.292,13.6909 114.292,13.1909 116.5,13C 115.156,10.8564 115.49,9.02308 117.5,7.5 Z"/></g>
<g><path style="opacity:1" fill="#5c2ab9" d="M 129.5,14.5 C 135.588,20.0961 137.921,27.0961 136.5,35.5C 135.163,39.4985 132.83,42.8318 129.5,45.5C 125.742,47.2541 121.742,47.9208 117.5,47.5C 115.566,46.8897 113.899,45.8897 112.5,44.5C 120.069,44.2559 125.069,40.5892 127.5,33.5C 127.96,27.9772 128.96,23.8105 130.5,21C 130.347,18.7841 130.014,16.6175 129.5,14.5 Z"/></g>
<g><path style="opacity:0.982" fill="#b80fac" d="M 48.5,20.5 C 48.5,23.1667 48.5,25.8333 48.5,28.5C 45.8283,34.9718 42.6616,41.3051 39,47.5C 38.187,49.4357 37.687,51.4357 37.5,53.5C 35.7857,54.7384 33.7857,55.405 31.5,55.5C 37.4492,43.9358 43.1158,32.2692 48.5,20.5 Z"/></g>
<g><path style="opacity:0.941" fill="#d707a9" d="M 68.5,20.5 C 68.5,22.5 68.5,24.5 68.5,26.5C 66.1606,36.1846 62.8273,45.518 58.5,54.5C 56.901,54.7678 55.5676,54.4345 54.5,53.5C 55.4959,53.5858 56.3292,53.2524 57,52.5C 59.9841,41.37 63.8174,30.7033 68.5,20.5 Z"/></g>
<g><path style="opacity:0.914" fill="#b410ac" d="M 19.5,24.5 C 19.5,29.5 19.5,34.5 19.5,39.5C 18.6862,37.369 18.1862,35.0356 18,32.5C 15.7453,38.0064 13.2453,43.3397 10.5,48.5C 8.74973,47.3406 7.74973,45.674 7.5,43.5C 11.2395,35.6797 14.7395,27.6797 18,19.5C 18.1981,21.3817 18.6981,23.0484 19.5,24.5 Z"/></g>
<g><path style="opacity:0.951" fill="#df04a8" d="M 68.5,26.5 C 71.1667,26.5 73.8333,26.5 76.5,26.5C 75.5119,30.4848 74.5119,34.4848 73.5,38.5C 71.8333,38.5 70.1667,38.5 68.5,38.5C 68.5,43.8333 68.5,49.1667 68.5,54.5C 65.1667,54.5 61.8333,54.5 58.5,54.5C 62.8273,45.518 66.1606,36.1846 68.5,26.5 Z"/></g>
<g><path style="opacity:0.862" fill="#ee00a7" d="M 76.5,26.5 C 80.1667,26.5 83.8333,26.5 87.5,26.5C 87.5,30.5 87.5,34.5 87.5,38.5C 82.8333,38.5 78.1667,38.5 73.5,38.5C 74.5119,34.4848 75.5119,30.4848 76.5,26.5 Z"/></g>
<g><path style="opacity:0.973" fill="#c00dab" d="M 48.5,28.5 C 48.6659,33.5111 48.4993,38.5111 48,43.5C 45.9254,48.4098 42.4254,51.7431 37.5,53.5C 37.687,51.4357 38.187,49.4357 39,47.5C 42.6616,41.3051 45.8283,34.9718 48.5,28.5 Z"/></g>
<g><path style="opacity:0.993" fill="#099adf" d="M 140.5,19.5 C 142.044,23.1094 142.71,26.9427 142.5,31C 142.498,34.0208 142.164,36.8541 141.5,39.5C 141.649,38.448 141.483,37.448 141,36.5C 137.263,39.114 134.097,42.2807 131.5,46C 130.563,46.6917 129.897,46.525 129.5,45.5C 132.83,42.8318 135.163,39.4985 136.5,35.5C 137.361,31.929 137.861,27.5956 138,22.5C 138.852,21.4293 139.685,20.4293 140.5,19.5 Z"/></g>
<g><path style="opacity:0.998" fill="#a415ae" d="M 19.5,39.5 C 20.1667,40.8333 21.1667,41.8333 22.5,42.5C 23.0065,43.8589 24.0065,44.8589 25.5,45.5C 24.0591,48.7235 22.3924,51.7235 20.5,54.5C 16.2066,54.0231 12.8733,52.0231 10.5,48.5C 13.2453,43.3397 15.7453,38.0064 18,32.5C 18.1862,35.0356 18.6862,37.369 19.5,39.5 Z"/></g>
<g><path style="opacity:0.933" fill="#0eadef" d="M 108.5,38.5 C 109.441,40.7721 110.774,42.7721 112.5,44.5C 113.899,45.8897 115.566,46.8897 117.5,47.5C 119.631,48.3138 121.964,48.8138 124.5,49C 124.833,49.3333 125.167,49.6667 125.5,50C 124.386,51.5699 123.053,52.9032 121.5,54C 123.134,54.4935 124.801,54.6602 126.5,54.5C 124.735,55.4614 122.735,55.7947 120.5,55.5C 115.445,54.6452 110.778,52.6452 106.5,49.5C 105.4,48.3951 104.733,47.0618 104.5,45.5C 104.998,42.6737 106.331,40.3403 108.5,38.5 Z"/></g>
<g><path style="opacity:0.947" fill="#b317b2" d="M 106.5,49.5 C 110.778,52.6452 115.445,54.6452 120.5,55.5C 113.903,56.2551 107.903,54.9218 102.5,51.5C 102.11,46.5776 103.277,46.2443 106,50.5C 106.399,50.2716 106.565,49.9382 106.5,49.5 Z"/></g>
<g><path style="opacity:0.967" fill="#108cd4" d="M 141.5,39.5 C 139.5,47.5 134.5,52.5 126.5,54.5C 124.801,54.6602 123.134,54.4935 121.5,54C 123.053,52.9032 124.386,51.5699 125.5,50C 125.167,49.6667 124.833,49.3333 124.5,49C 121.964,48.8138 119.631,48.3138 117.5,47.5C 121.742,47.9208 125.742,47.2541 129.5,45.5C 129.897,46.525 130.563,46.6917 131.5,46C 134.097,42.2807 137.263,39.114 141,36.5C 141.483,37.448 141.649,38.448 141.5,39.5 Z"/></g>
<g><path style="opacity:0.572" fill="#fefffe" d="M 8.5,65.5 C 9.83333,65.5 11.1667,65.5 12.5,65.5C 12.6495,66.552 12.4828,67.552 12,68.5C 9.34223,67.306 8.17556,68.306 8.5,71.5C 9.97782,71.238 11.3112,71.5713 12.5,72.5C 7.3831,74.5515 5.54976,72.8849 7,67.5C 7.71719,66.9558 8.21719,66.2891 8.5,65.5 Z"/></g>
<g><path style="opacity:0.615" fill="#fefffe" d="M 14.5,65.5 C 15.7479,66.3339 16.4146,67.6672 16.5,69.5C 16.1667,70.8333 15.8333,72.1667 15.5,73.5C 14.52,70.9135 14.1866,68.2469 14.5,65.5 Z"/></g>
<g><path style="opacity:0.555" fill="#fefffe" d="M 18.5,65.5 C 20.6237,66.0312 22.1237,67.3645 23,69.5C 23.4922,68.451 23.3256,67.451 22.5,66.5C 23.325,65.6143 24.325,65.281 25.5,65.5C 25.8134,68.2469 25.48,70.9135 24.5,73.5C 23.1861,72.6872 22.0195,71.6872 21,70.5C 20.7508,71.624 20.2508,72.624 19.5,73.5C 18.52,70.9135 18.1866,68.2469 18.5,65.5 Z"/></g>
<g><path style="opacity:0.572" fill="#fefffe" d="M 27.5,65.5 C 29.604,65.2011 31.604,65.5344 33.5,66.5C 32.2713,67.2811 30.938,67.7811 29.5,68C 33.5,69 33.5,70 29.5,71C 30.938,71.2189 32.2713,71.7189 33.5,72.5C 31.604,73.4656 29.604,73.7989 27.5,73.5C 27.5,70.8333 27.5,68.1667 27.5,65.5 Z"/></g>
<g><path style="opacity:0.597" fill="#fefffe" d="M 40.5,65.5 C 42.0245,66.1738 43.3578,67.1738 44.5,68.5C 45.2807,67.2634 46.2807,66.2634 47.5,65.5C 48.8333,68.1667 48.8333,70.8333 47.5,73.5C 46.7492,72.624 46.2492,71.624 46,70.5C 45,71.8333 44,71.8333 43,70.5C 42.7508,71.624 42.2508,72.624 41.5,73.5C 40.52,70.9135 40.1866,68.2469 40.5,65.5 Z"/></g>
<g><path style="opacity:0.565" fill="#fefffe" d="M 50.5,65.5 C 52.604,65.2011 54.604,65.5344 56.5,66.5C 55.2713,67.2811 53.938,67.7811 52.5,68C 56.5,69 56.5,70 52.5,71C 53.938,71.2189 55.2713,71.7189 56.5,72.5C 54.604,73.4656 52.604,73.7989 50.5,73.5C 50.5,70.8333 50.5,68.1667 50.5,65.5 Z"/></g>
<g><path style="opacity:0.536" fill="#fefffe" d="M 58.5,65.5 C 63.9836,65.4809 65.6503,67.9809 63.5,73C 57.5933,73.7465 55.9267,71.2465 58.5,65.5 Z M 60.5,67.5 C 62.4759,68.4271 62.8092,69.7605 61.5,71.5C 60.5713,70.3112 60.238,68.9778 60.5,67.5 Z"/></g>
<g><path style="opacity:0.586" fill="#fefffe" d="M 66.5,65.5 C 67.7479,66.3339 68.4146,67.6672 68.5,69.5C 68.1667,70.8333 67.8333,72.1667 67.5,73.5C 66.52,70.9135 66.1866,68.2469 66.5,65.5 Z"/></g>
<g><path style="opacity:0.538" fill="#fefffe" d="M 73.5,65.5 C 74.3764,65.3691 75.0431,65.7025 75.5,66.5C 76.2135,68.8111 77.2135,70.9777 78.5,73C 76.1261,72.5976 73.7928,72.7643 71.5,73.5C 70.883,70.6668 71.5497,68.0002 73.5,65.5 Z"/></g>
<g><path style="opacity:0.57" fill="#fefffe" d="M 84.5,65.5 C 86.7525,65.9156 88.2525,67.249 89,69.5C 89.2189,68.062 89.7189,66.7287 90.5,65.5C 91.8333,68.1667 91.8333,70.8333 90.5,73.5C 88.8035,72.6364 87.6368,71.3031 87,69.5C 86.7811,70.938 86.2811,72.2713 85.5,73.5C 84.52,70.9135 84.1866,68.2469 84.5,65.5 Z"/></g>
<g><path style="opacity:0.568" fill="#fefffe" d="M 93.5,65.5 C 95.604,65.2011 97.604,65.5344 99.5,66.5C 98.2713,67.2811 96.938,67.7811 95.5,68C 99.5,69 99.5,70 95.5,71C 96.938,71.2189 98.2713,71.7189 99.5,72.5C 97.604,73.4656 95.604,73.7989 93.5,73.5C 93.5,70.8333 93.5,68.1667 93.5,65.5 Z"/></g>
<g><path style="opacity:0.604" fill="#fefffe" d="M 100.5,65.5 C 102.604,65.2011 104.604,65.5344 106.5,66.5C 105.119,68.6349 104.119,70.9682 103.5,73.5C 102.68,70.6986 101.68,68.0319 100.5,65.5 Z"/></g>
<g><path style="opacity:0.524" fill="#fefffe" d="M 107.5,65.5 C 109.776,65.7565 110.943,67.0898 111,69.5C 112.105,64.3718 113.438,64.3718 115,69.5C 115.196,67.7139 116.029,66.3805 117.5,65.5C 117.833,65.8333 118.167,66.1667 118.5,66.5C 117.423,68.7294 116.756,71.0628 116.5,73.5C 115.5,73.5 114.5,73.5 113.5,73.5C 113.649,72.448 113.483,71.448 113,70.5C 112.632,71.91 111.799,72.91 110.5,73.5C 109.103,70.9742 108.103,68.3076 107.5,65.5 Z"/></g>
<g><path style="opacity:0.595" fill="#fefffe" d="M 121.5,65.5 C 127.02,66.0435 128.354,68.5435 125.5,73C 119.202,73.4954 117.868,70.9954 121.5,65.5 Z M 122.5,67.5 C 124.176,68.1834 124.843,69.5168 124.5,71.5C 123.5,71.5 122.5,71.5 121.5,71.5C 121.433,70.0413 121.766,68.7079 122.5,67.5 Z"/></g>
<g><path style="opacity:0.505" fill="#fefffe" d="M 128.5,65.5 C 131.596,64.9066 133.929,65.9066 135.5,68.5C 135.023,69.4776 134.357,70.3109 133.5,71C 135.271,71.5354 135.604,72.3687 134.5,73.5C 133.522,73.0233 132.689,72.3567 132,71.5C 131.29,72.9733 130.124,73.6399 128.5,73.5C 128.5,70.8333 128.5,68.1667 128.5,65.5 Z"/></g>
<g><path style="opacity:0.487" fill="#fefffe" d="M 136.5,65.5 C 137.5,65.5 138.5,65.5 139.5,65.5C 139.351,66.552 139.517,67.552 140,68.5C 140.419,67.3279 141.085,66.3279 142,65.5C 142.167,66 142.333,66.5 142.5,67C 141.804,69.1176 141.637,71.2842 142,73.5C 141.085,72.6721 140.419,71.6721 140,70.5C 139.517,71.448 139.351,72.448 139.5,73.5C 138.5,73.5 137.5,73.5 136.5,73.5C 136.5,70.8333 136.5,68.1667 136.5,65.5 Z"/></g>
</svg>
