P_TestName1,P_ModuleName1,P_WebserviceTestName,P_SaveStepName,P_TestWebName,P_TestWebName2,P_SaveStepName2,P_SaveStepName3,P_TestWebName3,P_crePrjNme,P_WebTestName5,P_saveStep21  ,P_nameSnippet,P_instanceName,P_UpdateBrowInsta,P_updatInstanceName,P_lambdaIstceName,P_SauceLabup,P_SauceLab,P_FolderName,P_ChildFolderName,P_GroupName,P_RecName,P_RecipentEmail,P_RecName2,P_RecipentEmail2
TestNameSH11313,ModuleName A 11313,WebServicesTestB11313,SaveStepJ11313,TestWebZkPage5991,TestWebZkQPage5973,SaveStepName11313,SaveJkSan11313,TestWebNameJ11313,ProjectJmeter11313,WebtesQT11313,SaveStepTD11313,NameSnippet11313,InstanceNam11313,BrowSerInst 11281,BrowSerInst 11281,LambdaInstQ11313,SauceLabup 11132,SauceLabup 11132,FolderName11313,ChildFoldNa11313,GroupName11313,RecordNam11313,shu1@gmail.com,RexoEleName11313,shuu1@gmail.com
TestNameSH11314,ModuleName A 11314,WebServicesTestB11314,SaveStepJ11314,TestWebZkPage5992,TestWebZkQPage5974,SaveStepName11314,SaveJkSan11314,TestWebNameJ11314,ProjectJmeter11314,WebtesQT11314,SaveStepTD11314,NameSnippet11314,InstanceNam11314,BrowSerInst 11282,BrowSerInst 11282,LambdaInstQ11314,SauceLabup 11133,SauceLabup 11133,FolderName11314,ChildFoldNa11314,GroupName11314,RecordNam11314,shu1@gmail.com,RexoEleName11314,shuu1@gmail.com
TestNameSH11315,ModuleName A 11315,WebServicesTestB11315,SaveStepJ11315,TestWebZkPage5993,TestWebZkQPage5975,SaveStepName11315,SaveJkSan11315,TestWebNameJ11315,ProjectJmeter11315,WebtesQT11315,SaveStepTD11315,NameSnippet11315,InstanceNam11315,BrowSerInst 11283,BrowSerInst 11283,LambdaInstQ11315,SauceLabup 11134,SauceLabup 11134,FolderName11315,ChildFoldNa11315,GroupName11315,RecordNam11315,shu1@gmail.com,RexoEleName11315,shuu1@gmail.com
TestNameSH11316,ModuleName A 11316,WebServicesTestB11316,SaveStepJ11316,TestWebZkPage5994,TestWebZkQPage5976,SaveStepName11316,SaveJkSan11316,TestWebNameJ11316,ProjectJmeter11316,WebtesQT11316,SaveStepTD11316,NameSnippet11316,InstanceNam11316,BrowSerInst 11284,BrowSerInst 11284,LambdaInstQ11316,SauceLabup 11135,SauceLabup 11135,FolderName11316,ChildFoldNa11316,GroupName11316,RecordNam11316,shu1@gmail.com,RexoEleName11316,shuu1@gmail.com
TestNameSH11317,ModuleName A 11317,WebServicesTestB11317,SaveStepJ11317,TestWebZkPage5995,TestWebZkQPage5977,SaveStepName11317,SaveJkSan11317,TestWebNameJ11317,ProjectJmeter11317,WebtesQT11317,SaveStepTD11317,NameSnippet11317,InstanceNam11317,BrowSerInst 11285,BrowSerInst 11285,LambdaInstQ11317,SauceLabup 11136,SauceLabup 11136,FolderName11317,ChildFoldNa11317,GroupName11317,RecordNam11317,shu1@gmail.com,RexoEleName11317,shuu1@gmail.com
TestNameSH11318,ModuleName A 11318,WebServicesTestB11318,SaveStepJ11318,TestWebZkPage5996,TestWebZkQPage5978,SaveStepName11318,SaveJkSan11318,TestWebNameJ11318,ProjectJmeter11318,WebtesQT11318,SaveStepTD11318,NameSnippet11318,InstanceNam11318,BrowSerInst 11286,BrowSerInst 11286,LambdaInstQ11318,SauceLabup 11137,SauceLabup 11137,FolderName11318,ChildFoldNa11318,GroupName11318,RecordNam11318,shu1@gmail.com,RexoEleName11318,shuu1@gmail.com
TestNameSH11319,ModuleName A 11319,WebServicesTestB11319,SaveStepJ11319,TestWebZkPage5997,TestWebZkQPage5979,SaveStepName11319,SaveJkSan11319,TestWebNameJ11319,ProjectJmeter11319,WebtesQT11319,SaveStepTD11319,NameSnippet11319,InstanceNam11319,BrowSerInst 11287,BrowSerInst 11287,LambdaInstQ11319,SauceLabup 11138,SauceLabup 11138,FolderName11319,ChildFoldNa11319,GroupName11319,RecordNam11319,shu1@gmail.com,RexoEleName11319,shuu1@gmail.com
