P_childModNa,P_ModchilUpdate,P_ScriptChildNm,P_WebmobileScript,P_AndroidScrip,p_Webservicescript,P_DatabaseScrip,P_UpdateScripname,P_UpdateLocNm,P_ProjecEnVarUpdate,P_globalVar,P_DataProName,P_SuitName
ModuleChZkPage 1,ModuleChZkPage 1,ScriZkPage 1,WebMobScrZkPage 1,AndroidScriZkPage 1,WebserviceZkPage 1,DatabasescZkPage 1,UpdateScriZkPage 1,UpdateLocnZkPage 1,ProjecEnvarZkPage 1,GlobalVarZkPage 1,dataprovider naZkPage 1,jmeterSuit1
ModuleChZkPage 2,ModuleChZkPage 2,ScriZkPage 2,WebMobScrZkPage 2,AndroidScriZkPage 2,WebserviceZkPage 2,DatabasescZkPage 2,UpdateScriZkPage 2,UpdateLocnZkPage 2,ProjecEnvarZkPage 2,GlobalVarZkPage 2,dataprovider naZkPage 2,jmeterSuit2
ModuleChZkPage 3,ModuleChZkPage 3,ScriZkPage 3,WebMobScrZkPage 3,AndroidScriZkPage 3,WebserviceZkPage 3,DatabasescZkPage 3,UpdateScriZkPage 3,UpdateLocnZkPage 3,ProjecEnvarZkPage 3,GlobalVarZkPage 3,dataprovider naZkPage 3,jmeterSuit3
ModuleChZkPage 4,ModuleChZkPage 4,ScriZkPage 4,WebMobScrZkPage 4,AndroidScriZkPage 4,WebserviceZkPage 4,DatabasescZkPage 4,UpdateScriZkPage 4,UpdateLocnZkPage 4,ProjecEnvarZkPage 4,GlobalVarZkPage 4,dataprovider naZkPage 4,jmeterSuit4
ModuleChZkPage 5,ModuleChZkPage 5,ScriZkPage 5,WebMobScrZkPage 5,AndroidScriZkPage 5,WebserviceZkPage 5,DatabasescZkPage 5,UpdateScriZkPage 5,UpdateLocnZkPage 5,ProjecEnvarZkPage 5,GlobalVarZkPage 5,dataprovider naZkPage 5,jmeterSuit5
ModuleChZkPage 6,ModuleChZkPage 6,ScriZkPage 6,WebMobScrZkPage 6,AndroidScriZkPage 6,WebserviceZkPage 6,DatabasescZkPage 6,UpdateScriZkPage 6,UpdateLocnZkPage 6,ProjecEnvarZkPage 6,GlobalVarZkPage 6,dataprovider naZkPage 6,jmeterSuit6
ModuleChZkPage 7,ModuleChZkPage 7,ScriZkPage 7,WebMobScrZkPage 7,AndroidScriZkPage 7,WebserviceZkPage 7,DatabasescZkPage 7,UpdateScriZkPage 7,UpdateLocnZkPage 7,ProjecEnvarZkPage 7,GlobalVarZkPage 7,dataprovider naZkPage 7,jmeterSuit7
ModuleChZkPage 8,ModuleChZkPage 8,ScriZkPage 8,WebMobScrZkPage 8,AndroidScriZkPage 8,WebserviceZkPage 8,DatabasescZkPage 8,UpdateScriZkPage 8,UpdateLocnZkPage 8,ProjecEnvarZkPage 8,GlobalVarZkPage 8,dataprovider naZkPage 8,jmeterSuit8
