<?xml version="1.0" encoding="UTF-8"?>
<svg width="32px" height="32px" viewBox="0 0 32 32" version="1.1" xmlns="http://www.w3.org/2000/svg" xmlns:xlink="http://www.w3.org/1999/xlink">
    <!-- Generator: Sketch 60.1 (88133) - https://sketch.com -->
    <title>Notifications Copy 2</title>
    <desc>Created with Sketch.</desc>
    <g id="Symbols" stroke="none" stroke-width="1" fill="none" fill-rule="evenodd">
        <g id="Notifications-Copy-2">
            <rect id="Rectangle" fill="#EEF3FB" x="0" y="0" width="32" height="32" rx="16"></rect>
            <g id="bell" transform="translate(10.000000, 8.000000)" fill="#6F7584" fill-rule="nonzero">
                <path d="M6.25905653,2.22440546 C3.3671423,2.22440546 1.01448733,4.57706043 1.01448733,7.46897466 L1.01448733,13.0390643 L2.09955556,13.0390643 L11.5036569,13.0390643 L11.5036569,7.46897466 C11.5036569,4.57706043 9.15097076,2.22440546 6.25905653,2.22440546 Z" id="Path"></path>
                <path d="M12.1184873,12.4965302 L0.544280702,12.4965302 C0.244615984,12.4965302 0.00174658869,12.7393996 0.00174658869,13.0390643 C0.00174658869,13.338729 0.244615984,13.5815984 0.544280702,13.5815984 L12.1185185,13.5815984 C12.4181832,13.5815984 12.6610526,13.338729 12.6610526,13.0390643 C12.6610526,12.7393996 12.418152,12.4965302 12.1184873,12.4965302 Z" id="Path"></path>
                <path d="M6.25905653,0 C5.34162963,0 4.59527485,0.746354776 4.59527485,1.66378168 C4.59527485,2.58120858 5.34162963,3.32756335 6.25905653,3.32756335 C7.17648343,3.32756335 7.92283821,2.58120858 7.92283821,1.66378168 C7.92283821,0.746354776 7.17648343,0 6.25905653,0 Z M6.25905653,2.24249513 C5.94529435,2.24249513 5.68034308,1.97738791 5.68034308,1.66378168 C5.68034308,1.35001949 5.94529435,1.08506823 6.25905653,1.08506823 C6.57281871,1.08506823 6.83776998,1.35001949 6.83776998,1.66378168 C6.83776998,1.97754386 6.57281871,2.24249513 6.25905653,2.24249513 Z" id="Shape"></path>
                <path d="M7.1994386,13.0390955 L7.1994386,13.9795088 C7.1994386,14.4780975 6.79379337,14.8837427 6.29520468,14.8837427 C5.79661598,14.8837427 5.39097076,14.4780975 5.39097076,13.9795088 L5.39097076,13.0390955 L4.30587135,13.0390955 L4.30587135,13.9795088 C4.30587135,15.0763353 5.19834698,15.9688421 6.29520468,15.9688421 C7.39203119,15.9688421 8.28453801,15.0763665 8.28453801,13.9795088 L8.28453801,13.0390955 L7.1994386,13.0390955 Z" id="Path"></path>
            </g>
        </g>
    </g>
</svg>