<?xml version="1.0" encoding="UTF-8"?>
<svg width="60px" height="60px" viewBox="0 0 60 60" version="1.1" xmlns="http://www.w3.org/2000/svg" xmlns:xlink="http://www.w3.org/1999/xlink">
    <!-- Generator: Sketch 60.1 (88133) - https://sketch.com -->
    <title>Insighticons/marketplaces</title>
    <desc>Created with Sketch.</desc>
    <g id="Insighticons/marketplaces" stroke="none" stroke-width="1" fill="none" fill-rule="evenodd">
        <rect id="Rectangle" fill="#F1F6FF" x="0" y="0" width="60" height="60" rx="30"></rect>
        <g id="shopping-store" transform="translate(15.000000, 16.000000)" fill="#0066FF" fill-rule="nonzero" stroke="#0066FF">
            <path d="M27.5959877,27.0134076 L2.34550014,27.0134076 C2.10913642,27.0134076 1.91752577,26.821797 1.91752577,26.5854333 L1.91752577,11.747562 C1.91752577,11.5111983 2.10913642,11.3195876 2.34550014,11.3195876 C2.58186386,11.3195876 2.77347451,11.5111983 2.77347451,11.747562 L2.77347451,26.1574589 L27.1680134,26.1574589 L27.1680134,11.747562 C27.1680134,11.5111983 27.359624,11.3195876 27.5959877,11.3195876 C27.8323515,11.3195876 28.0239621,11.5111983 28.0239621,11.747562 L28.0239621,26.5854333 C28.0239621,26.821797 27.8323515,27.0134076 27.5959877,27.0134076 Z" id="Path"></path>
            <path d="M29.5302313,8.15993315 L0.427974366,8.15993315 C0.281801653,8.15924349 0.146090518,8.08399773 0.0680735855,7.96038424 C-0.00994334659,7.83677074 -0.0194744592,7.68188823 0.0427974366,7.54964168 L3.46659237,0.274077459 C3.53688777,0.124781864 3.68675411,0.0292004435 3.8517693,0.0284201563 L26.1064363,0.0284201563 C26.2722255,0.0284201563 26.423127,0.124084166 26.4937531,0.274077459 L29.9175481,7.54964168 C29.9799797,7.68223168 29.9702258,7.83754725 29.8916967,7.96128485 C29.8131676,8.08502245 29.6767844,8.15993315 29.5302313,8.15993315 Z M1.10246197,7.3039844 L28.8557437,7.3039844 L25.8346726,0.884368905 L4.12353302,0.884368905 L1.10246197,7.3039844 Z" id="Shape"></path>
            <path d="M27.1049005,12.2060028 C25.5299152,12.2041157 24.2536742,10.9276832 24.2520234,9.35269769 L24.2520234,7.73195876 C24.2520234,7.49559505 24.4436341,7.3039844 24.6799978,7.3039844 L29.5302313,7.3039844 C29.766595,7.3039844 29.9582056,7.49559505 29.9582056,7.73195876 L29.9582056,9.35269769 C29.9563191,10.9277525 28.6799553,12.2041162 27.1049005,12.2060028 Z M25.1079721,8.15993313 L25.1079721,9.35269769 C25.097425,10.0731755 25.4757545,10.743484 26.0980081,11.106802 C26.7202617,11.47012 27.4899674,11.47012 28.1122209,11.106802 C28.7344745,10.743484 29.1128041,10.0731755 29.1022569,9.35269769 L29.1022569,8.15993313 L25.1079721,8.15993313 Z" id="Shape"></path>
            <path d="M22.254667,12.2060028 C20.6796123,12.2041162 19.4032485,10.9277525 19.4013619,9.35269769 L19.4013619,7.73195876 C19.4013619,7.49559505 19.5929726,7.3039844 19.8293363,7.3039844 L24.6799978,7.3039844 C24.9163615,7.3039844 25.1079721,7.49559505 25.1079721,7.73195876 L25.1079721,9.35269769 C25.1060856,10.9277525 23.8297218,12.2041162 22.254667,12.2060028 Z M20.2573107,8.15993313 L20.2573107,9.35269769 C20.2573107,10.4558071 21.1515576,11.3500541 22.254667,11.3500541 C23.3577765,11.3500541 24.2520234,10.4558071 24.2520234,9.35269769 L24.2520234,8.15993313 L20.2573107,8.15993313 Z" id="Shape"></path>
            <path d="M17.4044335,12.2060028 C15.8293788,12.2041162 14.553015,10.9277525 14.5511284,9.35269769 L14.5511284,7.73195876 C14.5511284,7.49559505 14.7427391,7.3039844 14.9791028,7.3039844 L19.8293363,7.3039844 C20.0657,7.3039844 20.2573107,7.49559505 20.2573107,7.73195876 L20.2573107,9.35269769 C20.2556599,10.9276832 18.9794188,12.2041157 17.4044335,12.2060028 Z M15.4070772,8.15993313 L15.4070772,9.35269769 C15.39653,10.0731755 15.7748596,10.743484 16.3971132,11.106802 C17.0193667,11.47012 17.7890724,11.47012 18.411326,11.106802 C19.0335795,10.743484 19.4119091,10.0731755 19.4013619,9.35269769 L19.4013619,8.15993313 L15.4070772,8.15993313 Z" id="Shape"></path>
            <path d="M12.5537721,12.2060028 C10.9787868,12.2041157 9.70254574,10.9276832 9.70089496,9.35269769 L9.70089496,7.73195876 C9.70089496,7.49559505 9.89250561,7.3039844 10.1288693,7.3039844 L14.9791028,7.3039844 C15.2154665,7.3039844 15.4070772,7.49559505 15.4070772,7.73195876 L15.4070772,9.35269769 C15.4051906,10.9277525 14.1288269,12.2041162 12.5537721,12.2060028 Z M10.5568437,8.15993313 L10.5568437,9.35269769 C10.5462965,10.0731755 10.9246261,10.743484 11.5468797,11.106802 C12.1691332,11.47012 12.9388389,11.47012 13.5610925,11.106802 C14.183346,10.743484 14.5616756,10.0731755 14.5511284,9.35269769 L14.5511284,8.15993313 L10.5568437,8.15993313 Z" id="Shape"></path>
            <path d="M7.70353859,12.2060028 C6.12848381,12.2041162 4.85212007,10.9277525 4.85023349,9.35269769 L4.85023349,7.73195876 C4.85023349,7.49559505 5.04184414,7.3039844 5.27820786,7.3039844 L10.1288693,7.3039844 C10.365233,7.3039844 10.5568437,7.49559505 10.5568437,7.73195876 L10.5568437,9.35269769 C10.5549571,10.9277525 9.27859337,12.2041162 7.70353859,12.2060028 Z M5.70618222,8.15993313 L5.70618222,9.35269769 C5.70618222,10.4558071 6.60042913,11.3500541 7.70353859,11.3500541 C8.80664805,11.3500541 9.70089496,10.4558071 9.70089496,9.35269769 L9.70089496,8.15993313 L5.70618222,8.15993313 Z" id="Shape"></path>
            <path d="M2.8533051,12.2060028 C1.27825031,12.2041162 0.00188657761,10.9277525 0,9.35269769 L0,7.73195876 C0,7.49559505 0.19161065,7.3039844 0.427974366,7.3039844 L5.27820786,7.3039844 C5.51457157,7.3039844 5.70618222,7.49559505 5.70618222,7.73195876 L5.70618222,9.35269769 C5.70453144,10.9276832 4.42829039,12.2041157 2.8533051,12.2060028 Z M0.855948732,8.15993313 L0.855948732,9.35269769 C0.845401547,10.0731755 1.22373114,10.743484 1.84598471,11.106802 C2.46823827,11.47012 3.23794395,11.47012 3.86019752,11.106802 C4.48245108,10.743484 4.86078068,10.0731755 4.85023349,9.35269769 L4.85023349,8.15993313 L0.855948732,8.15993313 Z" id="Shape"></path>
            <path d="M22.4954563,26.9690722 L7.50454368,26.9690722 C7.08355047,26.9690722 6.74226804,26.6273306 6.74226804,26.2057709 L6.74226804,16.4591775 C6.74268791,15.807497 7.26994163,15.2791923 7.92074617,15.2783505 L22.0792538,15.2783505 C22.7300584,15.2791923 23.2573121,15.807497 23.257732,16.4591775 L23.257732,26.2057709 C23.257732,26.6273306 22.9164495,26.9690722 22.4954563,26.9690722 Z M7.54639175,26.1938499 L22.3917526,26.1938499 L22.3917526,16.1443299 L7.54639175,16.1443299 L7.54639175,26.1938499 Z" id="Shape"></path>
            <path d="M24.6808537,8.15993324 C24.481135,8.15967869 24.3081444,8.02132169 24.2640067,7.8265411 L22.6120256,0.550976874 C22.5658809,0.323091557 22.7101211,0.100051734 22.9368793,0.0486532249 C23.1636374,-0.00274528456 23.3899508,0.136302366 23.4465756,0.361812204 L25.0985567,7.63737643 C25.1273267,7.76433816 25.0967457,7.89749229 25.0154632,7.99917876 C24.9341806,8.10086524 24.8110343,8.16002767 24.6808537,8.15993324 L24.6808537,8.15993324 Z" id="Path"></path>
            <path d="M19.7377498,8.1599336 C19.5305317,8.15960808 19.3533139,8.01087497 19.317051,7.80685428 L18.0198607,0.531290053 C17.9815154,0.300021532 18.1363625,0.0809440079 18.3671703,0.0399167166 C18.5979782,-0.00111057482 18.8188384,0.151183009 18.8625422,0.381499025 L20.1593045,7.65706325 C20.2005285,7.88961437 20.0455781,8.11160138 19.8130733,8.15308554 C19.7882294,8.15767917 19.7630148,8.1599336 19.7377498,8.1599336 Z" id="Path"></path>
            <path d="M5.27735191,8.15993324 C5.14717133,8.16002767 5.02402499,8.10086524 4.94274244,7.99917876 C4.86145989,7.89749229 4.83087898,7.76433816 4.85964893,7.63737643 L6.51162998,0.361812204 C6.54244313,0.209641861 6.65325183,0.0860936037 6.8011854,0.0389669283 C6.94911896,-0.00815974699 7.11097324,0.0285272228 7.22412855,0.134834042 C7.33728385,0.241140862 7.38399119,0.400392756 7.34617999,0.550976874 L5.69419894,7.8265411 C5.65006124,8.02132169 5.47707058,8.15967869 5.27735191,8.15993324 Z" id="Path"></path>
            <path d="M10.2204558,8.1599336 C10.1951909,8.1599336 10.1699762,8.15767917 10.1451323,8.15308554 C9.9126275,8.11160138 9.75767712,7.88961437 9.79890109,7.65706325 L11.0956634,0.381499025 C11.1393672,0.151183009 11.3602275,-0.00111057482 11.5910353,0.0399167166 C11.8218431,0.0809440079 11.9766902,0.300021532 11.9383449,0.531290053 L10.6411546,7.80685428 C10.6048917,8.01087497 10.4276739,8.15960808 10.2204558,8.1599336 Z" id="Path"></path>
            <path d="M14.9791028,8.15993313 C14.7427391,8.15993313 14.5511284,7.96832248 14.5511284,7.73195876 L14.5511284,0.456394539 C14.5511284,0.220030823 14.7427391,0.0284201728 14.9791028,0.0284201728 C15.2154665,0.0284201728 15.4070772,0.220030823 15.4070772,0.456394539 L15.4070772,7.73195876 C15.4070772,7.96832248 15.2154665,8.15993313 14.9791028,8.15993313 Z" id="Path"></path>
        </g>
    </g>
</svg>