<?xml version="1.0" encoding="UTF-8"?>
<svg width="60px" height="60px" viewBox="0 0 60 60" version="1.1" xmlns="http://www.w3.org/2000/svg" xmlns:xlink="http://www.w3.org/1999/xlink">
    <!-- Generator: Sketch 60.1 (88133) - https://sketch.com -->
    <title>chooseus/solution</title>
    <desc>Created with Sketch.</desc>
    <g id="chooseus/solution" stroke="none" stroke-width="1" fill="none" fill-rule="evenodd">
        <circle id="Oval" fill="#F1F6FF" cx="30" cy="30" r="30"></circle>
        <g id="idea" transform="translate(13.000000, 11.000000)" fill="#0066FF" fill-rule="nonzero">
            <path d="M17.4224265,6.61763832 C11.5830147,6.65904412 6.70867647,11.5486765 6.70941176,17.4096324 C6.70985294,20.65875 8.15367647,23.7033824 10.6707353,25.7630147 C11.1805882,26.1802206 11.4964706,26.7633824 11.5605882,27.39 C11.5290441,27.5779412 11.5506618,27.36125 11.5441176,32.0588235 C11.5441176,32.6679412 12.0379412,33.1617647 12.6470588,33.1617647 L13.0514706,33.1617647 L13.0514706,33.1985294 C13.0514706,35.6514706 15.0470588,37.6470588 17.5,37.6470588 C19.9529412,37.6470588 21.9485294,35.6514706 21.9485294,33.1985294 L21.9485294,33.1617647 L22.3529412,33.1617647 C22.9620588,33.1617647 23.4558824,32.6679412 23.4558824,32.0588235 C23.4486029,27.3798529 23.4730882,27.5668382 23.4363971,27.3702206 C23.4897794,26.76 23.7813971,26.2040441 24.2561765,25.8223529 C26.8201471,23.76125 28.2905882,20.6944118 28.2905882,17.4081618 C28.2905882,11.4031618 23.4046324,6.57360294 17.4224265,6.61763832 Z M21.25,28.6764706 L21.25,30.9558824 L13.75,30.9558824 L13.75,28.6764706 L21.25,28.6764706 Z M19.7426471,33.1985294 C19.7426471,34.4351471 18.7366176,35.4411765 17.5,35.4411765 C16.2633824,35.4411765 15.2573529,34.4351471 15.2573529,33.1985294 L15.2573529,33.1617647 L19.7426471,33.1617647 L19.7426471,33.1985294 Z M22.8740441,24.1030882 C22.1148529,24.7133824 21.5911765,25.5436765 21.3581618,26.4705882 L13.6281618,26.4705882 C13.3827206,25.5369853 12.8441912,24.6913235 12.0676471,24.0558088 C10.0646324,22.4167647 8.91566176,19.9942647 8.91529412,17.4093382 C8.91470588,12.7880147 12.8175735,8.85625 17.4379412,8.82375 C17.4588235,8.82352941 17.4794853,8.82352941 17.5002941,8.82352941 C22.2428676,8.82352941 26.0847059,12.6609559 26.0847059,17.4081618 C26.0847059,20.0226471 24.9144118,22.4628676 22.8740441,24.1030882 Z" id="Shape"></path>
            <path d="M21.0886029,15.1580147 L18.6029412,17.0865441 L18.6029412,16.0294118 C18.6029412,15.1135294 17.5471324,14.5967647 16.8238971,15.1580147 L12.5591912,18.4668382 C12.0779412,18.8402206 11.9904412,19.5330882 12.3638971,20.0143382 C12.7377941,20.4963235 13.4308088,20.5825735 13.9113971,20.2096324 L16.3970588,18.2811029 L16.3970588,19.3382353 C16.3970588,20.2540441 17.4528676,20.7709559 18.1761029,20.2096324 L22.4408088,16.9008088 C22.9220588,16.5274265 23.0095588,15.8345588 22.6361029,15.3533088 C22.2627206,14.8720588 21.5699265,14.7846324 21.0886029,15.1580147 Z" id="Path"></path>
            <path d="M17.5,4.48529412 C18.1091176,4.48529412 18.6029412,3.99147059 18.6029412,3.38235294 L18.6029412,1.10294118 C18.6029412,0.493823529 18.1091176,0 17.5,0 C16.8908824,0 16.3970588,0.493823529 16.3970588,1.10294118 L16.3970588,3.38235294 C16.3970588,3.99147059 16.8908824,4.48529412 17.5,4.48529412 Z" id="Path"></path>
            <path d="M6.76338235,8.28639706 C7.19404412,8.71713235 7.89242647,8.71720588 8.32316176,8.28639706 C8.75389706,7.85566176 8.75389706,7.15735294 8.32316176,6.72661765 L6.71139706,5.11485294 C6.28073529,4.68411765 5.58235294,4.68411765 5.15161765,5.11485294 C4.72088235,5.54558824 4.72088235,6.24389706 5.15161765,6.67463235 L6.76338235,8.28639706 Z" id="Path"></path>
            <path d="M4.52205882,17.4632353 C4.52205882,16.8541176 4.02823529,16.3602941 3.41911765,16.3602941 L1.13970588,16.3602941 C0.530588235,16.3602941 0.0367647059,16.8541176 0.0367647059,17.4632353 C0.0367647059,18.0723529 0.530588235,18.5661765 1.13970588,18.5661765 L3.41911765,18.5661765 C4.02823529,18.5661765 4.52205882,18.0723529 4.52205882,17.4632353 Z" id="Path"></path>
            <path d="M33.8602941,16.3602941 L31.5808824,16.3602941 C30.9717647,16.3602941 30.4779412,16.8541176 30.4779412,17.4632353 C30.4779412,18.0723529 30.9717647,18.5661765 31.5808824,18.5661765 L33.8602941,18.5661765 C34.4694118,18.5661765 34.9632353,18.0723529 34.9632353,17.4632353 C34.9632353,16.8541176 34.4694118,16.3602941 33.8602941,16.3602941 Z" id="Path"></path>
            <path d="M33.0369853,22.7050735 L30.9311029,21.8327941 C30.3683824,21.5996324 29.7231618,21.8669118 29.49,22.4297059 C29.2569118,22.9925 29.5241176,23.6376471 30.0869118,23.8708088 L32.1927941,24.7430882 C32.7577206,24.9771324 33.4016176,24.7067647 33.6338971,24.1461765 C33.8669853,23.5833088 33.5997794,22.9381618 33.0369853,22.7050735 Z" id="Path"></path>
            <path d="M11.0925,4.87625 C11.3252941,5.43816176 11.97,5.70661765 12.5336029,5.47316176 C13.0963971,5.24007353 13.3636029,4.59485294 13.1305147,4.03205882 L12.2582353,1.92617647 C12.0250735,1.36345588 11.3799265,1.09625 10.8171324,1.32926471 C10.2543382,1.56235294 9.98713235,2.20757353 10.2202206,2.77036765 L11.0925,4.87625 Z" id="Path"></path>
            <path d="M4.91301471,11.0557353 L2.80713235,10.1834559 C2.24433824,9.95029412 1.59919118,10.2175735 1.36602941,10.7803676 C1.13294118,11.3431618 1.40014706,11.9883088 1.96294118,12.2214706 L4.06882353,13.09375 C4.63375,13.3277941 5.27764706,13.0574265 5.50992647,12.4968382 C5.74301471,11.9340441 5.47580882,11.2888235 4.91301471,11.0557353 Z" id="Path"></path>
            <path d="M28.2366176,8.28639706 L29.8483824,6.67463235 C30.2791176,6.24389706 30.2791176,5.54558824 29.8483824,5.11485294 C29.4177206,4.68411765 28.7193382,4.68411765 28.2886029,5.11485294 L26.6768382,6.72661765 C26.2461029,7.15735294 26.2461029,7.85566176 26.6768382,8.28639706 C27.1074265,8.71713235 27.8058824,8.71720588 28.2366176,8.28639706 Z" id="Path"></path>
            <path d="M22.4663971,5.47323529 C23.0313971,5.70720588 23.6752206,5.43691176 23.9075,4.87632353 L24.7797794,2.77044118 C25.0128676,2.20764706 24.7456618,1.5625 24.1828676,1.32933824 C23.6200735,1.09632353 22.9749265,1.36345588 22.7417647,1.92625 L21.8694853,4.03213235 C21.6363971,4.59492647 21.9036765,5.24007353 22.4663971,5.47323529 Z" id="Path"></path>
            <path d="M4.06889706,21.8327941 L1.96301471,22.7050735 C1.40022059,22.9381618 1.13301471,23.5833824 1.36610294,24.1461765 C1.59882353,24.7080147 2.24360294,24.9766176 2.80720588,24.7430882 L4.91308824,23.8708088 C5.47588235,23.6377206 5.74308824,22.9925 5.51,22.4297059 C5.27683824,21.8669118 4.63176471,21.5995588 4.06889706,21.8327941 L4.06889706,21.8327941 Z" id="Path"></path>
            <path d="M29.49,12.4968382 C29.7227206,13.0586765 30.3675,13.3272794 30.9311029,13.09375 L33.0369853,12.2214706 C33.5997794,11.9883824 33.8669853,11.3431618 33.6338971,10.7803676 C33.4008088,10.2175735 32.7556618,9.95029412 32.1927941,10.1834559 L30.0869118,11.0557353 C29.5241912,11.2888235 29.2569853,11.9340441 29.49,12.4968382 Z" id="Path"></path>
        </g>
    </g>
</svg>