<?xml version="1.0" encoding="UTF-8"?>
<svg width="80px" height="80px" viewBox="0 0 80 80" version="1.1" xmlns="http://www.w3.org/2000/svg" xmlns:xlink="http://www.w3.org/1999/xlink">
    <!-- Generator: Sketch 60.1 (88133) - https://sketch.com -->
    <title>marketplace</title>
    <desc>Created with Sketch.</desc>
    <g id="✓-WebsiteApproved" stroke="none" stroke-width="1" fill="none" fill-rule="evenodd">
        <g id="XE-Web-Landing-01.01" transform="translate(-135.000000, -2149.000000)">
            <g id="FourthSection" transform="translate(0.000000, 1646.000000)">
                <g id="Group-4" transform="translate(135.000000, 393.000000)">
                    <g id="marketplace" transform="translate(0.000000, 110.000000)">
                        <rect id="Rectangle" fill="#F1F6FF" opacity="0.200000003" x="0" y="0" width="80" height="80" rx="40"></rect>
                        <g id="shopping-store" transform="translate(20.000000, 21.000000)" fill="#FFFFFF" fill-rule="nonzero" stroke="#FFFFFF">
                            <path d="M36.7946503,36.0178768 L3.12733352,36.0178768 C2.8121819,36.0178768 2.55670103,35.762396 2.55670103,35.4472444 L2.55670103,15.663416 C2.55670103,15.3482644 2.8121819,15.0927835 3.12733352,15.0927835 C3.44248514,15.0927835 3.69796601,15.3482644 3.69796601,15.663416 L3.69796601,34.8766119 L36.2240178,34.8766119 L36.2240178,15.663416 C36.2240178,15.3482644 36.4794987,15.0927835 36.7946503,15.0927835 C37.1098019,15.0927835 37.3652828,15.3482644 37.3652828,15.663416 L37.3652828,35.4472444 C37.3652828,35.762396 37.1098019,36.0178768 36.7946503,36.0178768 Z" id="Path"></path>
                            <path d="M39.3736417,10.8799109 L0.570632488,10.8799109 C0.375735537,10.8789913 0.194787357,10.7786636 0.0907647807,10.6138457 C-0.0132577955,10.4490277 -0.0259659456,10.2425176 0.0570632488,10.0661889 L4.62212315,0.365436612 C4.71585037,0.166375819 4.91567215,0.0389339247 5.13569239,0.0378935417 L34.8085818,0.0378935417 C35.029634,0.0378935417 35.2308359,0.165445555 35.3250042,0.365436612 L39.8900641,10.0661889 C39.9733063,10.2429756 39.9603011,10.450063 39.8555956,10.6150465 C39.7508901,10.7800299 39.5690458,10.8799109 39.3736417,10.8799109 Z M1.46994929,9.73864586 L38.4743249,9.73864586 L34.4462301,1.17915854 L5.49804402,1.17915854 L1.46994929,9.73864586 Z" id="Shape"></path>
                            <path d="M36.1398674,16.2746704 C34.039887,16.2721543 32.3382323,14.5702443 32.3360312,12.4702636 L32.3360312,10.3092784 C32.3360312,9.99412673 32.5915121,9.73864586 32.9066637,9.73864586 L39.3736417,9.73864586 C39.6887933,9.73864586 39.9442742,9.99412673 39.9442742,10.3092784 L39.9442742,12.4702636 C39.9417587,14.5703366 38.2399404,16.2721549 36.1398674,16.2746704 Z M33.4772962,10.8799108 L33.4772962,12.4702636 C33.4632333,13.4309006 33.9676727,14.3246454 34.7973441,14.8090694 C35.6270156,15.2934934 36.6532898,15.2934934 37.4829612,14.8090694 C38.3126327,14.3246454 38.8170721,13.4309006 38.8030092,12.4702636 L38.8030092,10.8799108 L33.4772962,10.8799108 Z" id="Shape"></path>
                            <path d="M29.6728894,16.2746704 C27.5728163,16.2721549 25.870998,14.5703366 25.8684826,12.4702636 L25.8684826,10.3092784 C25.8684826,9.99412673 26.1239635,9.73864586 26.4391151,9.73864586 L32.9066637,9.73864586 C33.2218153,9.73864586 33.4772962,9.99412673 33.4772962,10.3092784 L33.4772962,12.4702636 C33.4747807,14.5703366 31.7729624,16.2721549 29.6728894,16.2746704 Z M27.0097476,10.8799108 L27.0097476,12.4702636 C27.0097476,13.9410762 28.2020768,15.1334054 29.6728894,15.1334054 C31.143702,15.1334054 32.3360312,13.9410762 32.3360312,12.4702636 L32.3360312,10.8799108 L27.0097476,10.8799108 Z" id="Shape"></path>
                            <path d="M23.2059114,16.2746704 C21.1058383,16.2721549 19.40402,14.5703366 19.4015046,12.4702636 L19.4015046,10.3092784 C19.4015046,9.99412673 19.6569855,9.73864586 19.9721371,9.73864586 L26.4391151,9.73864586 C26.7542667,9.73864586 27.0097476,9.99412673 27.0097476,10.3092784 L27.0097476,12.4702636 C27.0075465,14.5702443 25.3058918,16.2721543 23.2059114,16.2746704 Z M20.5427696,10.8799108 L20.5427696,12.4702636 C20.5287067,13.4309006 21.0331461,14.3246454 21.8628175,14.8090694 C22.692489,15.2934934 23.7187632,15.2934934 24.5484346,14.8090694 C25.378106,14.3246454 25.8825455,13.4309006 25.8684826,12.4702636 L25.8684826,10.8799108 L20.5427696,10.8799108 Z" id="Shape"></path>
                            <path d="M16.7383628,16.2746704 C14.6383824,16.2721543 12.9367277,14.5702443 12.9345266,12.4702636 L12.9345266,10.3092784 C12.9345266,9.99412673 13.1900075,9.73864586 13.5051591,9.73864586 L19.9721371,9.73864586 C20.2872887,9.73864586 20.5427696,9.99412673 20.5427696,10.3092784 L20.5427696,12.4702636 C20.5402541,14.5703366 18.8384358,16.2721549 16.7383628,16.2746704 Z M14.0757916,10.8799108 L14.0757916,12.4702636 C14.0617287,13.4309006 14.5661681,14.3246454 15.3958395,14.8090694 C16.225511,15.2934934 17.2517852,15.2934934 18.0814566,14.8090694 C18.9111281,14.3246454 19.4155675,13.4309006 19.4015046,12.4702636 L19.4015046,10.8799108 L14.0757916,10.8799108 Z" id="Shape"></path>
                            <path d="M10.2713848,16.2746704 C8.17131174,16.2721549 6.46949343,14.5703366 6.46697799,12.4702636 L6.46697799,10.3092784 C6.46697799,9.99412673 6.72245886,9.73864586 7.03761048,9.73864586 L13.5051591,9.73864586 C13.8203107,9.73864586 14.0757916,9.99412673 14.0757916,10.3092784 L14.0757916,12.4702636 C14.0732761,14.5703366 12.3714578,16.2721549 10.2713848,16.2746704 Z M7.60824296,10.8799108 L7.60824296,12.4702636 C7.60824296,13.9410762 8.80057217,15.1334054 10.2713848,15.1334054 C11.7421974,15.1334054 12.9345266,13.9410762 12.9345266,12.4702636 L12.9345266,10.8799108 L7.60824296,10.8799108 Z" id="Shape"></path>
                            <path d="M3.8044068,16.2746704 C1.70433375,16.2721549 0.00251543681,14.5703366 0,12.4702636 L0,10.3092784 C0,9.99412673 0.255480867,9.73864586 0.570632488,9.73864586 L7.03761048,9.73864586 C7.3527621,9.73864586 7.60824296,9.99412673 7.60824296,10.3092784 L7.60824296,12.4702636 C7.60604191,14.5702443 5.90438718,16.2721543 3.8044068,16.2746704 Z M1.14126498,10.8799108 L1.14126498,12.4702636 C1.12720206,13.4309006 1.63164152,14.3246454 2.46131294,14.8090694 C3.29098436,15.2934934 4.3172586,15.2934934 5.14693002,14.8090694 C5.97660145,14.3246454 6.4810409,13.4309006 6.46697799,12.4702636 L6.46697799,10.8799108 L1.14126498,10.8799108 Z" id="Shape"></path>
                            <path d="M29.9939418,35.9587629 L10.0060582,35.9587629 C9.44473396,35.9587629 8.98969072,35.5031074 8.98969072,34.9410279 L8.98969072,21.94557 C8.99025055,21.0766626 9.69325551,20.3722565 10.5609949,20.371134 L29.4390051,20.371134 C30.3067445,20.3722565 31.0097494,21.0766626 31.0103093,21.94557 L31.0103093,34.9410279 C31.0103093,35.5031074 30.555266,35.9587629 29.9939418,35.9587629 Z M10.0618557,34.9251332 L29.8556701,34.9251332 L29.8556701,21.5257732 L10.0618557,21.5257732 L10.0618557,34.9251332 Z" id="Shape"></path>
                            <path d="M32.907805,10.879911 C32.6415134,10.8795716 32.4108592,10.6950956 32.3520089,10.4353881 L30.1493675,0.734635832 C30.0878412,0.430788743 30.2801615,0.133402312 30.5825057,0.0648709665 C30.8848499,-0.00366037942 31.1866011,0.181736488 31.2621009,0.482416272 L33.4647423,10.1831686 C33.5031022,10.3524509 33.4623277,10.5299897 33.3539509,10.6655717 C33.2455742,10.8011536 33.0813791,10.8800369 32.907805,10.879911 L32.907805,10.879911 Z" id="Path"></path>
                            <path d="M26.3169997,10.8799115 C26.0407089,10.8794774 25.8044186,10.6811666 25.756068,10.409139 L24.0264809,0.708386737 C23.9753539,0.40002871 24.1818167,0.107925344 24.4895605,0.0532222887 C24.7973042,-0.00148076643 25.0917846,0.201577346 25.1500563,0.508665366 L26.8790727,10.2094177 C26.934038,10.5194858 26.7274375,10.8154685 26.417431,10.8707807 C26.3843059,10.8769056 26.3506863,10.8799115 26.3169997,10.8799115 Z" id="Path"></path>
                            <path d="M7.03646921,10.879911 C6.86289511,10.8800369 6.69869999,10.8011536 6.59032325,10.6655717 C6.48194652,10.5299897 6.44117197,10.3524509 6.4795319,10.1831686 L8.68217331,0.482416272 C8.7232575,0.279522481 8.87100244,0.114791472 9.0682472,0.0519559045 C9.26549195,-0.0108796627 9.48129766,0.0380362971 9.6321714,0.179778723 C9.78304514,0.321521149 9.84532159,0.533857008 9.79490666,0.734635832 L7.59226525,10.4353881 C7.53341499,10.6950956 7.30276078,10.8795716 7.03646921,10.879911 Z" id="Path"></path>
                            <path d="M13.6272744,10.8799115 C13.5935878,10.8799115 13.5599683,10.8769056 13.5268431,10.8707807 C13.2168367,10.8154685 13.0102362,10.5194858 13.0652014,10.2094177 L14.7942179,0.508665366 C14.8524896,0.201577346 15.1469699,-0.00148076643 15.4547137,0.0532222887 C15.7624575,0.107925344 15.9689203,0.40002871 15.9177933,0.708386737 L14.1882062,10.409139 C14.1398556,10.6811666 13.9035652,10.8794774 13.6272744,10.8799115 Z" id="Path"></path>
                            <path d="M19.9721371,10.8799108 C19.6569855,10.8799108 19.4015046,10.62443 19.4015046,10.3092784 L19.4015046,0.608526052 C19.4015046,0.293374431 19.6569855,0.0378935637 19.9721371,0.0378935637 C20.2872887,0.0378935637 20.5427696,0.293374431 20.5427696,0.608526052 L20.5427696,10.3092784 C20.5427696,10.62443 20.2872887,10.8799108 19.9721371,10.8799108 Z" id="Path"></path>
                        </g>
                    </g>
                </g>
            </g>
        </g>
    </g>
</svg>