<?xml version="1.0" encoding="UTF-8"?>
<svg width="16px" height="22px" viewBox="0 0 16 22" version="1.1" xmlns="http://www.w3.org/2000/svg" xmlns:xlink="http://www.w3.org/1999/xlink">
    <!-- Generator: Sketch 60.1 (88133) - https://sketch.com -->
    <title>Group</title>
    <desc>Created with Sketch.</desc>
    <g id="✓-WebsiteApproved" stroke="none" stroke-width="1" fill="none" fill-rule="evenodd">
        <g id="XE-Web-Landing-01.01" transform="translate(-663.000000, -740.000000)">
            <g id="FirstSection">
                <g id="Group-7" transform="translate(649.000000, 725.000000)">
                    <g id="Group-2" transform="translate(15.000000, 16.000000)">
                        <g id="Group">
                            <rect id="Rectangle" fill="#A7AEC3" x="5.33333333" y="3.33333333" width="2.66666667" height="5.33333333" rx="1.33333333"></rect>
                            <rect id="Rectangle" stroke="#A7AEC3" stroke-width="2" x="0" y="0" width="13.3333333" height="20" rx="6.66666667"></rect>
                            <path d="M5.23809524,11.3333333 C5.55368652,11.3333333 5.80952381,11.5891706 5.80952381,11.9047619 L5.80866667,14.1903333 L8.0952381,14.1904762 C8.41082938,14.1904762 8.66666667,14.4463135 8.66666667,14.7619048 C8.66666667,15.077496 8.41082938,15.3333333 8.0952381,15.3333333 L5.25028141,15.333206 C5.24622958,15.3332907 5.24216738,15.3333333 5.23809524,15.3333333 C4.92250395,15.3333333 4.66666667,15.077496 4.66666667,14.7619048 L4.66666667,11.9047619 C4.66666667,11.5891706 4.92250395,11.3333333 5.23809524,11.3333333 Z" id="Combined-Shape" fill="#A7AEC3" transform="translate(6.666667, 13.333333) rotate(-45.000000) translate(-6.666667, -13.333333) "></path>
                        </g>
                    </g>
                </g>
            </g>
        </g>
    </g>
</svg>