<?xml version="1.0" encoding="UTF-8"?>
<svg width="80px" height="80px" viewBox="0 0 80 80" version="1.1" xmlns="http://www.w3.org/2000/svg" xmlns:xlink="http://www.w3.org/1999/xlink">
    <!-- Generator: Sketch 60.1 (88133) - https://sketch.com -->
    <title>earn</title>
    <desc>Created with Sketch.</desc>
    <g id="✓-WebsiteApproved" stroke="none" stroke-width="1" fill="none" fill-rule="evenodd">
        <g id="XE-Web-Landing-01.01" transform="translate(-135.000000, -2259.000000)">
            <g id="FourthSection" transform="translate(0.000000, 1646.000000)">
                <g id="Group-4" transform="translate(135.000000, 393.000000)">
                    <g id="earn" transform="translate(0.000000, 220.000000)">
                        <rect id="Rectangle" fill="#F1F6FF" opacity="0.200000003" x="0" y="0" width="80" height="80" rx="40"></rect>
                        <g id="percent" transform="translate(22.000000, 20.000000)" fill="#FFFFFF" fill-rule="nonzero">
                            <path d="M1.12903226,38.7096774 L11.8817204,38.7096774 C12.4752688,38.7096774 12.9569892,38.2290323 12.9569892,37.6344086 L12.9569892,36.5591398 L15.9290323,36.5591398 L20.0032258,38.5967742 C20.1516129,38.6709677 20.3172043,38.7096774 20.483871,38.7096774 L33.3870968,38.7096774 C35.1655914,38.7096774 36.6129032,37.2623656 36.6129032,35.483871 C36.6129032,34.6548387 36.2892473,33.9053763 35.7741935,33.3333333 C36.2903226,32.7612903 36.6129032,32.011828 36.6129032,31.1827957 C36.6129032,30.3537634 36.2892473,29.6043011 35.7741935,29.0322581 C36.2903226,28.4602151 36.6129032,27.7107527 36.6129032,26.8817204 C36.6129032,26.0526882 36.2892473,25.3032258 35.7741935,24.7311828 C36.2903226,24.1591398 36.6129032,23.4096774 36.6129032,22.5806452 C36.6129032,20.8021505 35.1655914,19.3548387 33.3870968,19.3548387 L25.8602151,19.3548387 L25.8602151,12.9032258 C25.8602151,10.5311828 23.9311828,8.60215054 21.5591398,8.60215054 L20.483871,8.60215054 C19.8903226,8.60215054 19.4086022,9.0827957 19.4086022,9.67741935 L19.4086022,15.683871 L15.7376344,19.3548387 L12.9569892,19.3548387 L12.9569892,18.2795699 C12.9569892,17.6849462 12.4752688,17.2043011 11.8817204,17.2043011 L1.12903226,17.2043011 C0.535483871,17.2043011 0.0537634409,17.6849462 0.0537634409,18.2795699 L0.0537634409,37.6344086 C0.0537634409,38.2290323 0.535483871,38.7096774 1.12903226,38.7096774 Z M16.1827957,21.5053763 C16.4677419,21.5053763 16.7419355,21.3924731 16.9430108,21.1903226 L21.244086,16.8892473 C21.4462366,16.688172 21.5591398,16.4150538 21.5591398,16.1290323 L21.5591398,10.7526882 C22.7451613,10.7526882 23.7096774,11.7172043 23.7096774,12.9032258 L23.7096774,20.4301075 C23.7096774,21.0247312 24.1913978,21.5053763 24.7849462,21.5053763 L33.3870968,21.5053763 C33.9795699,21.5053763 34.4623656,21.9870968 34.4623656,22.5806452 C34.4623656,23.1741935 33.9795699,23.655914 33.3870968,23.655914 L25.8602151,23.655914 L25.8602151,25.8064516 L33.3870968,25.8064516 C33.9795699,25.8064516 34.4623656,26.288172 34.4623656,26.8817204 C34.4623656,27.4752688 33.9795699,27.9569892 33.3870968,27.9569892 L25.8602151,27.9569892 L25.8602151,30.1075269 L33.3870968,30.1075269 C33.9795699,30.1075269 34.4623656,30.5892473 34.4623656,31.1827957 C34.4623656,31.7763441 33.9795699,32.2580645 33.3870968,32.2580645 L25.8602151,32.2580645 L25.8602151,34.4086022 L33.3870968,34.4086022 C33.9795699,34.4086022 34.4623656,34.8903226 34.4623656,35.483871 C34.4623656,36.0774194 33.9795699,36.5591398 33.3870968,36.5591398 L20.7376344,36.5591398 L16.6634409,34.5215054 C16.5150538,34.4473118 16.3494624,34.4086022 16.1827957,34.4086022 L12.9569892,34.4086022 L12.9569892,21.5053763 L16.1827957,21.5053763 Z M2.20430108,19.3548387 L10.8064516,19.3548387 L10.8064516,36.5591398 L2.20430108,36.5591398 L2.20430108,19.3548387 Z" id="Shape"></path>
                            <polygon id="Path" points="20.483871 0 22.6344086 0 22.6344086 5.37634409 20.483871 5.37634409"></polygon>
                            <polygon id="Path" transform="translate(28.005756, 4.304996) rotate(-45.000000) translate(-28.005756, -4.304996) " points="24.9648179 3.2298898 31.046695 3.2298898 31.046695 5.38010268 24.9648179 5.38010268"></polygon>
                            <polygon id="Path" transform="translate(15.103606, 4.304681) rotate(-45.000000) translate(-15.103606, -4.304681) " points="14.0284995 1.26374262 16.1787124 1.26374262 16.1787124 7.34561975 14.0284995 7.34561975"></polygon>
                        </g>
                    </g>
                </g>
            </g>
        </g>
    </g>
</svg>