<?xml version="1.0" encoding="UTF-8"?>
<svg width="40px" height="40px" viewBox="0 0 40 40" version="1.1" xmlns="http://www.w3.org/2000/svg" xmlns:xlink="http://www.w3.org/1999/xlink">
    <!-- Generator: Sketch 60.1 (88133) - https://sketch.com -->
    <title>instagram</title>
    <desc>Created with Sketch.</desc>
    <g id="Symbols" stroke="none" stroke-width="1" fill="none" fill-rule="evenodd">
        <g id="Footer/web" transform="translate(-1397.000000, -246.000000)" fill="#E4E8F6" fill-rule="nonzero">
            <g id="Group-3" transform="translate(1347.000000, 246.000000)">
                <g id="instagram" transform="translate(50.000000, 0.000000)">
                    <path d="M23.828125,20 C23.828125,22.1142578 22.1142578,23.828125 20,23.828125 C17.8857422,23.828125 16.171875,22.1142578 16.171875,20 C16.171875,17.8857422 17.8857422,16.171875 20,16.171875 C22.1142578,16.171875 23.828125,17.8857422 23.828125,20 Z" id="Path"></path>
                    <path d="M28.9526367,13.2269287 C28.7686157,12.7282715 28.4750366,12.2769165 28.0935669,11.9064331 C27.7230835,11.5249634 27.2720337,11.2313843 26.7730713,11.0473633 C26.3684082,10.8901977 25.760498,10.703125 24.6408081,10.6521606 C23.4295655,10.5969238 23.0664063,10.585022 20,10.585022 C16.9332886,10.585022 16.5701294,10.5966187 15.3591919,10.6518555 C14.239502,10.703125 13.6312866,10.8901977 13.2269288,11.0473633 C12.7279663,11.2313843 12.2766113,11.5249634 11.9064331,11.9064331 C11.5249634,12.2769165 11.2313843,12.7279663 11.0470581,13.2269287 C10.8898926,13.6315918 10.7028198,14.2398071 10.6518555,15.359497 C10.5966187,16.5704345 10.5847168,16.9335937 10.5847168,20.0003052 C10.5847168,23.0667114 10.5966187,23.4298706 10.6518555,24.6411133 C10.7028198,25.7608032 10.8898926,26.3687134 11.0470581,26.7733765 C11.2313843,27.2723389 11.5246582,27.7233887 11.906128,28.093872 C12.2766113,28.4753418 12.7276611,28.7689209 13.2266235,28.9529419 C13.6312866,29.1104126 14.239502,29.2974853 15.3591919,29.3484497 C16.5701294,29.4036866 16.9329834,29.4152832 19.9996948,29.4152832 C23.0667114,29.4152832 23.4298706,29.4036866 24.640503,29.3484497 C25.7601929,29.2974853 26.3684082,29.1104126 26.7730713,28.9529419 C27.7746582,28.5665894 28.5662842,27.7749634 28.9526367,26.7733765 C29.1098023,26.3687134 29.296875,25.7608032 29.3481445,24.6411133 C29.4033813,23.4298706 29.414978,23.0667114 29.414978,20.0003052 C29.414978,16.9335937 29.4033813,16.5704345 29.3481445,15.359497 C29.2971802,14.2398071 29.1101074,13.6315918 28.9526367,13.2269287 L28.9526367,13.2269287 Z M20,25.8972168 C16.7428589,25.8972168 14.102478,23.2571411 14.102478,20 C14.102478,16.7428589 16.7428589,14.1027832 20,14.1027832 C23.2568359,14.1027832 25.8972168,16.7428589 25.8972168,20 C25.8972168,23.2571411 23.2568359,25.8972168 20,25.8972168 Z M26.1303711,15.2478027 C25.3692627,15.2478027 24.7521973,14.6307373 24.7521973,13.8696289 C24.7521973,13.1085205 25.3692627,12.4914551 26.1303711,12.4914551 C26.8914795,12.4914551 27.5085449,13.1085205 27.5085449,13.8696289 C27.5082398,14.6307373 26.8914795,15.2478027 26.1303711,15.2478027 Z" id="Shape"></path>
                    <path d="M20,0 C8.95599367,0 0,8.95599367 0,20 C0,31.0440063 8.95599367,40 20,40 C31.0440063,40 40,31.0440063 40,20 C40,8.95599367 31.0440063,0 20,0 Z M31.4151001,24.7348023 C31.3595581,25.9573364 31.1651611,26.7919922 30.8813477,27.522583 C30.284729,29.0652466 29.0652466,30.284729 27.522583,30.8813477 C26.7922973,31.1651611 25.9573364,31.359253 24.7351074,31.4151001 C23.510437,31.4709473 23.1192016,31.484375 20.0003052,31.484375 C16.8811035,31.484375 16.4901734,31.4709473 15.2651977,31.4151001 C14.0429688,31.359253 13.2080078,31.1651611 12.4777222,30.8813477 C11.7111206,30.5929566 11.0171509,30.1409913 10.4434204,29.5565796 C9.85931398,28.9831543 9.40734859,28.2888794 9.1189575,27.522583 C8.83514406,26.7922973 8.64074703,25.9573364 8.58520508,24.7351074 C8.52874758,23.5101319 8.515625,23.1188965 8.515625,20 C8.515625,16.8811035 8.52874758,16.4898681 8.58489992,15.2651977 C8.64044188,14.0426636 8.83453367,13.2080078 9.11834719,12.477417 C9.40673828,11.7111206 9.85900875,11.0168457 10.4434204,10.4434204 C11.0168457,9.85900875 11.7111206,9.40704344 12.477417,9.11865234 C13.2080078,8.83483891 14.0426636,8.64074703 15.2651977,8.58489992 C16.4898681,8.52905273 16.8811035,8.515625 20,8.515625 C23.1188965,8.515625 23.5101319,8.52905273 24.7348023,8.58520508 C25.9573364,8.64074703 26.7919922,8.83483891 27.522583,9.11834719 C28.2888794,9.40673828 28.9831543,9.85900875 29.5568848,10.4434204 C30.1409913,11.0171509 30.5932617,11.7111206 30.8813477,12.477417 C31.1654663,13.2080078 31.3595581,14.0426636 31.4154053,15.2651977 C31.4712524,16.4898681 31.484375,16.8811035 31.484375,20 C31.484375,23.1188965 31.4712524,23.5101319 31.4151001,24.7348023 L31.4151001,24.7348023 Z" id="Shape"></path>
                </g>
            </g>
        </g>
    </g>
</svg>