<?xml version="1.0" encoding="UTF-8"?>
<svg width="8px" height="12px" viewBox="0 0 8 12" version="1.1" xmlns="http://www.w3.org/2000/svg" xmlns:xlink="http://www.w3.org/1999/xlink">
    <!-- Generator: Sketch 60.1 (88133) - https://sketch.com -->
    <title>Combined Shape</title>
    <desc>Created with Sketch.</desc>
    <g id="✓-WebsiteApproved" stroke="none" stroke-width="1" fill="none" fill-rule="evenodd">
        <g id="XE-Web-Login-01.01" transform="translate(-866.000000, -520.000000)" fill="#FFFFFF">
            <g id="Group-9" transform="translate(235.000000, 121.000000)">
                <g id="Group-10" transform="translate(510.000000, 30.000000)">
                    <g id="login" transform="translate(0.000000, 70.000000)">
                        <g id="getstarted" transform="translate(0.000000, 280.000000)">
                            <path d="M120,29 C119.447715,29 119,28.5522847 119,28 L119,22 C119,21.4477153 119.447715,21 120,21 L120.285714,21 C120.837999,21 121.285714,21.4477153 121.285714,22 L121.285,26.714 L126,26.7142857 C126.552285,26.7142857 127,27.162001 127,27.7142857 L127,28 C127,28.5522847 126.552285,29 126,29 L120,29 Z" id="Combined-Shape" transform="translate(123.000000, 25.000000) rotate(-135.000000) translate(-123.000000, -25.000000) "></path>
                        </g>
                    </g>
                </g>
            </g>
        </g>
    </g>
</svg>