<?xml version="1.0" encoding="UTF-8" standalone="no"?>
<svg
   xmlns:dc="http://purl.org/dc/elements/1.1/"
   xmlns:cc="http://creativecommons.org/ns#"
   xmlns:rdf="http://www.w3.org/1999/02/22-rdf-syntax-ns#"
   xmlns:svg="http://www.w3.org/2000/svg"
   xmlns="http://www.w3.org/2000/svg"
   xmlns:sodipodi="http://sodipodi.sourceforge.net/DTD/sodipodi-0.dtd"
   xmlns:inkscape="http://www.inkscape.org/namespaces/inkscape"
   width="536.64801"
   height="224"
   viewBox="0 0 141.98811 59.266667"
   version="1.1"
   id="svg83"
   inkscape:version="1.0.2-2 (e86c870879, 2021-01-15)"
   sodipodi:docname="Marketing_dark.svg"
   inkscape:export-filename="C:\Users\pc\Desktop\Fedora\Logos\Marketing_dark.png"
   inkscape:export-xdpi="96"
   inkscape:export-ydpi="96">
  <defs
     id="defs77" />
  <sodipodi:namedview
     id="base"
     pagecolor="#ffffff"
     bordercolor="#666666"
     borderopacity="1.0"
     inkscape:pageopacity="0.0"
     inkscape:pageshadow="2"
     inkscape:zoom="1"
     inkscape:cx="256.32142"
     inkscape:cy="73.043817"
     inkscape:document-units="mm"
     inkscape:current-layer="layer1"
     inkscape:document-rotation="0"
     showgrid="false"
     units="px"
     inkscape:window-width="1366"
     inkscape:window-height="705"
     inkscape:window-x="-8"
     inkscape:window-y="-8"
     inkscape:window-maximized="1"
     inkscape:snap-nodes="true"
     inkscape:snap-others="true" />
  <metadata
     id="metadata80">
    <rdf:RDF>
      <cc:Work
         rdf:about="">
        <dc:format>image/svg+xml</dc:format>
        <dc:type
           rdf:resource="http://purl.org/dc/dcmitype/StillImage" />
        <dc:title />
      </cc:Work>
    </rdf:RDF>
  </metadata>
  <g
     inkscape:label="Layer 1"
     inkscape:groupmode="layer"
     id="layer1">
    <rect
       inkscape:export-ydpi="96"
       inkscape:export-xdpi="96"
       ry="2.4178782"
       rx="2.2046289"
       y="0"
       x="0"
       height="59.266666"
       width="141.98811"
       id="rect1560"
       style="fill:#000000;fill-opacity:1;stroke:none;stroke-width:0.520482;stroke-linecap:round;stroke-linejoin:round;stroke-miterlimit:4;stroke-dasharray:none;stroke-dashoffset:0;stroke-opacity:1"
       inkscape:export-filename="/home/duffy/Cáipéisí/Work/Fedora/Tickets/620 - logo/2020 edits/Set 1/2020-19.png" />
    <text
       id="text1568"
       y="33.753902"
       x="34.232574"
       style="font-style:normal;font-weight:normal;font-size:15.6113px;line-height:1.25;font-family:sans-serif;letter-spacing:0px;word-spacing:0px;fill:#ffffff;fill-opacity:1;stroke:none;stroke-width:0.390284;"
       xml:space="preserve"><tspan
         style="font-style:normal;font-variant:normal;font-weight:600;font-stretch:normal;font-family:Montserrat;-inkscape-font-specification:'Montserrat Semi-Bold';letter-spacing:-0.268273px;fill:#ffffff;fill-opacity:1;stroke-width:0.390284;"
         y="33.753902"
         x="34.232574"
         id="tspan1566"
         sodipodi:role="line">MARKETING</tspan></text>
    <path
       id="path1819"
       style="fill:#ffffff;fill-opacity:1;fill-rule:nonzero;stroke:none;stroke-width:0.446876"
       d="m 20.360029,18.233 c -5.306206,0 -9.606592,4.299088 -9.61005,9.604337 h -0.0025 v 7.439312 h 0.0025 c 0.0025,1.204425 0.978384,2.179351 2.183355,2.179351 h 0.01013 0.0025 7.418499 c 5.306815,-0.0034 9.605946,-4.303874 9.605946,-9.610469 0,-5.308848 -4.301424,-9.612531 -9.61005,-9.612531 z m 1.947813,3.955215 c 1.613961,0 3.137811,1.236728 3.137811,2.941318 0,0.15809 -7.48e-4,0.316374 -0.0266,0.495669 -0.04471,0.45353 -0.458139,0.77878 -0.909387,0.714847 -0.451248,-0.06469 -0.757333,-0.491898 -0.673845,-0.940148 0.0076,-0.05118 0.01013,-0.132288 0.01013,-0.270368 0,-0.966463 -0.790318,-1.339578 -1.538188,-1.339578 -0.747415,0 -1.421703,0.628524 -1.423476,1.339578 0.01292,0.822502 0,1.639115 0,2.459966 l 1.386615,-0.01051 c 1.082988,-0.02245 1.095123,1.610028 0.01267,1.601741 l -1.398902,0.01051 c -0.0038,0.66156 0.0051,0.541426 0.0025,0.874619 0,0 0.0114,0.808069 -0.01267,1.421499 -0.167407,1.801604 -1.700756,3.242397 -3.543344,3.242397 -1.952993,0 -3.563827,-1.597894 -3.563827,-3.555784 0.05865,-2.014164 1.666277,-3.597133 3.688761,-3.578327 l 1.126499,-0.0084 v 1.599692 l -1.126499,0.01051 h -0.0076 c -1.111564,0.03285 -2.06274,0.786135 -2.080942,1.976574 0,1.08469 0.876541,1.954056 1.964203,1.954056 1.085851,0 1.953956,-0.7909 1.953956,-1.952002 0.01267,-1.925564 -0.0089,-4.052628 -0.0025,-6.052637 5.95e-4,-0.112374 0.0063,-0.201723 0.01837,-0.32567 0.183354,-1.480762 1.507825,-2.609505 3.006721,-2.609505 z" />
  </g>
</svg>
