<?xml version="1.0" encoding="UTF-8" standalone="no"?>
<svg
   xmlns:dc="http://purl.org/dc/elements/1.1/"
   xmlns:cc="http://creativecommons.org/ns#"
   xmlns:rdf="http://www.w3.org/1999/02/22-rdf-syntax-ns#"
   xmlns:svg="http://www.w3.org/2000/svg"
   xmlns="http://www.w3.org/2000/svg"
   xmlns:sodipodi="http://sodipodi.sourceforge.net/DTD/sodipodi-0.dtd"
   xmlns:inkscape="http://www.inkscape.org/namespaces/inkscape"
   width="545.77899"
   height="224"
   viewBox="0 0 144.40402 59.266667"
   version="1.1"
   id="svg83"
   inkscape:version="1.0.2-2 (e86c870879, 2021-01-15)"
   sodipodi:docname="Advocates_dark.svg"
   inkscape:export-filename="C:\Users\pc\Desktop\Fedora\Logos\Advocates_dark.png"
   inkscape:export-xdpi="96"
   inkscape:export-ydpi="96">
  <defs
     id="defs77" />
  <sodipodi:namedview
     id="base"
     pagecolor="#ffffff"
     bordercolor="#666666"
     borderopacity="1.0"
     inkscape:pageopacity="0.0"
     inkscape:pageshadow="2"
     inkscape:zoom="0.8"
     inkscape:cx="336.16537"
     inkscape:cy="105.64382"
     inkscape:document-units="mm"
     inkscape:current-layer="layer1"
     inkscape:document-rotation="0"
     showgrid="false"
     units="px"
     inkscape:window-width="1366"
     inkscape:window-height="705"
     inkscape:window-x="-8"
     inkscape:window-y="-8"
     inkscape:window-maximized="1"
     inkscape:snap-nodes="true"
     inkscape:snap-others="true" />
  <metadata
     id="metadata80">
    <rdf:RDF>
      <cc:Work
         rdf:about="">
        <dc:format>image/svg+xml</dc:format>
        <dc:type
           rdf:resource="http://purl.org/dc/dcmitype/StillImage" />
        <dc:title />
      </cc:Work>
    </rdf:RDF>
  </metadata>
  <g
     inkscape:label="Layer 1"
     inkscape:groupmode="layer"
     id="layer1">
    <rect
       inkscape:export-ydpi="96"
       inkscape:export-xdpi="96"
       ry="2.4178782"
       rx="2.242142"
       y="0"
       x="0"
       height="59.266666"
       width="144.40413"
       id="rect1560"
       style="fill:#000000;fill-opacity:1;stroke:none;stroke-width:0.524891;stroke-linecap:round;stroke-linejoin:round;stroke-miterlimit:4;stroke-dasharray:none;stroke-dashoffset:0;stroke-opacity:1"
       inkscape:export-filename="/home/duffy/Cáipéisí/Work/Fedora/Tickets/620 - logo/2020 edits/Set 1/2020-19.png" />
    <text
       id="text1568"
       y="33.753902"
       x="34.232574"
       style="font-style:normal;font-weight:normal;font-size:15.6113px;line-height:1.25;font-family:sans-serif;letter-spacing:0px;word-spacing:0px;fill:#ffffff;fill-opacity:1;stroke:none;stroke-width:0.390284;"
       xml:space="preserve"><tspan
         style="font-style:normal;font-variant:normal;font-weight:600;font-stretch:normal;font-family:Montserrat;-inkscape-font-specification:'Montserrat Semi-Bold';letter-spacing:-0.268273px;fill:#ffffff;fill-opacity:1;stroke-width:0.390284;"
         y="33.753902"
         x="34.232574"
         id="tspan1566"
         sodipodi:role="line">ADVOCATES</tspan></text>
    <path
       id="path1819"
       style="fill:#ffffff;fill-opacity:1;fill-rule:nonzero;stroke:none;stroke-width:0.446882"
       d="m 20.360436,18.233 c -5.306375,0 -9.606886,4.299088 -9.610345,9.604338 h -0.0022 v 7.439311 h 0.0022 c 0.0024,1.204425 0.978408,2.179351 2.183423,2.179351 h 0.01026 0.0022 7.418729 c 5.306978,-0.0034 9.606249,-4.303873 9.606249,-9.610469 0,-5.308846 -4.301562,-9.612531 -9.610346,-9.612531 z m 1.947877,3.955215 c 1.614009,0 3.137906,1.23673 3.137906,2.941318 0,0.15809 -7.44e-4,0.316376 -0.02662,0.495669 -0.04467,0.45353 -0.458157,0.77878 -0.909418,0.714847 -0.451262,-0.06469 -0.757359,-0.491897 -0.673871,-0.940148 0.0076,-0.05118 0.01026,-0.132287 0.01026,-0.270368 0,-0.966463 -0.790338,-1.339579 -1.538229,-1.339579 -0.747438,0 -1.421745,0.628526 -1.423528,1.339579 0.01293,0.822502 0,1.639116 0,2.459967 l 1.38666,-0.01051 c 1.083022,-0.02245 1.095164,1.610028 0.01228,1.60174 l -1.398949,0.01051 c -0.0036,0.661558 0.0052,0.541425 0.0022,0.874618 0,0 0.01191,0.808069 -0.01228,1.4215 -0.167417,1.801605 -1.700808,3.242396 -3.543456,3.242396 -1.953057,0 -3.56394,-1.597894 -3.56394,-3.555784 0.05866,-2.014162 1.66633,-3.597131 3.688881,-3.578327 l 1.126534,-0.0084 v 1.599693 l -1.126534,0.01051 h -0.0083 c -1.111605,0.03284 -2.062806,0.786134 -2.081012,1.976573 0,1.08469 0.876575,1.954056 1.964264,1.954056 1.085883,0 1.954022,-0.790899 1.954022,-1.952002 0.01228,-1.925563 -0.0086,-4.052628 -0.0022,-6.052637 5.98e-4,-0.112373 0.0061,-0.201723 0.01843,-0.32567 0.183362,-1.480761 1.50788,-2.609503 3.006817,-2.609503 z" />
  </g>
</svg>
