<?xml version="1.0" encoding="UTF-8" standalone="no"?>
<svg
   xmlns:dc="http://purl.org/dc/elements/1.1/"
   xmlns:cc="http://creativecommons.org/ns#"
   xmlns:rdf="http://www.w3.org/1999/02/22-rdf-syntax-ns#"
   xmlns:svg="http://www.w3.org/2000/svg"
   xmlns="http://www.w3.org/2000/svg"
   xmlns:xlink="http://www.w3.org/1999/xlink"
   xmlns:sodipodi="http://sodipodi.sourceforge.net/DTD/sodipodi-0.dtd"
   xmlns:inkscape="http://www.inkscape.org/namespaces/inkscape"
   id="svg4326"
   version="1.1"
   inkscape:version="1.0.2-2 (e86c870879, 2021-01-15)"
   width="256"
   height="256"
   sodipodi:docname="marketing.svg"
   inkscape:export-filename="C:\Users\pc\Desktop\Fedora\badges\marketing.png"
   inkscape:export-xdpi="90"
   inkscape:export-ydpi="90">
  <metadata
     id="metadata4332">
    <rdf:RDF>
      <cc:Work
         rdf:about="">
        <dc:format>image/svg+xml</dc:format>
        <dc:type
           rdf:resource="http://purl.org/dc/dcmitype/StillImage" />
        <dc:title />
      </cc:Work>
    </rdf:RDF>
  </metadata>
  <defs
     id="defs4330">
    <inkscape:path-effect
       effect="spiro"
       id="path-effect1479"
       is_visible="true"
       lpeversion="1" />
    <linearGradient
       id="linearGradient40097">
      <stop
         style="stop-color:#c4c7cc;stop-opacity:1;"
         offset="0"
         id="stop40099" />
      <stop
         style="stop-color:#eff0f1;stop-opacity:1;"
         offset="1"
         id="stop40101" />
    </linearGradient>
    <linearGradient
       id="linearGradient39902">
      <stop
         style="stop-color:#79db32;stop-opacity:1;"
         offset="0"
         id="stop39904" />
      <stop
         style="stop-color:#000000;stop-opacity:1;"
         offset="1"
         id="stop39906" />
    </linearGradient>
    <linearGradient
       id="linearGradient37905">
      <stop
         style="stop-color:#294172;stop-opacity:1;"
         offset="0"
         id="stop37907" />
      <stop
         id="stop37913"
         offset="0.74811548"
         style="stop-color:#acc4e4;stop-opacity:1;" />
      <stop
         style="stop-color:#6a82ab;stop-opacity:1;"
         offset="0.90435892"
         id="stop37917" />
      <stop
         style="stop-color:#294172;stop-opacity:1;"
         offset="1"
         id="stop37909" />
    </linearGradient>
    <linearGradient
       id="linearGradient11208">
      <stop
         style="stop-color:#ffffff;stop-opacity:1;"
         offset="0"
         id="stop11210" />
      <stop
         style="stop-color:#8faed9;stop-opacity:1;"
         offset="1"
         id="stop11212" />
    </linearGradient>
    <linearGradient
       inkscape:collect="always"
       xlink:href="#linearGradient23243-0"
       id="linearGradient11673"
       gradientUnits="userSpaceOnUse"
       x1="452.89532"
       y1="692.18036"
       x2="549.71472"
       y2="588.13464" />
    <linearGradient
       inkscape:collect="always"
       id="linearGradient23243-0">
      <stop
         style="stop-color:#db3279;stop-opacity:1;"
         offset="0"
         id="stop23245-9" />
      <stop
         style="stop-color:#db3279;stop-opacity:0;"
         offset="1"
         id="stop23247-6" />
    </linearGradient>
    <linearGradient
       inkscape:collect="always"
       xlink:href="#linearGradient29617-7"
       id="linearGradient11675"
       gradientUnits="userSpaceOnUse"
       x1="500.41754"
       y1="598.07538"
       x2="531.51129"
       y2="682.98608" />
    <linearGradient
       inkscape:collect="always"
       id="linearGradient29617-7">
      <stop
         style="stop-color:#6e0733;stop-opacity:1;"
         offset="0"
         id="stop29619-3" />
      <stop
         style="stop-color:#6e0733;stop-opacity:0;"
         offset="1"
         id="stop29621-9" />
    </linearGradient>
    <linearGradient
       inkscape:collect="always"
       xlink:href="#linearGradient17017-5"
       id="linearGradient11677"
       gradientUnits="userSpaceOnUse"
       x1="477.17944"
       y1="4054.9666"
       x2="507.65854"
       y2="4028.2605" />
    <linearGradient
       id="linearGradient17017-5">
      <stop
         style="stop-color:#313b31;stop-opacity:1;"
         offset="0"
         id="stop17019-8" />
      <stop
         style="stop-color:#313b31;stop-opacity:0.62711865;"
         offset="1"
         id="stop17021-3" />
    </linearGradient>
    <linearGradient
       inkscape:collect="always"
       xlink:href="#linearGradient22742-8"
       id="linearGradient11679"
       gradientUnits="userSpaceOnUse"
       x1="297.87323"
       y1="273.94583"
       x2="337.01941"
       y2="237.20154" />
    <linearGradient
       inkscape:collect="always"
       id="linearGradient22742-8">
      <stop
         style="stop-color:#361f00;stop-opacity:1;"
         offset="0"
         id="stop22744-4" />
      <stop
         style="stop-color:#361f00;stop-opacity:0;"
         offset="1"
         id="stop22746-6" />
    </linearGradient>
    <filter
       color-interpolation-filters="sRGB"
       id="filter22728-9"
       inkscape:label="Drop shadow"
       width="1.5"
       height="1.5"
       x="-0.25"
       y="-0.25">
      <feGaussianBlur
         id="feGaussianBlur22730-3"
         in="SourceAlpha"
         stdDeviation="0.2"
         result="blur" />
      <feColorMatrix
         id="feColorMatrix22732-4"
         result="bluralpha"
         type="matrix"
         values="1 0 0 0 0 0 1 0 0 0 0 0 1 0 0 0 0 0 0.9 0 " />
      <feOffset
         id="feOffset22734-1"
         in="bluralpha"
         dx="-0.4"
         dy="0.2"
         result="offsetBlur" />
      <feMerge
         id="feMerge22736-7">
        <feMergeNode
           id="feMergeNode22738-0"
           in="offsetBlur" />
        <feMergeNode
           id="feMergeNode22740-2"
           in="SourceGraphic" />
      </feMerge>
    </filter>
    <linearGradient
       inkscape:collect="always"
       xlink:href="#linearGradient6887"
       id="linearGradient6893"
       x1="152.47856"
       y1="86.949074"
       x2="146.28004"
       y2="95.386421"
       gradientUnits="userSpaceOnUse"
       gradientTransform="matrix(0.83323544,0,0,0.83323544,24.800776,16.151034)" />
    <linearGradient
       inkscape:collect="always"
       id="linearGradient6887">
      <stop
         style="stop-color:#294172;stop-opacity:1;"
         offset="0"
         id="stop6889" />
      <stop
         style="stop-color:#294172;stop-opacity:0;"
         offset="1"
         id="stop6891" />
    </linearGradient>
    <linearGradient
       gradientTransform="translate(-0.38360769,1.5340371)"
       inkscape:collect="always"
       xlink:href="#linearGradient5318"
       id="linearGradient6072"
       x1="192.24194"
       y1="149.56042"
       x2="193.39502"
       y2="200.54347"
       gradientUnits="userSpaceOnUse" />
    <linearGradient
       id="linearGradient5318">
      <stop
         style="stop-color:#ffffff;stop-opacity:1;"
         offset="0"
         id="stop5320" />
      <stop
         style="stop-color:#000000;stop-opacity:1;"
         offset="1"
         id="stop5322" />
    </linearGradient>
    <linearGradient
       gradientTransform="translate(-0.38360769,1.5340371)"
       inkscape:collect="always"
       xlink:href="#linearGradient5318"
       id="linearGradient5332"
       x1="170.92427"
       y1="157.8367"
       x2="171.42072"
       y2="129.09328"
       gradientUnits="userSpaceOnUse" />
    <linearGradient
       id="linearGradient7719">
      <stop
         style="stop-color:#ffffff;stop-opacity:1;"
         offset="0"
         id="stop7721" />
      <stop
         style="stop-color:#000000;stop-opacity:1;"
         offset="1"
         id="stop7723" />
    </linearGradient>
    <linearGradient
       gradientTransform="translate(-0.38360769,1.5340371)"
       inkscape:collect="always"
       xlink:href="#linearGradient5318"
       id="linearGradient6104"
       x1="72.742928"
       y1="192.52098"
       x2="101.91525"
       y2="216.92775"
       gradientUnits="userSpaceOnUse" />
    <linearGradient
       id="linearGradient7726">
      <stop
         style="stop-color:#ffffff;stop-opacity:1;"
         offset="0"
         id="stop7728" />
      <stop
         style="stop-color:#000000;stop-opacity:1;"
         offset="1"
         id="stop7730" />
    </linearGradient>
    <linearGradient
       gradientTransform="translate(-0.38360769,1.5340371)"
       inkscape:collect="always"
       xlink:href="#linearGradient5318"
       id="linearGradient6096"
       x1="98.179436"
       y1="193.99844"
       x2="130.60793"
       y2="222.77711"
       gradientUnits="userSpaceOnUse" />
    <linearGradient
       id="linearGradient7733">
      <stop
         style="stop-color:#ffffff;stop-opacity:1;"
         offset="0"
         id="stop7735" />
      <stop
         style="stop-color:#000000;stop-opacity:1;"
         offset="1"
         id="stop7737" />
    </linearGradient>
    <linearGradient
       gradientTransform="translate(-0.38360769,1.5340371)"
       inkscape:collect="always"
       xlink:href="#linearGradient5318"
       id="linearGradient6112"
       x1="69.313126"
       y1="160.86015"
       x2="75.712608"
       y2="206.14597"
       gradientUnits="userSpaceOnUse" />
    <linearGradient
       id="linearGradient7740">
      <stop
         style="stop-color:#ffffff;stop-opacity:1;"
         offset="0"
         id="stop7742" />
      <stop
         style="stop-color:#000000;stop-opacity:1;"
         offset="1"
         id="stop7744" />
    </linearGradient>
    <linearGradient
       gradientTransform="translate(-0.38360769,1.5340371)"
       inkscape:collect="always"
       xlink:href="#linearGradient5318"
       id="linearGradient6056"
       x1="91.991798"
       y1="154.2856"
       x2="92.195442"
       y2="131.70004"
       gradientUnits="userSpaceOnUse" />
    <linearGradient
       id="linearGradient7747">
      <stop
         style="stop-color:#ffffff;stop-opacity:1;"
         offset="0"
         id="stop7749" />
      <stop
         style="stop-color:#000000;stop-opacity:1;"
         offset="1"
         id="stop7751" />
    </linearGradient>
    <linearGradient
       inkscape:collect="always"
       xlink:href="#linearGradient5318"
       id="linearGradient6064"
       x1="592.83405"
       y1="237.41403"
       x2="658.74683"
       y2="258.24808"
       gradientUnits="userSpaceOnUse" />
    <linearGradient
       id="linearGradient7754">
      <stop
         style="stop-color:#ffffff;stop-opacity:1;"
         offset="0"
         id="stop7756" />
      <stop
         style="stop-color:#000000;stop-opacity:1;"
         offset="1"
         id="stop7758" />
    </linearGradient>
    <linearGradient
       inkscape:collect="always"
       xlink:href="#linearGradient5318"
       id="linearGradient5324"
       x1="291.72986"
       y1="354.82562"
       x2="293.57449"
       y2="443.88025"
       gradientUnits="userSpaceOnUse" />
    <linearGradient
       id="linearGradient7761">
      <stop
         style="stop-color:#ffffff;stop-opacity:1;"
         offset="0"
         id="stop7763" />
      <stop
         style="stop-color:#000000;stop-opacity:1;"
         offset="1"
         id="stop7765" />
    </linearGradient>
    <radialGradient
       inkscape:collect="always"
       xlink:href="#linearGradient4947-5-0-7-3-9"
       id="radialGradient18291-2-4-0-3"
       gradientUnits="userSpaceOnUse"
       gradientTransform="matrix(-0.7316961,2.1285669,-1.4003566,-0.48137343,676.25046,-226.37449)"
       cx="237.44824"
       cy="189.28197"
       fx="237.44824"
       fy="189.28197"
       r="13.88452" />
    <linearGradient
       id="linearGradient4947-5-0-7-3-9">
      <stop
         id="stop4949-2-7-0-6-9"
         offset="0"
         style="stop-color:#fbf8fc;stop-opacity:1;" />
      <stop
         style="stop-color:#c37fff;stop-opacity:0.49803922;"
         offset="0.48298526"
         id="stop4953-5-5-1-1-7" />
      <stop
         id="stop4951-8-6-5-9-0"
         offset="1"
         style="stop-color:#492063;stop-opacity:1;" />
    </linearGradient>
    <linearGradient
       gradientTransform="matrix(1.4616718,0,0,1.4616718,-338.62059,-317.56702)"
       inkscape:collect="always"
       xlink:href="#linearGradient32286"
       id="linearGradient32314"
       x1="320.47412"
       y1="289.18347"
       x2="319.35144"
       y2="312.03287"
       gradientUnits="userSpaceOnUse" />
    <linearGradient
       inkscape:collect="always"
       id="linearGradient32286">
      <stop
         style="stop-color:#1d2c4a;stop-opacity:1;"
         offset="0"
         id="stop32288" />
      <stop
         style="stop-color:#1d2c4a;stop-opacity:0;"
         offset="1"
         id="stop32290" />
    </linearGradient>
    <linearGradient
       gradientTransform="translate(-0.38360769,1.5340371)"
       inkscape:collect="always"
       xlink:href="#linearGradient6879"
       id="linearGradient6885"
       x1="127.13274"
       y1="97.141052"
       x2="114.34079"
       y2="107.49597"
       gradientUnits="userSpaceOnUse" />
    <linearGradient
       inkscape:collect="always"
       id="linearGradient6879">
      <stop
         style="stop-color:#294172;stop-opacity:1;"
         offset="0"
         id="stop6881" />
      <stop
         style="stop-color:#294172;stop-opacity:0;"
         offset="1"
         id="stop6883" />
    </linearGradient>
    <linearGradient
       gradientTransform="matrix(1.4616718,0,0,1.4616718,-371.07765,-618.37027)"
       inkscape:collect="always"
       xlink:href="#linearGradient15830-5-0"
       id="linearGradient32304"
       x1="340.70831"
       y1="466.18604"
       x2="338.97745"
       y2="507.3194"
       gradientUnits="userSpaceOnUse" />
    <linearGradient
       id="linearGradient15830-5-0">
      <stop
         style="stop-color:#ffffff;stop-opacity:1;"
         offset="0"
         id="stop15832-7-1" />
      <stop
         style="stop-color:#ffffcf;stop-opacity:0;"
         offset="1"
         id="stop15834-1-1" />
    </linearGradient>
    <linearGradient
       inkscape:collect="always"
       xlink:href="#linearGradient5318"
       id="linearGradient8585"
       gradientUnits="userSpaceOnUse"
       x1="592.83405"
       y1="237.41403"
       x2="658.74683"
       y2="258.24808" />
    <linearGradient
       inkscape:collect="always"
       xlink:href="#linearGradient5318"
       id="linearGradient8587"
       gradientUnits="userSpaceOnUse"
       gradientTransform="translate(-231.25996,17.258174)"
       x1="91.991798"
       y1="154.2856"
       x2="92.195442"
       y2="131.70004" />
    <linearGradient
       inkscape:collect="always"
       xlink:href="#linearGradient5318"
       id="linearGradient8589"
       gradientUnits="userSpaceOnUse"
       gradientTransform="translate(-231.25996,17.258174)"
       x1="69.313126"
       y1="160.86015"
       x2="75.712608"
       y2="206.14597" />
    <linearGradient
       inkscape:collect="always"
       xlink:href="#linearGradient5318"
       id="linearGradient8591"
       gradientUnits="userSpaceOnUse"
       gradientTransform="translate(-231.25996,17.258174)"
       x1="98.179436"
       y1="193.99844"
       x2="130.60793"
       y2="222.77711" />
    <linearGradient
       inkscape:collect="always"
       xlink:href="#linearGradient5318"
       id="linearGradient8593"
       gradientUnits="userSpaceOnUse"
       gradientTransform="translate(-231.25996,17.258174)"
       x1="72.742928"
       y1="192.52098"
       x2="101.91525"
       y2="216.92775" />
    <linearGradient
       inkscape:collect="always"
       xlink:href="#linearGradient5318"
       id="linearGradient8595"
       gradientUnits="userSpaceOnUse"
       gradientTransform="translate(-231.25996,17.258174)"
       x1="170.92427"
       y1="157.8367"
       x2="171.42072"
       y2="129.09328" />
    <linearGradient
       inkscape:collect="always"
       xlink:href="#linearGradient5318"
       id="linearGradient8597"
       gradientUnits="userSpaceOnUse"
       gradientTransform="translate(-231.25996,17.258174)"
       x1="192.24194"
       y1="149.56042"
       x2="193.39502"
       y2="200.54347" />
    <radialGradient
       inkscape:collect="always"
       xlink:href="#linearGradient4123-8-9"
       id="radialGradient16298"
       gradientUnits="userSpaceOnUse"
       gradientTransform="matrix(0.91987058,1.0040795,-1.1410488,1.0453515,2112.1869,-1131.7579)"
       cx="1046.8716"
       cy="1777.5768"
       fx="1046.8716"
       fy="1777.5768"
       r="32.499802" />
    <linearGradient
       id="linearGradient4123-8-9">
      <stop
         style="stop-color:#ffffff;stop-opacity:1;"
         offset="0"
         id="stop4125-6-9" />
      <stop
         id="stop4155-5-2"
         offset="0.5"
         style="stop-color:#ffffff;stop-opacity:0.49152541;" />
      <stop
         style="stop-color:#ffffff;stop-opacity:0"
         offset="1"
         id="stop4127-3-7" />
    </linearGradient>
    <clipPath
       clipPathUnits="userSpaceOnUse"
       id="clipPath16933">
      <path
         style="fill:none;stroke:none;display:inline"
         id="path16935"
         d="m 1089.3409,1795.1414 c 0,-16.7572 -13.5836,-30.3419 -30.3402,-30.3419 -16.7489,0 -30.3272,13.5735 -30.3393,30.3205 l -9e-4,-9e-4 0,23.4796 9e-4,10e-4 c 0.01,3.8024 3.0927,6.8807 6.8975,6.8807 0.01,0 0.021,-9e-4 0.033,-9e-4 l 0,9e-4 23.4189,0 0,0 c 16.7518,-0.01 30.3287,-13.5865 30.3287,-30.3389 z"
         inkscape:connector-curvature="0"
         clip-path="none" />
    </clipPath>
    <linearGradient
       id="linearGradient9915">
      <stop
         style="stop-color:#ffffff;stop-opacity:1;"
         offset="0"
         id="stop9917" />
      <stop
         id="stop9919"
         offset="0.5"
         style="stop-color:#ffffff;stop-opacity:0.49152541;" />
      <stop
         style="stop-color:#ffffff;stop-opacity:0"
         offset="1"
         id="stop9921" />
    </linearGradient>
    <linearGradient
       id="linearGradient9924">
      <stop
         style="stop-color:#ffffff;stop-opacity:1;"
         offset="0"
         id="stop9926" />
      <stop
         id="stop9928"
         offset="0.5"
         style="stop-color:#ffffff;stop-opacity:0.49152541;" />
      <stop
         style="stop-color:#ffffff;stop-opacity:0"
         offset="1"
         id="stop9930" />
    </linearGradient>
    <linearGradient
       id="linearGradient9933">
      <stop
         style="stop-color:#ffffff;stop-opacity:1;"
         offset="0"
         id="stop9935" />
      <stop
         id="stop9937"
         offset="0.5"
         style="stop-color:#ffffff;stop-opacity:0.49152541;" />
      <stop
         style="stop-color:#ffffff;stop-opacity:0"
         offset="1"
         id="stop9939" />
    </linearGradient>
    <linearGradient
       id="linearGradient9942">
      <stop
         style="stop-color:#ffffff;stop-opacity:1;"
         offset="0"
         id="stop9944" />
      <stop
         id="stop9946"
         offset="0.5"
         style="stop-color:#ffffff;stop-opacity:0.49152541;" />
      <stop
         style="stop-color:#ffffff;stop-opacity:0"
         offset="1"
         id="stop9948" />
    </linearGradient>
    <linearGradient
       id="linearGradient9951">
      <stop
         style="stop-color:#ffffff;stop-opacity:1;"
         offset="0"
         id="stop9953" />
      <stop
         id="stop9955"
         offset="0.5"
         style="stop-color:#ffffff;stop-opacity:0.49152541;" />
      <stop
         style="stop-color:#ffffff;stop-opacity:0"
         offset="1"
         id="stop9957" />
    </linearGradient>
    <linearGradient
       id="linearGradient9960">
      <stop
         style="stop-color:#ffffff;stop-opacity:1;"
         offset="0"
         id="stop9962" />
      <stop
         id="stop9964"
         offset="0.5"
         style="stop-color:#ffffff;stop-opacity:0.49152541;" />
      <stop
         style="stop-color:#ffffff;stop-opacity:0"
         offset="1"
         id="stop9966" />
    </linearGradient>
    <linearGradient
       id="linearGradient9969">
      <stop
         style="stop-color:#ffffff;stop-opacity:1;"
         offset="0"
         id="stop9971" />
      <stop
         id="stop9973"
         offset="0.5"
         style="stop-color:#ffffff;stop-opacity:0.49152541;" />
      <stop
         style="stop-color:#ffffff;stop-opacity:0"
         offset="1"
         id="stop9975" />
    </linearGradient>
    <linearGradient
       id="linearGradient9978">
      <stop
         style="stop-color:#ffffff;stop-opacity:1;"
         offset="0"
         id="stop9980" />
      <stop
         id="stop9982"
         offset="0.5"
         style="stop-color:#ffffff;stop-opacity:0.49152541;" />
      <stop
         style="stop-color:#ffffff;stop-opacity:0"
         offset="1"
         id="stop9984" />
    </linearGradient>
    <linearGradient
       id="linearGradient9987">
      <stop
         style="stop-color:#ffffff;stop-opacity:1;"
         offset="0"
         id="stop9989" />
      <stop
         id="stop9991"
         offset="0.5"
         style="stop-color:#ffffff;stop-opacity:0.49152541;" />
      <stop
         style="stop-color:#ffffff;stop-opacity:0"
         offset="1"
         id="stop9993" />
    </linearGradient>
    <linearGradient
       id="linearGradient9996">
      <stop
         style="stop-color:#ffffff;stop-opacity:1;"
         offset="0"
         id="stop9998" />
      <stop
         id="stop10000"
         offset="0.5"
         style="stop-color:#ffffff;stop-opacity:0.49152541;" />
      <stop
         style="stop-color:#ffffff;stop-opacity:0"
         offset="1"
         id="stop10002" />
    </linearGradient>
    <linearGradient
       id="linearGradient10005">
      <stop
         style="stop-color:#ffffff;stop-opacity:1;"
         offset="0"
         id="stop10007" />
      <stop
         id="stop10009"
         offset="0.5"
         style="stop-color:#ffffff;stop-opacity:0.49152541;" />
      <stop
         style="stop-color:#ffffff;stop-opacity:0"
         offset="1"
         id="stop10011" />
    </linearGradient>
    <radialGradient
       inkscape:collect="always"
       xlink:href="#linearGradient4123-8-9"
       id="radialGradient16296"
       gradientUnits="userSpaceOnUse"
       gradientTransform="matrix(0.91987058,1.0040795,-1.1410488,1.0453515,2112.1869,-1131.7579)"
       cx="1046.8716"
       cy="1777.5768"
       fx="1046.8716"
       fy="1777.5768"
       r="32.499802" />
    <linearGradient
       id="linearGradient10014">
      <stop
         style="stop-color:#ffffff;stop-opacity:1;"
         offset="0"
         id="stop10016" />
      <stop
         id="stop10018"
         offset="0.5"
         style="stop-color:#ffffff;stop-opacity:0.49152541;" />
      <stop
         style="stop-color:#ffffff;stop-opacity:0"
         offset="1"
         id="stop10020" />
    </linearGradient>
    <radialGradient
       inkscape:collect="always"
       xlink:href="#linearGradient4123-8-9"
       id="radialGradient10397"
       gradientUnits="userSpaceOnUse"
       gradientTransform="matrix(0.91987058,1.0040795,-1.1410488,1.0453515,2112.1869,-1131.7579)"
       cx="1046.8716"
       cy="1777.5768"
       fx="1046.8716"
       fy="1777.5768"
       r="32.499802" />
    <radialGradient
       inkscape:collect="always"
       xlink:href="#linearGradient4123-8-9"
       id="radialGradient10438"
       gradientUnits="userSpaceOnUse"
       gradientTransform="matrix(0.91987058,1.0040795,-1.1410488,1.0453515,2112.1869,-1131.7579)"
       cx="1046.8716"
       cy="1777.5768"
       fx="1046.8716"
       fy="1777.5768"
       r="32.499802" />
    <radialGradient
       inkscape:collect="always"
       xlink:href="#linearGradient4123-8-9"
       id="radialGradient11300"
       gradientUnits="userSpaceOnUse"
       gradientTransform="matrix(0.91987058,1.0040795,-1.1410488,1.0453515,2112.1869,-1131.7579)"
       cx="1046.8716"
       cy="1777.5768"
       fx="1046.8716"
       fy="1777.5768"
       r="32.499802" />
    <radialGradient
       inkscape:collect="always"
       xlink:href="#linearGradient4123-8-9"
       id="radialGradient11501"
       gradientUnits="userSpaceOnUse"
       gradientTransform="matrix(0.91987058,1.0040795,-1.1410488,1.0453515,2112.1869,-1131.7579)"
       cx="1046.8716"
       cy="1777.5768"
       fx="1046.8716"
       fy="1777.5768"
       r="32.499802" />
    <radialGradient
       inkscape:collect="always"
       xlink:href="#linearGradient11208-1"
       id="radialGradient11360-1"
       gradientUnits="userSpaceOnUse"
       gradientTransform="matrix(-0.27845151,-0.02857569,-0.02657561,0.25896197,479.14511,134.36711)"
       cx="290.83282"
       cy="312.50259"
       fx="290.83282"
       fy="312.50259"
       r="48.435627" />
    <linearGradient
       id="linearGradient11208-1">
      <stop
         style="stop-color:#ffffff;stop-opacity:1;"
         offset="0"
         id="stop11210-4" />
      <stop
         style="stop-color:#8faed9;stop-opacity:1;"
         offset="1"
         id="stop11212-3" />
    </linearGradient>
    <clipPath
       clipPathUnits="userSpaceOnUse"
       id="clipPath11543">
      <path
         sodipodi:nodetypes="ccccc"
         inkscape:connector-curvature="0"
         id="path11545"
         d="m 284.81338,107.37079 c 0,0 19.91393,31.28807 40.12881,40.7949 22.18902,-6.96066 66.2192,-20.33372 66.2192,-20.33372 0,0 -20.10664,-16.05802 -27.9407,-49.510962 -42.40374,7.283604 -78.40731,29.049782 -78.40731,29.049782 z"
         style="fill:none;stroke:#878787;stroke-width:3.73500466;stroke-linecap:butt;stroke-linejoin:miter;stroke-miterlimit:4;stroke-opacity:1;stroke-dasharray:none" />
    </clipPath>
    <linearGradient
       id="linearGradient4219">
      <stop
         id="stop4221"
         offset="0"
         style="stop-color:#cccccc;stop-opacity:1;" />
      <stop
         id="stop4223"
         offset="1"
         style="stop-color:#9a9a9a;stop-opacity:1;" />
    </linearGradient>
    <filter
       id="filter37857"
       inkscape:label="Drop shadow"
       width="1.5"
       height="1.5"
       x="-.25"
       y="-.25">
      <feGaussianBlur
         id="feGaussianBlur37859"
         in="SourceAlpha"
         stdDeviation="1.0851612903225807"
         result="blur" />
      <feColorMatrix
         id="feColorMatrix37861"
         result="bluralpha"
         type="matrix"
         values="-1 0 0 0 1 0 -1 0 0 1 0 0 -1 0 1 0 0 0 1 0 " />
      <feOffset
         id="feOffset37863"
         in="bluralpha"
         dx="-2.77556e-17"
         dy="0"
         result="offsetBlur" />
      <feMerge
         id="feMerge37865"
         result="fbSourceGraphic">
        <feMergeNode
           id="feMergeNode37867"
           in="offsetBlur" />
        <feMergeNode
           id="feMergeNode37869"
           in="SourceGraphic" />
      </feMerge>
      <feColorMatrix
         result="fbSourceGraphicAlpha"
         in="fbSourceGraphic"
         values="0 0 0 -1 0 0 0 0 -1 0 0 0 0 -1 0 0 0 0 1 0"
         id="feColorMatrix37871" />
      <feGaussianBlur
         id="feGaussianBlur37873"
         in="fbSourceGraphicAlpha"
         stdDeviation="2"
         result="blur" />
      <feColorMatrix
         id="feColorMatrix37875"
         result="bluralpha"
         type="matrix"
         values="-1 0 0 0 1 0 -1 0 0 1 0 0 -1 0 1 0 0 0 1 0 " />
      <feOffset
         id="feOffset37877"
         in="bluralpha"
         dx="-2.77556e-17"
         dy="0"
         result="offsetBlur" />
      <feMerge
         id="feMerge37879">
        <feMergeNode
           id="feMergeNode37881"
           in="offsetBlur" />
        <feMergeNode
           id="feMergeNode37883"
           in="fbSourceGraphic" />
      </feMerge>
    </filter>
    <filter
       id="filter38210"
       inkscape:label="Drop shadow"
       width="1.5"
       height="1.5"
       x="-.25"
       y="-.25">
      <feGaussianBlur
         id="feGaussianBlur38212"
         in="SourceAlpha"
         stdDeviation="1"
         result="blur" />
      <feColorMatrix
         id="feColorMatrix38214"
         result="bluralpha"
         type="matrix"
         values="1 0 0 0 0 0 1 0 0 0 0 0 1 0 0 0 0 0 1 0 " />
      <feOffset
         id="feOffset38216"
         in="bluralpha"
         dx="0"
         dy="0.7"
         result="offsetBlur" />
      <feMerge
         id="feMerge38218">
        <feMergeNode
           id="feMergeNode38220"
           in="offsetBlur" />
        <feMergeNode
           id="feMergeNode38222"
           in="SourceGraphic" />
      </feMerge>
    </filter>
    <filter
       id="filter38233"
       inkscape:label="Drop shadow"
       width="1.5"
       height="1.5"
       x="-.25"
       y="-.25">
      <feGaussianBlur
         id="feGaussianBlur38235"
         in="SourceAlpha"
         stdDeviation="1"
         result="blur" />
      <feColorMatrix
         id="feColorMatrix38237"
         result="bluralpha"
         type="matrix"
         values="1 0 0 0 0 0 1 0 0 0 0 0 1 0 0 0 0 0 1 0 " />
      <feOffset
         id="feOffset38239"
         in="bluralpha"
         dx="0"
         dy="0.7"
         result="offsetBlur" />
      <feMerge
         id="feMerge38241">
        <feMergeNode
           id="feMergeNode38243"
           in="offsetBlur" />
        <feMergeNode
           id="feMergeNode38245"
           in="SourceGraphic" />
      </feMerge>
    </filter>
    <pattern
       patternTransform="matrix(1.0251511,0,0,1.0251511,-567.88897,480.33698)"
       id="pattern10196"
       xlink:href="#pattern6268"
       inkscape:collect="always" />
    <pattern
       inkscape:collect="always"
       xlink:href="#pattern6259"
       id="pattern6268"
       patternTransform="translate(-722,2884)" />
    <pattern
       inkscape:collect="always"
       xlink:href="#pattern6356"
       id="pattern6259"
       patternTransform="translate(-722,2924)" />
    <pattern
       inkscape:collect="always"
       xlink:href="#pattern6352"
       id="pattern6356"
       patternTransform="translate(-722,2884)" />
    <pattern
       inkscape:collect="always"
       xlink:href="#pattern6176"
       id="pattern6352"
       patternTransform="translate(-902,2884)" />
    <pattern
       inkscape:collect="always"
       xlink:href="#pattern4998"
       id="pattern6176"
       patternTransform="translate(-902,2844)" />
    <pattern
       inkscape:collect="always"
       xlink:href="#pattern8888"
       id="pattern4998"
       patternTransform="translate(-902,244)" />
    <pattern
       inkscape:collect="always"
       xlink:href="#pattern8884"
       id="pattern8888"
       patternTransform="translate(-902,244)" />
    <pattern
       inkscape:collect="always"
       xlink:href="#pattern8791"
       id="pattern8884"
       patternTransform="translate(-904,0)" />
    <pattern
       inkscape:collect="always"
       xlink:href="#pattern8787"
       id="pattern8791"
       patternTransform="translate(-724,0)" />
    <pattern
       inkscape:collect="always"
       xlink:href="#pattern8783"
       id="pattern8787"
       patternTransform="translate(-536,0)" />
    <pattern
       inkscape:collect="always"
       xlink:href="#pattern8775"
       id="pattern8783"
       patternTransform="translate(-360,0)" />
    <pattern
       inkscape:collect="always"
       xlink:href="#Wavywhite"
       id="pattern8775"
       patternTransform="translate(-180,0)" />
    <pattern
       inkscape:stockid="Wavy white"
       id="Wavywhite"
       height="5.1805778"
       width="30.066020"
       patternUnits="userSpaceOnUse"
       inkscape:collect="always">
      <path
         id="path8532"
         d="M 7.597,0.061 C 5.079,-0.187 2.656,0.302 -0.01,1.788 L -0.01,3.061 C 2.773,1.431 5.173,1.052 7.472,1.280 C 9.770,1.508 11.969,2.361 14.253,3.218 C 18.820,4.931 23.804,6.676 30.066,3.061 L 30.062,1.788 C 23.622,5.497 19.246,3.770 14.691,2.061 C 12.413,1.207 10.115,0.311 7.597,0.061 z "
         style="fill:white;stroke:none;" />
    </pattern>
    <pattern
       patternTransform="matrix(1.0232961,0,0,1.0232961,-566.02375,480.69738)"
       id="pattern10196-3"
       xlink:href="#pattern6268-2"
       inkscape:collect="always" />
    <pattern
       inkscape:collect="always"
       xlink:href="#pattern6259-8"
       id="pattern6268-2"
       patternTransform="translate(-722,2884)" />
    <pattern
       inkscape:collect="always"
       xlink:href="#pattern6356-5"
       id="pattern6259-8"
       patternTransform="translate(-722,2924)" />
    <pattern
       inkscape:collect="always"
       xlink:href="#pattern6352-8"
       id="pattern6356-5"
       patternTransform="translate(-722,2884)" />
    <pattern
       inkscape:collect="always"
       xlink:href="#pattern6176-9"
       id="pattern6352-8"
       patternTransform="translate(-902,2884)" />
    <pattern
       inkscape:collect="always"
       xlink:href="#pattern4998-3"
       id="pattern6176-9"
       patternTransform="translate(-902,2844)" />
    <pattern
       inkscape:collect="always"
       xlink:href="#pattern8888-6"
       id="pattern4998-3"
       patternTransform="translate(-902,244)" />
    <pattern
       inkscape:collect="always"
       xlink:href="#pattern8884-8"
       id="pattern8888-6"
       patternTransform="translate(-902,244)" />
    <pattern
       inkscape:collect="always"
       xlink:href="#pattern8791-4"
       id="pattern8884-8"
       patternTransform="translate(-904,0)" />
    <pattern
       inkscape:collect="always"
       xlink:href="#pattern8787-0"
       id="pattern8791-4"
       patternTransform="translate(-724,0)" />
    <pattern
       inkscape:collect="always"
       xlink:href="#pattern8783-7"
       id="pattern8787-0"
       patternTransform="translate(-536,0)" />
    <pattern
       inkscape:collect="always"
       xlink:href="#pattern8775-5"
       id="pattern8783-7"
       patternTransform="translate(-360,0)" />
    <pattern
       inkscape:collect="always"
       xlink:href="#Wavywhite-5"
       id="pattern8775-5"
       patternTransform="translate(-180,0)" />
    <pattern
       inkscape:stockid="Wavy white"
       id="Wavywhite-5"
       height="5.1805778"
       width="30.066020"
       patternUnits="userSpaceOnUse"
       inkscape:collect="always">
      <path
         id="path8532-3"
         d="M 7.597,0.061 C 5.079,-0.187 2.656,0.302 -0.01,1.788 L -0.01,3.061 C 2.773,1.431 5.173,1.052 7.472,1.280 C 9.770,1.508 11.969,2.361 14.253,3.218 C 18.820,4.931 23.804,6.676 30.066,3.061 L 30.062,1.788 C 23.622,5.497 19.246,3.770 14.691,2.061 C 12.413,1.207 10.115,0.311 7.597,0.061 z "
         style="fill:white;stroke:none;" />
    </pattern>
    <filter
       id="filter6605"
       inkscape:label="Drop shadow"
       inkscape:menu="Blurs"
       inkscape:menu-tooltip="Blur the contents of objects, preserving the outline"
       color-interpolation-filters="sRGB"
       width="1.5"
       height="1.5"
       x="-0.25"
       y="-0.25">
      <feColorMatrix
         id="feColorMatrix6607"
         values="1 0 0 0 0 0 1 0 0 0 0 0 1 0 0 0 0 0 1 0 "
         result="result7" />
      <feGaussianBlur
         id="feGaussianBlur6609"
         result="result6"
         stdDeviation="5" />
      <feComposite
         id="feComposite6611"
         in2="result7"
         operator="atop"
         in="result6"
         result="result91" />
      <feComposite
         id="feComposite6613"
         in2="result91"
         operator="in"
         result="fbSourceGraphic" />
      <feColorMatrix
         result="fbSourceGraphicAlpha"
         in="fbSourceGraphic"
         values="0 0 0 -1 0 0 0 0 -1 0 0 0 0 -1 0 0 0 0 1 0"
         id="feColorMatrix6659" />
      <feColorMatrix
         id="feColorMatrix6661"
         values="1 0 0 0 0 0 1 0 0 0 0 0 1 0 0 0 0 0 1 0 "
         result="result7"
         in="fbSourceGraphic" />
      <feGaussianBlur
         id="feGaussianBlur6663"
         result="result6"
         stdDeviation="5" />
      <feComposite
         id="feComposite6665"
         in2="result7"
         operator="atop"
         in="result6"
         result="result91" />
      <feComposite
         id="feComposite6667"
         in2="result91"
         operator="in"
         result="fbSourceGraphic" />
      <feColorMatrix
         result="fbSourceGraphicAlpha"
         in="fbSourceGraphic"
         values="0 0 0 -1 0 0 0 0 -1 0 0 0 0 -1 0 0 0 0 1 0"
         id="feColorMatrix7823" />
      <feGaussianBlur
         id="feGaussianBlur7825"
         in="fbSourceGraphicAlpha"
         stdDeviation="1"
         result="blur" />
      <feColorMatrix
         id="feColorMatrix7827"
         result="bluralpha"
         type="matrix"
         values="-1 0 0 0 1 0 -1 0 0 1 0 0 -1 0 1 0 0 0 1 0 " />
      <feOffset
         id="feOffset7829"
         in="bluralpha"
         dx="1.5"
         dy="-1.5"
         result="offsetBlur" />
      <feMerge
         id="feMerge7831">
        <feMergeNode
           id="feMergeNode7833"
           in="offsetBlur" />
        <feMergeNode
           id="feMergeNode7835"
           in="fbSourceGraphic" />
      </feMerge>
    </filter>
    <filter
       id="filter6595"
       inkscape:label="Drop shadow"
       inkscape:menu="Blurs"
       inkscape:menu-tooltip="Blur the contents of objects, preserving the outline"
       color-interpolation-filters="sRGB"
       width="1.5"
       height="1.5"
       x="-0.25"
       y="-0.25">
      <feColorMatrix
         id="feColorMatrix6597"
         values="1 0 0 0 0 0 1 0 0 0 0 0 1 0 0 0 0 0 1 0 "
         result="result7" />
      <feGaussianBlur
         id="feGaussianBlur6599"
         result="result6"
         stdDeviation="5" />
      <feComposite
         id="feComposite6601"
         in2="result7"
         operator="atop"
         in="result6"
         result="result91" />
      <feComposite
         id="feComposite6603"
         in2="result91"
         operator="in"
         result="fbSourceGraphic" />
      <feColorMatrix
         result="fbSourceGraphicAlpha"
         in="fbSourceGraphic"
         values="0 0 0 -1 0 0 0 0 -1 0 0 0 0 -1 0 0 0 0 1 0"
         id="feColorMatrix6669" />
      <feColorMatrix
         id="feColorMatrix6671"
         values="1 0 0 0 0 0 1 0 0 0 0 0 1 0 0 0 0 0 1 0 "
         result="result7"
         in="fbSourceGraphic" />
      <feGaussianBlur
         id="feGaussianBlur6673"
         result="result6"
         stdDeviation="5" />
      <feComposite
         id="feComposite6675"
         in2="result7"
         operator="atop"
         in="result6"
         result="result91" />
      <feComposite
         id="feComposite6677"
         in2="result91"
         operator="in"
         result="fbSourceGraphic" />
      <feColorMatrix
         result="fbSourceGraphicAlpha"
         in="fbSourceGraphic"
         values="0 0 0 -1 0 0 0 0 -1 0 0 0 0 -1 0 0 0 0 1 0"
         id="feColorMatrix7837" />
      <feGaussianBlur
         id="feGaussianBlur7839"
         in="fbSourceGraphicAlpha"
         stdDeviation="1"
         result="blur" />
      <feColorMatrix
         id="feColorMatrix7841"
         result="bluralpha"
         type="matrix"
         values="-1 0 0 0 1 0 -1 0 0 1 0 0 -1 0 1 0 0 0 1 0 " />
      <feOffset
         id="feOffset7843"
         in="bluralpha"
         dx="1.5"
         dy="-1.5"
         result="offsetBlur" />
      <feMerge
         id="feMerge7845">
        <feMergeNode
           id="feMergeNode7847"
           in="offsetBlur" />
        <feMergeNode
           id="feMergeNode7849"
           in="fbSourceGraphic" />
      </feMerge>
    </filter>
    <filter
       id="filter6615"
       inkscape:label="Drop shadow"
       inkscape:menu="Blurs"
       inkscape:menu-tooltip="Blur the contents of objects, preserving the outline"
       color-interpolation-filters="sRGB"
       width="1.5"
       height="1.5"
       x="-0.25"
       y="-0.25">
      <feColorMatrix
         id="feColorMatrix6617"
         values="1 0 0 0 0 0 1 0 0 0 0 0 1 0 0 0 0 0 1 0 "
         result="result7" />
      <feGaussianBlur
         id="feGaussianBlur6619"
         result="result6"
         stdDeviation="5" />
      <feComposite
         id="feComposite6621"
         in2="result7"
         operator="atop"
         in="result6"
         result="result91" />
      <feComposite
         id="feComposite6623"
         in2="result91"
         operator="in"
         result="fbSourceGraphic" />
      <feColorMatrix
         result="fbSourceGraphicAlpha"
         in="fbSourceGraphic"
         values="0 0 0 -1 0 0 0 0 -1 0 0 0 0 -1 0 0 0 0 1 0"
         id="feColorMatrix6679" />
      <feColorMatrix
         id="feColorMatrix6681"
         values="1 0 0 0 0 0 1 0 0 0 0 0 1 0 0 0 0 0 1 0 "
         result="result7"
         in="fbSourceGraphic" />
      <feGaussianBlur
         id="feGaussianBlur6683"
         result="result6"
         stdDeviation="5" />
      <feComposite
         id="feComposite6685"
         in2="result7"
         operator="atop"
         in="result6"
         result="result91" />
      <feComposite
         id="feComposite6687"
         in2="result91"
         operator="in"
         result="fbSourceGraphic" />
      <feColorMatrix
         result="fbSourceGraphicAlpha"
         in="fbSourceGraphic"
         values="0 0 0 -1 0 0 0 0 -1 0 0 0 0 -1 0 0 0 0 1 0"
         id="feColorMatrix7851" />
      <feGaussianBlur
         id="feGaussianBlur7853"
         in="fbSourceGraphicAlpha"
         stdDeviation="1"
         result="blur" />
      <feColorMatrix
         id="feColorMatrix7855"
         result="bluralpha"
         type="matrix"
         values="-1 0 0 0 1 0 -1 0 0 1 0 0 -1 0 1 0 0 0 1 0 " />
      <feOffset
         id="feOffset7857"
         in="bluralpha"
         dx="1.5"
         dy="-1.5"
         result="offsetBlur" />
      <feMerge
         id="feMerge7859">
        <feMergeNode
           id="feMergeNode7861"
           in="offsetBlur" />
        <feMergeNode
           id="feMergeNode7863"
           in="fbSourceGraphic" />
      </feMerge>
    </filter>
    <linearGradient
       id="linearGradient4976">
      <stop
         style="stop-color:#79db32;stop-opacity:1;"
         offset="0"
         id="stop4978" />
      <stop
         style="stop-color:#ffffff;stop-opacity:1;"
         offset="1"
         id="stop4980" />
    </linearGradient>
    <linearGradient
       id="linearGradient5201">
      <stop
         style="stop-color:#ffffff;stop-opacity:0;"
         offset="0"
         id="stop5203" />
      <stop
         id="stop5209"
         offset="0.73386818"
         style="stop-color:#ffffff;stop-opacity:0.779661;" />
      <stop
         style="stop-color:#c4c7cc;stop-opacity:0;"
         offset="1"
         id="stop5205" />
    </linearGradient>
    <clipPath
       clipPathUnits="userSpaceOnUse"
       id="clipPath4738">
      <path
         sodipodi:type="arc"
         style="fill:#eff0f1;fill-opacity:1;fill-rule:nonzero;stroke:#4c4c4c;stroke-opacity:1;display:inline"
         id="path4740"
         sodipodi:cx="350.08929"
         sodipodi:cy="319.77289"
         sodipodi:rx="6.6964288"
         sodipodi:ry="6.6964288"
         d="m 356.78572,319.77289 a 6.6964288,6.6964288 0 1 1 -13.39285,0 6.6964288,6.6964288 0 1 1 13.39285,0 z"
         transform="matrix(2.5292128,1.860414,-1.860414,2.5292128,221.80276,-811.86155)" />
    </clipPath>
    <clipPath
       clipPathUnits="userSpaceOnUse"
       id="clipPath7098-7">
      <path
         style="opacity:0.33399999;fill:url(#pattern7102);fill-opacity:1;stroke:#50a1af;stroke-width:2.5045166"
         id="path7100-7"
         d="m 596.65497,3410.9692 c 0,-44.9558 -36.44197,-81.4006 -81.39654,-81.4006 -44.93353,0 -81.36123,36.4147 -81.39379,81.3432 l -0.002,0 0,62.9908 0.002,0 c 0.025,10.2009 8.29722,18.4595 18.50462,18.4595 0.0276,0 0.0576,0 0.0877,0 l 0,0 62.82806,0 0,0 c 44.94627,-0.018 81.36995,-36.4499 81.36995,-81.3929 z"
         inkscape:connector-curvature="0"
         inkscape:export-filename="/home/duffy/Documents/Work/Projects/FedBadges/Badges/junior-editor.png"
         inkscape:export-xdpi="90"
         inkscape:export-ydpi="90" />
    </clipPath>
    <clipPath
       clipPathUnits="userSpaceOnUse"
       id="clipPath7092-0">
      <path
         style="opacity:0.33399999;fill:#82bac3;fill-opacity:1;stroke:none"
         id="path7094-2"
         d="m 596.65497,3410.9692 c 0,-44.9558 -36.44197,-81.4006 -81.39654,-81.4006 -44.93353,0 -81.36123,36.4147 -81.39379,81.3432 l -0.002,0 0,62.9908 0.002,0 c 0.025,10.2009 8.29722,18.4595 18.50462,18.4595 0.0276,0 0.0576,0 0.0877,0 l 0,0 62.82806,0 0,0 c 44.94627,-0.018 81.36995,-36.4499 81.36995,-81.3929 z"
         inkscape:connector-curvature="0"
         inkscape:export-filename="/home/duffy/Documents/Work/Projects/FedBadges/Badges/junior-editor.png"
         inkscape:export-xdpi="90"
         inkscape:export-ydpi="90" />
    </clipPath>
    <linearGradient
       id="linearGradient5329">
      <stop
         style="stop-color:#e59728;stop-opacity:1;"
         offset="0"
         id="stop5331" />
      <stop
         style="stop-color:#f8ff3c;stop-opacity:1;"
         offset="1"
         id="stop5333" />
    </linearGradient>
    <linearGradient
       id="linearGradient4770">
      <stop
         style="stop-color:#000000;stop-opacity:1;"
         offset="0"
         id="stop4772" />
      <stop
         id="stop4894"
         offset="0.28839085"
         style="stop-color:#142039;stop-opacity:1;" />
      <stop
         id="stop4778"
         offset="0.49761793"
         style="stop-color:#3c6eb4;stop-opacity:1;" />
      <stop
         style="stop-color:#ffffff;stop-opacity:1;"
         offset="0.72108096"
         id="stop4892" />
      <stop
         id="stop4900"
         offset="0.95970011"
         style="stop-color:#3c6eb4;stop-opacity:1;" />
      <stop
         style="stop-color:#000000;stop-opacity:1;"
         offset="1"
         id="stop4774" />
    </linearGradient>
    <filter
       color-interpolation-filters="sRGB"
       inkscape:collect="always"
       id="filter2620-9">
      <feGaussianBlur
         inkscape:collect="always"
         stdDeviation="0.78000015"
         id="feGaussianBlur2622-5" />
    </filter>
    <linearGradient
       inkscape:collect="always"
       xlink:href="#linearGradient23243-0-4"
       id="linearGradient11673-0"
       gradientUnits="userSpaceOnUse"
       x1="452.89532"
       y1="692.18036"
       x2="549.71472"
       y2="588.13464" />
    <linearGradient
       inkscape:collect="always"
       id="linearGradient23243-0-4">
      <stop
         style="stop-color:#db3279;stop-opacity:1;"
         offset="0"
         id="stop23245-9-8" />
      <stop
         style="stop-color:#db3279;stop-opacity:0;"
         offset="1"
         id="stop23247-6-5" />
    </linearGradient>
    <linearGradient
       inkscape:collect="always"
       xlink:href="#linearGradient29617-7-5"
       id="linearGradient11675-5"
       gradientUnits="userSpaceOnUse"
       x1="500.41754"
       y1="598.07538"
       x2="531.51129"
       y2="682.98608" />
    <linearGradient
       inkscape:collect="always"
       id="linearGradient29617-7-5">
      <stop
         style="stop-color:#6e0733;stop-opacity:1;"
         offset="0"
         id="stop29619-3-4" />
      <stop
         style="stop-color:#6e0733;stop-opacity:0;"
         offset="1"
         id="stop29621-9-2" />
    </linearGradient>
    <linearGradient
       inkscape:collect="always"
       xlink:href="#linearGradient17017-5-9"
       id="linearGradient11677-1"
       gradientUnits="userSpaceOnUse"
       x1="477.17944"
       y1="4054.9666"
       x2="507.65854"
       y2="4028.2605" />
    <linearGradient
       id="linearGradient17017-5-9">
      <stop
         style="stop-color:#313b31;stop-opacity:1;"
         offset="0"
         id="stop17019-8-2" />
      <stop
         style="stop-color:#313b31;stop-opacity:0.62711865;"
         offset="1"
         id="stop17021-3-4" />
    </linearGradient>
    <linearGradient
       inkscape:collect="always"
       xlink:href="#linearGradient22742-8-8"
       id="linearGradient11679-5"
       gradientUnits="userSpaceOnUse"
       x1="297.87323"
       y1="273.94583"
       x2="337.01941"
       y2="237.20154" />
    <linearGradient
       inkscape:collect="always"
       id="linearGradient22742-8-8">
      <stop
         style="stop-color:#361f00;stop-opacity:1;"
         offset="0"
         id="stop22744-4-6" />
      <stop
         style="stop-color:#361f00;stop-opacity:0;"
         offset="1"
         id="stop22746-6-2" />
    </linearGradient>
    <filter
       color-interpolation-filters="sRGB"
       id="filter22728-9-5"
       inkscape:label="Drop shadow"
       width="1.5"
       height="1.5"
       x="-0.25"
       y="-0.25">
      <feGaussianBlur
         id="feGaussianBlur22730-3-1"
         in="SourceAlpha"
         stdDeviation="0.2"
         result="blur" />
      <feColorMatrix
         id="feColorMatrix22732-4-3"
         result="bluralpha"
         type="matrix"
         values="1 0 0 0 0 0 1 0 0 0 0 0 1 0 0 0 0 0 0.9 0 " />
      <feOffset
         id="feOffset22734-1-9"
         in="bluralpha"
         dx="-0.4"
         dy="0.2"
         result="offsetBlur" />
      <feMerge
         id="feMerge22736-7-7">
        <feMergeNode
           id="feMergeNode22738-0-3"
           in="offsetBlur" />
        <feMergeNode
           id="feMergeNode22740-2-7"
           in="SourceGraphic" />
      </feMerge>
    </filter>
    <linearGradient
       inkscape:collect="always"
       xlink:href="#linearGradient6303"
       id="linearGradient6604"
       gradientUnits="userSpaceOnUse"
       gradientTransform="translate(54,444)"
       x1="285"
       y1="232"
       x2="284"
       y2="149" />
    <linearGradient
       inkscape:collect="always"
       id="linearGradient6303">
      <stop
         style="stop-color:#a0cedc;stop-opacity:1"
         offset="0"
         id="stop6305" />
      <stop
         style="stop-color:#d7e9f0;stop-opacity:1"
         offset="1"
         id="stop6307" />
    </linearGradient>
    <pattern
       inkscape:collect="always"
       xlink:href="#pattern8884-5"
       id="pattern6606"
       patternTransform="translate(-722,484)" />
    <pattern
       inkscape:collect="always"
       xlink:href="#pattern8791-0"
       id="pattern8884-5"
       patternTransform="translate(-904,0)" />
    <pattern
       inkscape:collect="always"
       xlink:href="#pattern8787-2"
       id="pattern8791-0"
       patternTransform="translate(-724,0)" />
    <pattern
       inkscape:collect="always"
       xlink:href="#pattern8783-1"
       id="pattern8787-2"
       patternTransform="translate(-536,0)" />
    <pattern
       inkscape:collect="always"
       xlink:href="#pattern8775-8"
       id="pattern8783-1"
       patternTransform="translate(-360,0)" />
    <pattern
       inkscape:collect="always"
       xlink:href="#Wavywhite-7"
       id="pattern8775-8"
       patternTransform="translate(-180,0)" />
    <pattern
       inkscape:stockid="Wavy white"
       id="Wavywhite-7"
       height="5.1805778"
       width="30.066020"
       patternUnits="userSpaceOnUse"
       inkscape:collect="always">
      <path
         id="path8532-1"
         d="M 7.597,0.061 C 5.079,-0.187 2.656,0.302 -0.01,1.788 L -0.01,3.061 C 2.773,1.431 5.173,1.052 7.472,1.280 C 9.770,1.508 11.969,2.361 14.253,3.218 C 18.820,4.931 23.804,6.676 30.066,3.061 L 30.062,1.788 C 23.622,5.497 19.246,3.770 14.691,2.061 C 12.413,1.207 10.115,0.311 7.597,0.061 z "
         style="fill:white;stroke:none;" />
    </pattern>
    <inkscape:path-effect
       effect="spiro"
       id="path-effect2194"
       is_visible="true" />
    <inkscape:path-effect
       effect="spiro"
       id="path-effect5355"
       is_visible="true"
       lpeversion="1" />
    <linearGradient
       id="linearGradient4235">
      <stop
         style="stop-color:#000000;stop-opacity:1;"
         offset="0"
         id="stop4237" />
      <stop
         style="stop-color:#5f605b;stop-opacity:1;"
         offset="1"
         id="stop4239" />
    </linearGradient>
    <linearGradient
       inkscape:collect="always"
       xlink:href="#linearGradient6945"
       id="linearGradient2708"
       gradientUnits="userSpaceOnUse"
       gradientTransform="matrix(-0.63117115,0,0,0.63117115,51.30258,50.149545)"
       x1="-191.06355"
       y1="305.52585"
       x2="-182.0231"
       y2="264.20761" />
    <linearGradient
       id="linearGradient6945"
       inkscape:collect="always">
      <stop
         id="stop6947"
         offset="0"
         style="stop-color:#000000;stop-opacity:1;" />
      <stop
         id="stop6949"
         offset="1"
         style="stop-color:#000000;stop-opacity:0;" />
    </linearGradient>
    <linearGradient
       inkscape:collect="always"
       xlink:href="#linearGradient4245"
       id="linearGradient2718"
       gradientUnits="userSpaceOnUse"
       gradientTransform="matrix(-1.4166572,0,0,1.4166572,328.51167,-33.467688)"
       x1="88.809021"
       y1="155.26936"
       x2="102.39864"
       y2="138.20293" />
    <linearGradient
       id="linearGradient4245">
      <stop
         style="stop-color:#000000;stop-opacity:1;"
         offset="0"
         id="stop4247" />
      <stop
         style="stop-color:#60605b;stop-opacity:1;"
         offset="1"
         id="stop4249" />
    </linearGradient>
    <linearGradient
       inkscape:collect="always"
       xlink:href="#linearGradient4235"
       id="linearGradient2720"
       gradientUnits="userSpaceOnUse"
       gradientTransform="matrix(-0.63117115,0,0,0.63117115,51.30258,50.149545)"
       x1="-116.87376"
       y1="310.61697"
       x2="-125.74579"
       y2="262.84277" />
    <clipPath
       clipPathUnits="userSpaceOnUse"
       id="clipPath7098-7-9-3">
      <path
         style="opacity:0.334;fill:url(#pattern7102);fill-opacity:1;stroke:#50a1af;stroke-width:2.50452"
         id="path7100-7-0-9"
         d="m 596.65497,3410.9692 c 0,-44.9558 -36.44197,-81.4006 -81.39654,-81.4006 -44.93353,0 -81.36123,36.4147 -81.39379,81.3432 h -0.002 v 62.9908 h 0.002 c 0.025,10.2009 8.29722,18.4595 18.50462,18.4595 0.0276,0 0.0576,0 0.0877,0 v 0 h 62.82806 v 0 c 44.94627,-0.018 81.36995,-36.4499 81.36995,-81.3929 z"
         inkscape:connector-curvature="0"
         inkscape:export-filename="/home/duffy/Documents/Work/Projects/FedBadges/Badges/junior-editor.png"
         inkscape:export-xdpi="90"
         inkscape:export-ydpi="90" />
    </clipPath>
    <clipPath
       clipPathUnits="userSpaceOnUse"
       id="clipPath7098-7-9-3-3">
      <path
         style="opacity:0.334;fill:url(#pattern7102);fill-opacity:1;stroke:#50a1af;stroke-width:2.50452"
         id="path7100-7-0-9-2"
         d="m 596.65497,3410.9692 c 0,-44.9558 -36.44197,-81.4006 -81.39654,-81.4006 -44.93353,0 -81.36123,36.4147 -81.39379,81.3432 h -0.002 v 62.9908 h 0.002 c 0.025,10.2009 8.29722,18.4595 18.50462,18.4595 0.0276,0 0.0576,0 0.0877,0 v 0 h 62.82806 v 0 c 44.94627,-0.018 81.36995,-36.4499 81.36995,-81.3929 z"
         inkscape:connector-curvature="0"
         inkscape:export-filename="/home/duffy/Documents/Work/Projects/FedBadges/Badges/junior-editor.png"
         inkscape:export-xdpi="90"
         inkscape:export-ydpi="90" />
    </clipPath>
    <clipPath
       clipPathUnits="userSpaceOnUse"
       id="clipPath2037">
      <path
         inkscape:export-ydpi="90"
         inkscape:export-xdpi="90"
         inkscape:export-filename="/home/duffy/Documents/Work/Projects/FedBadges/Badges/flock-2013-attendee.png"
         style="display:inline;fill:#bbed97;fill-opacity:1;stroke:none"
         id="path2039"
         d="m 399.88397,107.74395 c 0,-41.808289 -33.89046,-75.701181 -75.69735,-75.701181 -41.78744,0 -75.66453,33.86501 -75.69486,75.647851 l -0.002,-0.002 v 58.58023 l 0.002,0.002 c 0.0235,9.48684 7.71636,17.16714 17.20895,17.16714 0.0266,0 0.0533,-0.002 0.0813,-0.002 l 0.005,0.002 h 58.42895 v 0 c 41.79485,-0.0163 75.66832,-33.89781 75.66832,-75.69406 z"
         inkscape:connector-curvature="0"
         sodipodi:nodetypes="csccccscccccc" />
    </clipPath>
  </defs>
  <sodipodi:namedview
     pagecolor="#ffffff"
     bordercolor="#666666"
     borderopacity="1"
     objecttolerance="10"
     gridtolerance="10"
     guidetolerance="10"
     inkscape:pageopacity="0"
     inkscape:pageshadow="2"
     inkscape:window-width="1366"
     inkscape:window-height="705"
     id="namedview4328"
     showgrid="false"
     inkscape:zoom="2.16"
     inkscape:cx="124.44813"
     inkscape:cy="145.78735"
     inkscape:window-x="-8"
     inkscape:window-y="-8"
     inkscape:window-maximized="1"
     inkscape:current-layer="g8420"
     showguides="true"
     inkscape:guide-bbox="true"
     inkscape:document-rotation="0"
     inkscape:snap-global="false"
     inkscape:snap-bbox="true"
     inkscape:bbox-paths="true"
     inkscape:bbox-nodes="true"
     inkscape:snap-bbox-edge-midpoints="true"
     inkscape:snap-bbox-midpoints="true"
     inkscape:object-paths="true"
     inkscape:snap-intersection-paths="true"
     inkscape:snap-smooth-nodes="true"
     inkscape:snap-midpoints="true">
    <inkscape:grid
       type="xygrid"
       id="grid1170" />
    <sodipodi:guide
       position="327.68924,134.28685"
       orientation="0.70710678,-0.70710678"
       id="guide1172" />
    <sodipodi:guide
       position="415,151"
       orientation="-0.70710678,-0.70710678"
       id="guide1174" />
  </sodipodi:namedview>
  <g
     id="g8420">
    <path
       inkscape:export-ydpi="90"
       inkscape:export-xdpi="90"
       inkscape:export-filename="/home/duffy/Documents/Work/Projects/FedBadges/Badges/flock-2013-attendee.png"
       transform="matrix(2.5863923,0,0,2.5863923,-117.03776,-196.72146)"
       inkscape:connector-curvature="0"
       d="m 134.00002,125.00183 c 0,-21.53997 -17.46062,-39.00185 -38.999836,-39.00185 -21.529216,0 -38.982968,17.44751 -38.998584,38.97439 l -0.0016,-10e-4 0,30.18098 0.0016,9.9e-4 c 0.01184,4.88773 3.975508,8.84465 8.866181,8.84465 0.01374,0 0.02745,-9.9e-4 0.04187,-9.9e-4 l 0.0024,9.9e-4 30.10304,0 0,0 c 21.533049,-0.009 38.984919,-17.46443 38.984919,-38.99816 z"
       id="path6672"
       style="fill:#db3279;fill-opacity:1;stroke:#58595b;stroke-width:4.50271511;stroke-linejoin:round;stroke-miterlimit:4;stroke-opacity:1;stroke-dasharray:none;display:inline;filter:url(#filter2620-9)" />
    <path
       inkscape:export-ydpi="90"
       inkscape:export-xdpi="90"
       inkscape:export-filename="/home/duffy/Documents/Work/Projects/FedBadges/Badges/flock-2013-attendee.png"
       inkscape:connector-curvature="0"
       id="path6674"
       d="m 128.66952,19.370925 c -58.255701,0 -105.560403,47.14919 -105.961272,105.314655 -5.59e-4,0.082 3.73e-4,0.16049 0,0.24247 a 5.1733019,5.1733019 0 0 0 -0.08083,0.24249 c -1.16e-4,0.0548 4.7e-5,0.10691 0,0.16165 l 0,78.07671 a 5.1733019,5.1733019 0 0 0 0.404138,2.02061 5.1733019,5.1733019 0 0 0 0,0.0808 c 1.112566,13.76388 12.0603,24.57729 25.863915,25.54064 0.08642,0.005 0.155825,0.0757 0.242465,0.0808 a 5.1733019,5.1733019 0 0 0 0.242489,0.0808 5.1733019,5.1733019 0 0 0 1.374022,0.24246 5.1733019,5.1733019 0 0 0 0.08082,0 l 77.834254,0 a 5.1733019,5.1733019 0 0 0 0.0808,0 c 58.01578,-0.0232 105.04203,-46.82773 105.7996,-104.66798 a 5.1733019,5.1733019 0 0 0 0.0808,-0.32328 c 5.4e-4,-0.0545 -4.6e-4,-0.10693 0,-0.16165 a 5.1733019,5.1733019 0 0 0 0.0808,-0.88907 c 0,-58.506269 -47.5375,-106.042095 -106.04208,-106.042095 z"
       style="font-size:xx-small;font-style:normal;font-variant:normal;font-weight:normal;font-stretch:normal;text-indent:0;text-align:start;text-decoration:none;line-height:normal;letter-spacing:normal;word-spacing:normal;text-transform:none;direction:ltr;block-progression:tb;writing-mode:lr-tb;text-anchor:start;baseline-shift:baseline;color:#000000;fill:#ffffff;fill-opacity:1;fill-rule:nonzero;stroke:none;stroke-width:4;marker:none;visibility:visible;display:inline;overflow:visible;enable-background:accumulate;font-family:sans-serif;-inkscape-font-specification:sans-serif" />
    <path
       inkscape:export-ydpi="90"
       inkscape:export-xdpi="90"
       inkscape:export-filename="/home/duffy/Documents/Work/Projects/FedBadges/Badges/flock-2013-attendee.png"
       style="fill:#bbed97;fill-opacity:1;stroke:none;display:inline"
       id="path6676"
       d="m 204.36627,126.58107 c 0,-41.80829 -33.89046,-75.701182 -75.69735,-75.701182 -41.787442,0 -75.66453,33.86501 -75.694856,75.647852 l -0.0023,-0.002 0,58.58023 0.0023,0.002 c 0.02352,9.48684 7.716358,17.16714 17.208959,17.16714 0.02655,0 0.05334,-0.002 0.08129,-0.002 l 0.0046,0.002 58.428943,0 0,0 c 41.79485,-0.0163 75.66832,-33.89781 75.66832,-75.69406 z"
       inkscape:connector-curvature="0"
       sodipodi:nodetypes="csccccscccccc" />
    <path
       inkscape:export-ydpi="90"
       inkscape:export-xdpi="90"
       inkscape:export-filename="/home/duffy/Documents/Work/Projects/FedBadges/Badges/flock-2013-attendee.png"
       style="fill:none;stroke:#db3279;stroke-width:11.64578818999999932;stroke-linejoin:round;stroke-miterlimit:4;stroke-opacity:1;stroke-dasharray:none;display:inline"
       id="path6678"
       d="m 218.66009,126.58152 c 0,-49.70262 -40.28975,-89.995185 -89.99069,-89.995185 -49.677809,0 -89.951622,40.259398 -89.987694,89.931815 l -0.0023,-0.002 0,69.64142 0.0023,0.002 c 0.02702,11.2782 9.173364,20.40871 20.458387,20.40871 0.03144,0 0.06336,-0.002 0.09666,-0.002 l 0.007,0.002 69.461577,0 0,0 c 49.68522,-0.021 89.9547,-40.29846 89.9547,-89.98672 z"
       inkscape:connector-curvature="0" />
    <rect
       style="fill:#ffffff;fill-opacity:1;stroke:#787878;stroke-width:7.06116;stroke-linecap:round;stroke-linejoin:round;stroke-miterlimit:4;stroke-dasharray:none;stroke-opacity:1;paint-order:stroke fill markers;stop-color:#000000"
       id="rect1178"
       width="112.16106"
       height="65.443886"
       x="72.994965"
       y="91.789848" />
    <path
       style="fill:#ff0000;stroke:#000000;stroke-width:0.764472px;stroke-linecap:butt;stroke-linejoin:miter;stroke-opacity:1"
       d="m 94.770696,141.7048 15.289434,-15.28944 7.64472,7.64472 15.28943,-15.28943 7.64472,7.64471 15.28945,-15.28944 -3.82237,-3.82235 15.28944,-3.82237 -3.82235,15.28945 -3.82237,-3.82237 -19.1118,19.1118 -7.64472,-7.64472 -15.28943,15.28944 -7.64472,-7.64472 -11.467078,11.46708 z"
       id="path1176" />
    <g
       id="g1991"
       transform="matrix(1.0289517,0,0,1.0289517,-197.6376,13.526383)"
       clip-path="url(#clipPath2037)">
      <g
         id="g6530"
         clip-path="none"
         transform="matrix(0.82548249,-0.04874783,0.04874783,0.82548249,149.02178,25.542656)"
         style="display:inline">
        <path
           sodipodi:nodetypes="cccacccccccccccccc"
           inkscape:connector-curvature="0"
           id="path2529-8"
           d="m 147.4329,128.56267 c -3.62538,0.0159 -7.71094,1.04976 -12.57226,3.48633 -16.16135,8.66418 -4.37236,15.89446 -6.9538,20.7425 -2.73255,3.81324 -5.94587,11.08082 -7.49429,17.11242 -3.08424,12.0141 -2.50759,33.3353 -3.33707,37.0611 -3.10223,13.93446 1.70314,21.8373 3.65625,21.85937 -5.21913,0.41638 -14.99881,12.94321 -3.71094,16.29102 4.03292,1.19611 10.53833,-0.6227 19.09571,-2.55079 6.7313,-1.5166 2.96635,-10.89594 1.49414,-18.5664 -1.17574,-6.12528 7.97713,-13.95569 10.94336,-7.86524 1.29318,2.65537 4.00877,13.26538 7.25,15.04297 8.37782,4.59461 -3.63096,9.45948 3.22265,13.53321 6.35194,3.77549 15.38387,1.06901 19.79492,-4.36133 1.12619,-2.09845 1.09452,-9.84422 -2.23047,-19.18164 -2.00059,-5.61801 -0.13569,-16.22161 0.13477,-16.54102 7.13688,-8.38631 1.0659,-21.7101 -3.62695,-39.80664 -9.37844,-8.75142 -6.86138,-27.60183 -2.78321,-24.68555 -8.08705,-5.86163 -14.1848,-11.60854 -22.88281,-11.57031 z"
           clip-path="none"
           style="display:inline;fill:#60605b;stroke:#000000;stroke-width:3.54;stroke-linecap:butt;stroke-linejoin:round;stroke-miterlimit:4;stroke-dasharray:none;stroke-opacity:1" />
        <path
           style="fill:#ffffff;fill-opacity:1;stroke:none;stroke-width:1.74494"
           d="m 157.93646,143.83057 c 7.44096,11.71578 13.88644,27.6665 13.98154,41.84813 0.12389,18.38165 -13.52314,30.50299 -26.65926,29.80112 -13.79692,-0.73719 -21.64376,-11.06243 -23.43494,-21.89818 -0.57636,-4.80222 1.07441,-21.8586 4.21331,-31.98071 3.73658,-12.04946 8.83606,-18.82475 8.83606,-18.82475 0,0 6.48912,7.22869 11.15387,7.39333 4.4449,0.15687 11.90942,-6.33894 11.90942,-6.33894 z"
           id="path2531-5"
           inkscape:connector-curvature="0"
           sodipodi:nodetypes="csscscsc" />
        <path
           sodipodi:nodetypes="csscscc"
           inkscape:connector-curvature="0"
           id="path2533"
           d="m 150.72129,222.03708 c 1.37397,3.80634 3.13322,8.06954 5.0825,9.13858 8.37782,4.59461 -3.6307,9.46061 3.22291,13.53434 6.35194,3.77549 15.3829,1.06732 19.79395,-4.36302 1.12619,-2.09845 1.09548,-9.84328 -2.22951,-19.1807 -0.93669,-2.63007 -1.2979,-8.79754 -1.10054,-12.04607 -9.03515,-0.47115 -18.61506,3.92227 -24.76931,12.91687 z"
           style="display:inline;fill:url(#linearGradient2708);fill-opacity:1;stroke:none;stroke-width:1.74494"
           clip-path="none" />
        <path
           sodipodi:nodetypes="cssc"
           inkscape:connector-curvature="0"
           id="path2626"
           d="m 136.87185,241.94179 c -4.56216,5.34544 -16.15958,5.66381 -20.58442,2.36606 -8.01191,-5.97127 8.73206,-16.78574 15.85247,-15.14261 4.42518,1.0212 7.70167,9.29718 4.73195,12.77655 z"
           style="fill:none;stroke:#000000;stroke-width:6.63079;stroke-linecap:butt;stroke-linejoin:miter;stroke-miterlimit:4;stroke-dasharray:none;stroke-opacity:1" />
        <path
           sodipodi:nodetypes="ccssccc"
           inkscape:connector-curvature="0"
           id="path2628"
           d="m 117.78757,213.73002 c -0.54373,9.69861 2.86956,14.06436 3.11088,15.76266 -3.61361,-0.003 -12.15493,10.77006 -3.87849,15.6236 3.62862,2.12792 8.80918,1.5761 17.36656,-0.35197 6.73129,-1.51662 3.52601,-11.08816 1.55178,-20.09705 -0.0175,-1.96748 0.64877,-4.41113 0.97281,-6.39162 -5.64333,-6.2851 -12.87595,-8.65773 -19.12354,-4.54562 z"
           style="display:inline;fill:url(#linearGradient2720);fill-opacity:1;stroke:none;stroke-width:1.74494"
           clip-path="none" />
      </g>
      <path
         style="fill:#51a2da;fill-opacity:1;stroke:none;stroke-width:0.945745px;stroke-linecap:butt;stroke-linejoin:miter;stroke-opacity:1"
         d="m 278.5694,144.04378 9.24836,15.01332 -6.06932,8.41873 -6.61233,-7.27351 z"
         id="path1514" />
      <path
         style="fill:#1a1a1a;fill-opacity:1;stroke:#000000;stroke-width:3.03052;stroke-linecap:butt;stroke-linejoin:miter;stroke-miterlimit:4;stroke-dasharray:none;stroke-opacity:1"
         d="m 255.36588,179.06232 -0.10458,12.11006 24.62955,-0.0941 1.61945,-20.89665 z"
         id="path1582"
         sodipodi:nodetypes="ccccc" />
      <path
         style="fill:#1a1a1a;stroke:#000000;stroke-width:3;stroke-linecap:butt;stroke-linejoin:miter;stroke-miterlimit:4;stroke-dasharray:none;stroke-opacity:1"
         d="m 260.35856,134.66136 7.17132,-1.79283 9.76095,29.08367 -12.749,7.96812 z"
         id="path1520" />
      <path
         style="fill:#1a1a1a;fill-opacity:1;stroke:#000000;stroke-width:3;stroke-linecap:butt;stroke-linejoin:miter;stroke-miterlimit:4;stroke-dasharray:none;stroke-opacity:1"
         d="m 306.46259,170.6919 1.89555,16.75115 -22.39181,3.88741 -6.70875,-23.05244 z"
         id="path1582-0"
         sodipodi:nodetypes="ccccc" />
      <path
         style="fill:#60605b;fill-opacity:1;stroke:#000000;stroke-width:3;stroke-linecap:butt;stroke-linejoin:miter;stroke-miterlimit:4;stroke-dasharray:none;stroke-opacity:1"
         d="m 314.35405,166.01673 c -8.76103,11.22802 -28.33218,21.34299 -34.60006,10.61221 -0.70816,-4.34505 10.76547,-7.66198 17.17252,-15.61564 -0.63796,-10.35111 -11.82513,-27.00348 -4.56893,-30.92497 11.93717,-6.45124 24.87756,32.23603 21.99647,35.9284 z"
         id="path1342"
         sodipodi:nodetypes="sccss" />
      <path
         style="fill:#1a1a1a;stroke:#000000;stroke-width:3;stroke-linecap:butt;stroke-linejoin:miter;stroke-miterlimit:4;stroke-dasharray:none;stroke-opacity:1"
         d="m 293.75995,131.45928 -7.37819,-0.45207 -2.17885,30.84494 13.7569,0.83159 c -1.07081,-11.4256 -2.42978,-19.18429 -4.19986,-31.22446 z"
         id="path1520-4"
         sodipodi:nodetypes="ccccc" />
      <path
         style="fill:#1a1a1a;fill-opacity:1;stroke:#000000;stroke-width:3;stroke-linecap:butt;stroke-linejoin:miter;stroke-miterlimit:4;stroke-dasharray:none;stroke-opacity:1"
         d="m 315.14327,166.04937 c -8.76103,11.22802 -16.7784,16.36291 -23.04628,5.63213 -0.70816,-4.34505 -0.78831,-2.6819 5.61874,-10.63556 -0.63796,-10.35111 -11.82513,-27.00348 -4.56893,-30.92497 11.93717,-6.45124 24.87756,32.23603 21.99647,35.9284 z"
         id="path1342-8"
         sodipodi:nodetypes="sccss" />
      <path
         style="fill:#60605b;fill-opacity:1;stroke:#000000;stroke-width:3;stroke-linecap:butt;stroke-linejoin:miter;stroke-miterlimit:4;stroke-dasharray:none;stroke-opacity:1"
         d="m 251.31866,144.55174 c -2.15269,10.56284 -3.32672,25.25957 3.6899,33.04919 7.40972,8.22604 21.4624,3.2128 30.46516,-3.23095 20.57664,-14.7278 5.98783,-18.22312 -15.79176,-9.91301 -1.86563,1.24375 -2.778,-13.38896 -3.03883,-22.01644 -0.10175,-3.36546 -3.40851,-7.50474 -6.77549,-7.49154 -4.28557,0.0168 -7.69317,5.40346 -8.54898,9.60275 z"
         id="path1342-5"
         sodipodi:nodetypes="ssscsss" />
      <path
         style="fill:#1a1a1a;fill-opacity:1;stroke:#000000;stroke-width:3;stroke-linecap:butt;stroke-linejoin:miter;stroke-miterlimit:4;stroke-dasharray:none;stroke-opacity:1"
         d="m 251.51581,144.70147 c -2.15269,10.56284 -3.32672,25.25957 3.6899,33.04919 7.40972,8.22604 36.86279,4.82636 29.26994,-3.23095 -7.97376,-8.46153 1.05024,-21.57882 -14.59654,-9.91301 -1.86563,1.24375 -2.778,-13.38896 -3.03883,-22.01644 -0.10175,-3.36546 -3.40851,-7.50474 -6.77549,-7.49154 -4.28557,0.0168 -7.69317,5.40346 -8.54898,9.60275 z"
         id="path1342-5-4"
         sodipodi:nodetypes="ssscsss" />
      <path
         style="fill:#ffffff;stroke:none;stroke-width:1px;stroke-linecap:butt;stroke-linejoin:miter;stroke-opacity:1"
         d="m 271.64734,140.4426 -1.60545,-5.24908 14.25684,-0.76525 -0.81275,6.01433 -8.4683,2.79807 z"
         id="path1932"
         sodipodi:nodetypes="cccccc" />
      <path
         style="fill:#51a2da;fill-opacity:1;stroke:none;stroke-width:1px;stroke-linecap:butt;stroke-linejoin:miter;stroke-opacity:1"
         d="m 273.97648,141.77079 7.23799,-1.72086 -2.16631,6.69067 z"
         id="path1512" />
      <g
         id="g1766"
         transform="matrix(1.0886034,-0.12843544,0.12843544,1.0886034,-132.27577,2.080057)">
        <g
           transform="matrix(0.36182349,0,0,0.36235504,173.16704,-1098.2869)"
           id="g6709-4-9-2"
           style="display:inline;stroke:#60605b;stroke-width:9.04736;stroke-linejoin:round;stroke-miterlimit:4;stroke-dasharray:none"
           clip-path="url(#clipPath7098-7-9-3)">
          <path
             style="fill:#000000;stroke:#60605b;stroke-width:9.04736;stroke-linejoin:round;stroke-miterlimit:4;stroke-dasharray:none"
             d="m 506.5,3415 c 0,0 -7.26301,-13.2547 -12.5,-10 -5.23699,3.2547 4.5,20.5 4.5,20.5 z"
             id="path6713-92-7-2"
             inkscape:connector-curvature="0"
             sodipodi:nodetypes="czcc" />
          <path
             sodipodi:nodetypes="czcc"
             inkscape:connector-curvature="0"
             id="path6715-6-5-2"
             d="m 513.4528,3415 c 0,0 7.26301,-13.2547 12.5,-10 5.23699,3.2547 -4.5,20.5 -4.5,20.5 z"
             style="fill:#000000;stroke:#60605b;stroke-width:9.04736;stroke-linejoin:round;stroke-miterlimit:4;stroke-dasharray:none" />
          <path
             style="fill:#ffffff;stroke:#60605b;stroke-width:9.04736;stroke-linejoin:round;stroke-miterlimit:4;stroke-dasharray:none"
             d="m 492,3422.5 c -6,6 -9.5,23 -9.5,25 0,2 -8.5,9 -8.5,9 0,0 6.5,3.5 7,7.5 0.5,4 20,22.5 29.56255,22.5 9.56255,0 29.06255,-18.5 29.56255,-22.5 0.5,-4 7,-7.5 7,-7.5 0,0 -8.5,-7 -8.5,-9 0,-2 -3.5,-19 -9.5,-25 -5.08871,-5.0887 -10.24207,-8.375 -18.5625,-8.375 -8.32043,0 -16.18949,6.0911 -18.5626,8.375 z"
             id="path6718-6-6-3"
             inkscape:connector-curvature="0"
             sodipodi:nodetypes="cscscscsszc" />
          <path
             style="color:#000000;display:inline;overflow:visible;visibility:visible;fill:#000000;fill-opacity:1;fill-rule:nonzero;stroke:#60605b;stroke-width:9.04736;stroke-linejoin:round;stroke-miterlimit:4;stroke-dasharray:none;marker:none;enable-background:accumulate"
             d="m 519.09375,3415.5625 c -1.58431,1.2812 -2.59375,3.232 -2.59375,5.4375 v 32.5 c 0,3.878 3.122,7 7,7 3.878,0 7,-3.122 7,-7 v -29.3438 c -0.44597,-0.6048 -0.89676,-1.178 -1.375,-1.6562 -3.08852,-3.0885 -6.20147,-5.5087 -10.03125,-6.9375 z"
             id="path6720-0-4-8"
             inkscape:connector-curvature="0"
             sodipodi:nodetypes="cssssccc" />
          <path
             style="color:#000000;display:inline;overflow:visible;visibility:visible;fill:#000000;fill-opacity:1;fill-rule:nonzero;stroke:#60605b;stroke-width:9.04736;stroke-linejoin:round;stroke-miterlimit:4;stroke-dasharray:none;marker:none;enable-background:accumulate"
             d="m 502.3125,3415.9062 c -4.84472,1.9816 -8.75993,5.0996 -10.3125,6.5938 -0.52532,0.5253 -1.01368,1.1672 -1.5,1.8438 V 3453.5 c 0,3.878 3.122,7 7,7 3.878,0 7,-3.122 7,-7 V 3421 c 0,-2.0119 -0.83726,-3.8192 -2.1875,-5.0938 z"
             id="path6722-9-0-9"
             inkscape:connector-curvature="0"
             sodipodi:nodetypes="cccssssc" />
          <ellipse
             style="color:#000000;display:inline;overflow:visible;visibility:visible;fill:#ffffff;fill-opacity:1;fill-rule:nonzero;stroke:#60605b;stroke-width:9.04736;stroke-linejoin:round;stroke-miterlimit:4;stroke-dasharray:none;marker:none;enable-background:accumulate"
             id="path6724-0-2-1"
             cx="498"
             cy="3446.5"
             rx="3"
             ry="5" />
          <ellipse
             id="path6726-1-5-3"
             style="color:#000000;display:inline;overflow:visible;visibility:visible;fill:#ffffff;fill-opacity:1;fill-rule:nonzero;stroke:#60605b;stroke-width:9.04736;stroke-linejoin:round;stroke-miterlimit:4;stroke-dasharray:none;marker:none;enable-background:accumulate"
             transform="translate(24)"
             cx="498"
             cy="3446.5"
             rx="3"
             ry="5" />
          <ellipse
             id="path6728-5-9-7"
             style="color:#000000;display:inline;overflow:visible;visibility:visible;fill:#000000;fill-opacity:1;fill-rule:nonzero;stroke:#60605b;stroke-width:5.74159;stroke-linejoin:round;stroke-miterlimit:4;stroke-dasharray:none;marker:none;enable-background:accumulate"
             transform="matrix(0,1.5757576,-1.5757576,0,5941.4111,2690.5455)"
             inkscape:transform-center-x="3.1515684"
             inkscape:transform-center-y="21.272785"
             cx="498"
             cy="3446.5"
             rx="3"
             ry="5" />
        </g>
        <path
           sodipodi:nodetypes="czcc"
           inkscape:connector-curvature="0"
           id="path6686-3-3-9"
           d="m 356.43064,139.15548 c 0,0 -2.62803,-4.80284 -4.52285,-3.62354 -1.89494,1.17942 1.62815,7.42833 1.62815,7.42833 z"
           style="display:inline;fill:#000000;stroke:none" />
        <path
           style="display:inline;fill:#000000;stroke:none"
           d="m 358.94628,139.15548 c 0,0 2.62792,-4.80284 4.52274,-3.62354 1.89494,1.17942 -1.62815,7.42833 -1.62815,7.42833 z"
           id="path6688-9-6-6"
           inkscape:connector-curvature="0"
           sodipodi:nodetypes="czcc" />
        <path
           sodipodi:nodetypes="cscscscsszc"
           inkscape:connector-curvature="0"
           id="path6635-3-6-1"
           d="m 351.18412,141.87316 c -2.17091,2.17412 -3.43734,8.33418 -3.43734,9.05889 0,0.72471 -3.0755,3.26124 -3.0755,3.26124 0,0 2.35194,1.26815 2.53275,2.71756 0.1808,1.44942 7.2365,8.15304 10.69646,8.15304 3.45995,0 10.51555,-6.70362 10.69647,-8.15304 0.18103,-1.44941 2.53274,-2.71756 2.53274,-2.71756 0,0 -3.0755,-2.53653 -3.0755,-3.26124 0,-0.72471 -1.26631,-6.88477 -3.43734,-9.05889 -1.84121,-1.84385 -3.70585,-3.03475 -6.71637,-3.03475 -3.01053,0 -5.8577,2.20718 -6.71637,3.03475 z"
           style="display:inline;fill:#ffffff;stroke:none" />
        <path
           sodipodi:nodetypes="cssssccc"
           inkscape:connector-curvature="0"
           id="rect6656-9-3-6"
           d="m 362.79964,139.35936 c -0.57317,0.46423 -0.81688,1.18044 -0.93845,1.97024 l -1.81241,11.77657 c -0.21375,1.3888 1.1297,2.53653 2.53287,2.53653 1.40315,0 2.29661,-1.15129 2.53274,-2.53653 l 1.8124,-10.63286 c -0.1614,-0.21903 -0.32453,-0.42681 -0.49753,-0.60015 -1.11754,-1.11915 -2.24391,-1.99607 -3.62962,-2.5138 z"
           style="color:#000000;display:inline;overflow:visible;visibility:visible;fill:#000000;fill-opacity:1;fill-rule:nonzero;stroke:none;stroke-width:2.001;marker:none;enable-background:accumulate" />
        <path
           sodipodi:nodetypes="cccssssc"
           inkscape:connector-curvature="0"
           id="rect6658-8-3-0"
           d="m 353.10305,139.48391 c -1.75294,0.71805 -3.16952,1.84787 -3.73133,2.38925 -0.18999,0.19033 -0.36677,0.42291 -0.54275,0.66811 l 1.81239,10.5649 c 0.23763,1.3849 1.12971,2.53653 2.53286,2.53653 1.40315,0 2.74649,-1.14773 2.53274,-2.53653 l -1.8124,-11.77657 c -0.11135,-0.72046 -0.30294,-1.38387 -0.79151,-1.84569 z"
           style="color:#000000;display:inline;overflow:visible;visibility:visible;fill:#000000;fill-opacity:1;fill-rule:nonzero;stroke:none;stroke-width:2.001;marker:none;enable-background:accumulate" />
        <ellipse
           id="path6690-4-2-7"
           style="color:#000000;display:inline;overflow:visible;visibility:visible;fill:#ffffff;fill-opacity:1;fill-rule:nonzero;stroke:none;stroke-width:0.572489;marker:none;enable-background:accumulate"
           cx="353.35513"
           cy="150.56969"
           rx="1.0854704"
           ry="1.131132" />
        <ellipse
           style="color:#000000;display:inline;overflow:visible;visibility:visible;fill:#ffffff;fill-opacity:1;fill-rule:nonzero;stroke:none;stroke-width:0.572489;marker:none;enable-background:accumulate"
           id="path6692-6-1-4"
           cx="362.03891"
           cy="150.56969"
           rx="1.0854704"
           ry="1.131132" />
        <path
           style="color:#000000;font-style:normal;font-variant:normal;font-weight:normal;font-stretch:normal;font-size:xx-small;line-height:normal;font-family:sans-serif;-inkscape-font-specification:sans-serif;text-indent:0;text-align:start;text-decoration:none;text-decoration-line:none;letter-spacing:normal;word-spacing:normal;text-transform:none;writing-mode:lr-tb;direction:ltr;baseline-shift:baseline;text-anchor:start;display:inline;overflow:visible;visibility:visible;fill:#d1d3d4;fill-opacity:1;stroke:none;stroke-width:2;marker:none;enable-background:accumulate"
           d="m 358.07061,151.19298 c -2.82685,-0.547 -3.57359,3.80009 -6.14514,3.63008 -0.57398,0.27138 -0.9605,0.54712 -1.21764,0.79404 -0.25714,0.24704 -0.42474,0.53897 -0.42474,0.53897 l 1.61414,0.8224 c 0,0 -0.0218,0.0459 0.085,-0.0562 0.10791,-0.10332 0.32292,-0.25841 0.73619,-0.45379 0.82676,-0.39088 6.27716,-3.6194 5.35225,-0.85075 -0.51154,1.53126 -1.48214,7.29137 3.04312,7.31572 3.50209,-2.80734 4.83683,-3.05438 4.63123,-5.64246 0,0 -0.0872,-0.32969 -0.31156,-0.68062 -0.22362,-0.35105 -0.59315,-0.79772 -1.16105,-1.2196 -2.27399,0.10562 -3.68496,-3.71066 -6.20163,-4.19774 z"
           id="path6995-7-7-7"
           inkscape:connector-curvature="0"
           sodipodi:nodetypes="scsccccsccccs" />
        <ellipse
           inkscape:transform-center-y="-2.9686312"
           inkscape:transform-center-x="39.240512"
           transform="matrix(-0.99987629,0.01572937,-0.040964,-0.99916062,0,0)"
           style="color:#000000;display:inline;overflow:visible;visibility:visible;fill:#000000;fill-opacity:1;fill-rule:nonzero;stroke:none;stroke-width:1.45191;marker:none;enable-background:accumulate"
           id="path6694-4-1-4"
           cx="-351.11005"
           cy="-169.9435"
           rx="2.7647743"
           ry="2.856396" />
        <g
           clip-path="none"
           style="display:inline;stroke:#60605b;stroke-width:20.3085;stroke-linejoin:round;stroke-miterlimit:4;stroke-dasharray:none"
           id="g4706-3"
           transform="matrix(0.42781511,0,0,0.4284436,37.42755,-1325.3692)"
           mask="none">
          <path
             inkscape:connector-curvature="0"
             id="path4708-4"
             d="m 731.48423,3399.7842 c -0.69979,-0.051 -1.44171,0.095 -2.09633,0.5024 -3.22615,2.005 -0.76878,9.3314 1.59321,14.6528 -1.57931,1.111 -2.8893,2.1573 -3.60569,2.8468 -6,6 -9.47543,22.9517 -9.47543,24.9517 0,1.9999 -8.46919,9.0428 -8.46919,9.0428 0,0 8.27902,4.989 8.77902,8.989 0.5,4 18.21849,20.9865 27.78104,20.9865 9.56255,0 29.01639,-18.4397 29.51638,-22.4397 0.5,-4 7.04369,-7.5358 7.04369,-7.5358 0,0 -8.55305,-7.0429 -8.55305,-9.0428 0,-2 -3.47543,-18.9517 -9.47543,-24.9517 -1.42807,-1.4281 -2.85354,-2.6565 -4.36037,-3.7679 2.22519,-5.2148 4.22243,-11.8372 1.17395,-13.7317 -4.8398,-3.0079 -11.10613,7.6779 -12.07489,9.3778 -1.05173,-0.1254 -2.10232,-0.2512 -3.27028,-0.2512 -1.44792,0 -2.88252,0.2693 -4.27652,0.5861 -0.38816,-0.6971 -5.51284,-9.8717 -10.23011,-10.2151 z"
             style="fill:#000000;stroke:#000000;stroke-width:20.3085;stroke-linejoin:round;stroke-miterlimit:4;stroke-dasharray:none"
             sodipodi:nodetypes="ccccscssscsscccscc" />
        </g>
        <g
           transform="matrix(0.42781511,0,0,0.4284436,138.24415,-1327.5641)"
           id="g6709-7-2-9"
           style="display:inline;stroke:#60605b;stroke-width:7.9743;stroke-linejoin:round;stroke-miterlimit:4;stroke-dasharray:none"
           clip-path="none">
          <path
             style="fill:#000000;stroke:#60605b;stroke-width:7.9743;stroke-linejoin:round;stroke-miterlimit:4;stroke-dasharray:none"
             d="m 506.5,3415 c 0,0 -7.26301,-13.2547 -12.5,-10 -5.23699,3.2547 4.5,20.5 4.5,20.5 z"
             id="path6713-9-4-4"
             inkscape:connector-curvature="0"
             sodipodi:nodetypes="czcc" />
          <path
             sodipodi:nodetypes="czcc"
             inkscape:connector-curvature="0"
             id="path6715-1-5-9"
             d="m 513.4528,3415 c 0,0 7.26301,-13.2547 12.5,-10 5.23699,3.2547 -4.5,20.5 -4.5,20.5 z"
             style="fill:#000000;stroke:#60605b;stroke-width:7.9743;stroke-linejoin:round;stroke-miterlimit:4;stroke-dasharray:none" />
          <path
             style="fill:#ffffff;stroke:#60605b;stroke-width:7.9743;stroke-linejoin:round;stroke-miterlimit:4;stroke-dasharray:none"
             d="m 492,3422.5 c -6,6 -9.5,23 -9.5,25 0,2 -8.5,9 -8.5,9 0,0 6.5,3.5 7,7.5 0.5,4 20,22.5 29.56255,22.5 9.56255,0 29.06255,-18.5 29.56255,-22.5 0.5,-4 7,-7.5 7,-7.5 0,0 -8.5,-7 -8.5,-9 0,-2 -3.5,-19 -9.5,-25 -5.08871,-5.0887 -10.24207,-8.375 -18.5625,-8.375 -8.32043,0 -16.18949,6.0911 -18.5626,8.375 z"
             id="path6718-7-1-2"
             inkscape:connector-curvature="0"
             sodipodi:nodetypes="cscscscsszc" />
          <path
             style="color:#000000;display:inline;overflow:visible;visibility:visible;fill:#000000;fill-opacity:1;fill-rule:nonzero;stroke:#60605b;stroke-width:7.9743;stroke-linejoin:round;stroke-miterlimit:4;stroke-dasharray:none;marker:none;enable-background:accumulate"
             d="m 519.09375,3415.5625 c -1.58431,1.2812 -2.59375,3.232 -2.59375,5.4375 v 32.5 c 0,3.878 3.122,7 7,7 3.878,0 7,-3.122 7,-7 v -29.3438 c -0.44597,-0.6048 -0.89676,-1.178 -1.375,-1.6562 -3.08852,-3.0885 -6.20147,-5.5087 -10.03125,-6.9375 z"
             id="path6720-6-3-5"
             inkscape:connector-curvature="0"
             sodipodi:nodetypes="cssssccc" />
          <path
             style="color:#000000;display:inline;overflow:visible;visibility:visible;fill:#000000;fill-opacity:1;fill-rule:nonzero;stroke:#60605b;stroke-width:7.9743;stroke-linejoin:round;stroke-miterlimit:4;stroke-dasharray:none;marker:none;enable-background:accumulate"
             d="m 502.3125,3415.9062 c -4.84472,1.9816 -8.75993,5.0996 -10.3125,6.5938 -0.52532,0.5253 -1.01368,1.1672 -1.5,1.8438 V 3453.5 c 0,3.878 3.122,7 7,7 3.878,0 7,-3.122 7,-7 V 3421 c 0,-2.0119 -0.83726,-3.8192 -2.1875,-5.0938 z"
             id="path6722-5-9-2"
             inkscape:connector-curvature="0"
             sodipodi:nodetypes="cccssssc" />
          <ellipse
             style="color:#000000;display:inline;overflow:visible;visibility:visible;fill:#ffffff;fill-opacity:1;fill-rule:nonzero;stroke:#60605b;stroke-width:7.9743;stroke-linejoin:round;stroke-miterlimit:4;stroke-dasharray:none;marker:none;enable-background:accumulate"
             id="path6724-3-7-9"
             cx="498"
             cy="3446.5"
             rx="3"
             ry="5" />
          <ellipse
             id="path6726-4-9-6"
             style="color:#000000;display:inline;overflow:visible;visibility:visible;fill:#ffffff;fill-opacity:1;fill-rule:nonzero;stroke:#60605b;stroke-width:7.9743;stroke-linejoin:round;stroke-miterlimit:4;stroke-dasharray:none;marker:none;enable-background:accumulate"
             transform="translate(24)"
             cx="498"
             cy="3446.5"
             rx="3"
             ry="5" />
          <ellipse
             id="path6728-7-9-1"
             style="color:#000000;display:inline;overflow:visible;visibility:visible;fill:#000000;fill-opacity:1;fill-rule:nonzero;stroke:#60605b;stroke-width:5.06061;stroke-linejoin:round;stroke-miterlimit:4;stroke-dasharray:none;marker:none;enable-background:accumulate"
             transform="matrix(0,1.5757576,-1.5757576,0,5941.4111,2690.5455)"
             inkscape:transform-center-x="3.1515684"
             inkscape:transform-center-y="21.272785"
             cx="498"
             cy="3446.5"
             rx="3"
             ry="5" />
        </g>
        <path
           sodipodi:nodetypes="czcc"
           inkscape:connector-curvature="0"
           id="path6686-1-9-2"
           d="m 354.93244,135.57063 c 0,0 -3.10719,-5.67896 -5.34766,-4.28441 -2.24047,1.39442 1.92513,8.78303 1.92513,8.78303 z"
           style="display:inline;fill:#000000;stroke:none" />
        <path
           style="display:inline;fill:#000000;stroke:none"
           d="m 357.90692,135.57063 c 0,0 3.10729,-5.67896 5.34778,-4.28441 2.24035,1.39442 -1.92526,8.78303 -1.92526,8.78303 z"
           id="path6688-7-0-8"
           inkscape:connector-curvature="0"
           sodipodi:nodetypes="czcc" />
        <path
           sodipodi:nodetypes="cssscsssszc"
           inkscape:connector-curvature="0"
           id="path6635-7-5-8"
           d="m 348.72909,138.78388 c -2.56683,2.57074 -4.06423,9.8542 -4.06423,10.71115 0,0.85684 -4.42688,1.90217 -4.41472,3.856 0.0115,1.65191 3.55914,1.49958 3.77301,3.21325 0.21375,1.71379 8.55631,9.63999 12.6473,9.63999 4.09098,0 12.43344,-7.9262 12.64731,-9.63999 0.21375,-1.71367 3.68323,-1.84236 3.61733,-3.52458 -0.0723,-1.84557 -4.25904,-2.68783 -4.25904,-3.54467 0,-0.85695 -1.4974,-8.14041 -4.06424,-10.71115 -2.17699,-2.1802 -4.38165,-3.58817 -7.94136,-3.58817 -3.5596,0 -6.9261,2.60965 -7.94136,3.58817 z"
           style="display:inline;fill:#ffffff;fill-opacity:1;stroke:#60605b;stroke-width:2.79413;stroke-miterlimit:4;stroke-dasharray:none" />
        <path
           sodipodi:nodetypes="cssssccc"
           inkscape:connector-curvature="0"
           id="rect6656-3-5-7"
           d="m 362.61884,134.56639 c -0.67775,0.54896 -1.12157,2.641 -1.26529,3.57487 l -2.1429,13.9244 c -0.25278,1.64216 1.33554,2.99916 2.9947,2.99916 1.65903,0 2.71549,-1.36136 2.99468,-2.99916 l 2.14289,-12.57211 c -0.19079,-0.25932 -0.38364,-0.50476 -0.58821,-0.70967 -1.00998,-2.25711 -2.49739,-3.60539 -4.13587,-4.21749 z"
           style="color:#000000;display:inline;overflow:visible;visibility:visible;fill:#000000;fill-opacity:1;fill-rule:nonzero;stroke:none;stroke-width:2.001;marker:none;enable-background:accumulate" />
        <path
           sodipodi:nodetypes="cccssssc"
           inkscape:connector-curvature="0"
           id="rect6658-7-3-5"
           d="m 350.99803,135.18055 c -2.07264,0.84903 -2.50232,1.09539 -4.41183,3.60333 -0.22477,0.22512 -0.4337,0.50017 -0.64171,0.79003 l 2.14289,12.49175 c 0.28091,1.63756 1.33565,2.99916 2.9948,2.99916 1.65903,0 3.24735,-1.357 2.99468,-2.99916 l -2.14301,-13.9244 c -0.1311,-0.85191 -0.35816,-2.41462 -0.93582,-2.96071 z"
           style="color:#000000;display:inline;overflow:visible;visibility:visible;fill:#000000;fill-opacity:1;fill-rule:nonzero;stroke:none;stroke-width:2.001;marker:none;enable-background:accumulate" />
        <ellipse
           id="path6690-0-4-0"
           style="color:#000000;display:inline;overflow:visible;visibility:visible;fill:#ffffff;fill-opacity:1;fill-rule:nonzero;stroke:none;stroke-width:0.676903;marker:none;enable-background:accumulate"
           cx="351.29608"
           cy="149.06664"
           rx="1.2834454"
           ry="1.337435" />
        <ellipse
           style="color:#000000;display:inline;overflow:visible;visibility:visible;fill:#ffffff;fill-opacity:1;fill-rule:nonzero;stroke:none;stroke-width:0.676903;marker:none;enable-background:accumulate"
           id="path6692-4-5-3"
           cx="361.56366"
           cy="149.06664"
           rx="1.2834454"
           ry="1.337435" />
        <path
           style="color:#000000;font-style:normal;font-variant:normal;font-weight:normal;font-stretch:normal;font-size:xx-small;line-height:normal;font-family:sans-serif;-inkscape-font-specification:sans-serif;text-indent:0;text-align:start;text-decoration:none;text-decoration-line:none;letter-spacing:normal;word-spacing:normal;text-transform:none;writing-mode:lr-tb;direction:ltr;baseline-shift:baseline;text-anchor:start;display:inline;overflow:visible;visibility:visible;fill:#d1d3d4;fill-opacity:1;stroke:none;stroke-width:2;marker:none;enable-background:accumulate"
           d="m 356.87169,149.80349 c -3.3424,-0.64676 -4.22553,4.49323 -7.2659,4.29222 -0.67879,0.32086 -1.13579,0.64688 -1.43989,0.93892 -0.30398,0.29215 -0.50223,0.63723 -0.50223,0.63723 l 1.9086,0.97232 c 0,0 -0.0253,0.0551 0.0999,-0.0666 0.12696,-0.1218 0.38181,-0.30547 0.8705,-0.53644 0.9776,-0.46228 7.42201,-4.27959 6.32847,-1.00607 -0.60486,1.81056 -1.75248,8.62129 3.59805,8.65021 4.14093,-3.31955 5.71903,-3.61159 5.47589,-6.6717 0,0 -0.10332,-0.38985 -0.36826,-0.80472 -0.26449,-0.41511 -0.70141,-0.94328 -1.37285,-1.44207 -2.68876,0.12513 -4.35709,-4.38739 -7.33283,-4.96332 z"
           id="path6995-1-2-6"
           inkscape:connector-curvature="0"
           sodipodi:nodetypes="scsccccsccccs" />
        <ellipse
           inkscape:transform-center-y="-3.5094049"
           inkscape:transform-center-x="46.397538"
           transform="matrix(-0.99987629,0.01572938,-0.04096398,-0.99916062,0,0)"
           style="color:#000000;display:inline;overflow:visible;visibility:visible;fill:#000000;fill-opacity:1;fill-rule:nonzero;stroke:none;stroke-width:1.71672;marker:none;enable-background:accumulate"
           id="path6694-7-8-5"
           cx="-349.86301"
           cy="-170.92172"
           rx="3.269031"
           ry="3.3773632" />
      </g>
    </g>
  </g>
</svg>
