<?xml version="1.0" encoding="UTF-8" standalone="no"?>
<svg
   xmlns:dc="http://purl.org/dc/elements/1.1/"
   xmlns:cc="http://creativecommons.org/ns#"
   xmlns:rdf="http://www.w3.org/1999/02/22-rdf-syntax-ns#"
   xmlns:svg="http://www.w3.org/2000/svg"
   xmlns="http://www.w3.org/2000/svg"
   xmlns:xlink="http://www.w3.org/1999/xlink"
   xmlns:sodipodi="http://sodipodi.sourceforge.net/DTD/sodipodi-0.dtd"
   xmlns:inkscape="http://www.inkscape.org/namespaces/inkscape"
   id="svg4326"
   version="1.1"
   inkscape:version="1.0.2-2 (e86c870879, 2021-01-15)"
   width="256"
   height="256"
   sodipodi:docname="welcome2.svg"
   inkscape:export-filename="C:\Users\pc\Desktop\Fedora\badges\welcome2.png"
   inkscape:export-xdpi="90"
   inkscape:export-ydpi="90">
  <metadata
     id="metadata4332">
    <rdf:RDF>
      <cc:Work
         rdf:about="">
        <dc:format>image/svg+xml</dc:format>
        <dc:type
           rdf:resource="http://purl.org/dc/dcmitype/StillImage" />
        <dc:title />
      </cc:Work>
    </rdf:RDF>
  </metadata>
  <defs
     id="defs4330">
    <linearGradient
       id="linearGradient40097">
      <stop
         style="stop-color:#c4c7cc;stop-opacity:1;"
         offset="0"
         id="stop40099" />
      <stop
         style="stop-color:#eff0f1;stop-opacity:1;"
         offset="1"
         id="stop40101" />
    </linearGradient>
    <linearGradient
       id="linearGradient39902">
      <stop
         style="stop-color:#79db32;stop-opacity:1;"
         offset="0"
         id="stop39904" />
      <stop
         style="stop-color:#000000;stop-opacity:1;"
         offset="1"
         id="stop39906" />
    </linearGradient>
    <linearGradient
       id="linearGradient37905">
      <stop
         style="stop-color:#294172;stop-opacity:1;"
         offset="0"
         id="stop37907" />
      <stop
         id="stop37913"
         offset="0.74811548"
         style="stop-color:#acc4e4;stop-opacity:1;" />
      <stop
         style="stop-color:#6a82ab;stop-opacity:1;"
         offset="0.90435892"
         id="stop37917" />
      <stop
         style="stop-color:#294172;stop-opacity:1;"
         offset="1"
         id="stop37909" />
    </linearGradient>
    <linearGradient
       id="linearGradient11208">
      <stop
         style="stop-color:#ffffff;stop-opacity:1;"
         offset="0"
         id="stop11210" />
      <stop
         style="stop-color:#8faed9;stop-opacity:1;"
         offset="1"
         id="stop11212" />
    </linearGradient>
    <linearGradient
       inkscape:collect="always"
       xlink:href="#linearGradient23243-0"
       id="linearGradient11673"
       gradientUnits="userSpaceOnUse"
       x1="452.89532"
       y1="692.18036"
       x2="549.71472"
       y2="588.13464" />
    <linearGradient
       inkscape:collect="always"
       id="linearGradient23243-0">
      <stop
         style="stop-color:#db3279;stop-opacity:1;"
         offset="0"
         id="stop23245-9" />
      <stop
         style="stop-color:#db3279;stop-opacity:0;"
         offset="1"
         id="stop23247-6" />
    </linearGradient>
    <linearGradient
       inkscape:collect="always"
       xlink:href="#linearGradient29617-7"
       id="linearGradient11675"
       gradientUnits="userSpaceOnUse"
       x1="500.41754"
       y1="598.07538"
       x2="531.51129"
       y2="682.98608" />
    <linearGradient
       inkscape:collect="always"
       id="linearGradient29617-7">
      <stop
         style="stop-color:#6e0733;stop-opacity:1;"
         offset="0"
         id="stop29619-3" />
      <stop
         style="stop-color:#6e0733;stop-opacity:0;"
         offset="1"
         id="stop29621-9" />
    </linearGradient>
    <linearGradient
       inkscape:collect="always"
       xlink:href="#linearGradient17017-5"
       id="linearGradient11677"
       gradientUnits="userSpaceOnUse"
       x1="477.17944"
       y1="4054.9666"
       x2="507.65854"
       y2="4028.2605" />
    <linearGradient
       id="linearGradient17017-5">
      <stop
         style="stop-color:#313b31;stop-opacity:1;"
         offset="0"
         id="stop17019-8" />
      <stop
         style="stop-color:#313b31;stop-opacity:0.62711865;"
         offset="1"
         id="stop17021-3" />
    </linearGradient>
    <linearGradient
       inkscape:collect="always"
       xlink:href="#linearGradient22742-8"
       id="linearGradient11679"
       gradientUnits="userSpaceOnUse"
       x1="297.87323"
       y1="273.94583"
       x2="337.01941"
       y2="237.20154" />
    <linearGradient
       inkscape:collect="always"
       id="linearGradient22742-8">
      <stop
         style="stop-color:#361f00;stop-opacity:1;"
         offset="0"
         id="stop22744-4" />
      <stop
         style="stop-color:#361f00;stop-opacity:0;"
         offset="1"
         id="stop22746-6" />
    </linearGradient>
    <filter
       color-interpolation-filters="sRGB"
       id="filter22728-9"
       inkscape:label="Drop shadow"
       width="1.5"
       height="1.5"
       x="-0.25"
       y="-0.25">
      <feGaussianBlur
         id="feGaussianBlur22730-3"
         in="SourceAlpha"
         stdDeviation="0.2"
         result="blur" />
      <feColorMatrix
         id="feColorMatrix22732-4"
         result="bluralpha"
         type="matrix"
         values="1 0 0 0 0 0 1 0 0 0 0 0 1 0 0 0 0 0 0.9 0 " />
      <feOffset
         id="feOffset22734-1"
         in="bluralpha"
         dx="-0.4"
         dy="0.2"
         result="offsetBlur" />
      <feMerge
         id="feMerge22736-7">
        <feMergeNode
           id="feMergeNode22738-0"
           in="offsetBlur" />
        <feMergeNode
           id="feMergeNode22740-2"
           in="SourceGraphic" />
      </feMerge>
    </filter>
    <linearGradient
       inkscape:collect="always"
       xlink:href="#linearGradient6887"
       id="linearGradient6893"
       x1="152.47856"
       y1="86.949074"
       x2="146.28004"
       y2="95.386421"
       gradientUnits="userSpaceOnUse"
       gradientTransform="matrix(0.83323544,0,0,0.83323544,24.800776,16.151034)" />
    <linearGradient
       inkscape:collect="always"
       id="linearGradient6887">
      <stop
         style="stop-color:#294172;stop-opacity:1;"
         offset="0"
         id="stop6889" />
      <stop
         style="stop-color:#294172;stop-opacity:0;"
         offset="1"
         id="stop6891" />
    </linearGradient>
    <linearGradient
       gradientTransform="translate(-0.38360769,1.5340371)"
       inkscape:collect="always"
       xlink:href="#linearGradient5318"
       id="linearGradient6072"
       x1="192.24194"
       y1="149.56042"
       x2="193.39502"
       y2="200.54347"
       gradientUnits="userSpaceOnUse" />
    <linearGradient
       id="linearGradient5318">
      <stop
         style="stop-color:#ffffff;stop-opacity:1;"
         offset="0"
         id="stop5320" />
      <stop
         style="stop-color:#000000;stop-opacity:1;"
         offset="1"
         id="stop5322" />
    </linearGradient>
    <linearGradient
       gradientTransform="translate(-0.38360769,1.5340371)"
       inkscape:collect="always"
       xlink:href="#linearGradient5318"
       id="linearGradient5332"
       x1="170.92427"
       y1="157.8367"
       x2="171.42072"
       y2="129.09328"
       gradientUnits="userSpaceOnUse" />
    <linearGradient
       id="linearGradient7719">
      <stop
         style="stop-color:#ffffff;stop-opacity:1;"
         offset="0"
         id="stop7721" />
      <stop
         style="stop-color:#000000;stop-opacity:1;"
         offset="1"
         id="stop7723" />
    </linearGradient>
    <linearGradient
       gradientTransform="translate(-0.38360769,1.5340371)"
       inkscape:collect="always"
       xlink:href="#linearGradient5318"
       id="linearGradient6104"
       x1="72.742928"
       y1="192.52098"
       x2="101.91525"
       y2="216.92775"
       gradientUnits="userSpaceOnUse" />
    <linearGradient
       id="linearGradient7726">
      <stop
         style="stop-color:#ffffff;stop-opacity:1;"
         offset="0"
         id="stop7728" />
      <stop
         style="stop-color:#000000;stop-opacity:1;"
         offset="1"
         id="stop7730" />
    </linearGradient>
    <linearGradient
       gradientTransform="translate(-0.38360769,1.5340371)"
       inkscape:collect="always"
       xlink:href="#linearGradient5318"
       id="linearGradient6096"
       x1="98.179436"
       y1="193.99844"
       x2="130.60793"
       y2="222.77711"
       gradientUnits="userSpaceOnUse" />
    <linearGradient
       id="linearGradient7733">
      <stop
         style="stop-color:#ffffff;stop-opacity:1;"
         offset="0"
         id="stop7735" />
      <stop
         style="stop-color:#000000;stop-opacity:1;"
         offset="1"
         id="stop7737" />
    </linearGradient>
    <linearGradient
       gradientTransform="translate(-0.38360769,1.5340371)"
       inkscape:collect="always"
       xlink:href="#linearGradient5318"
       id="linearGradient6112"
       x1="69.313126"
       y1="160.86015"
       x2="75.712608"
       y2="206.14597"
       gradientUnits="userSpaceOnUse" />
    <linearGradient
       id="linearGradient7740">
      <stop
         style="stop-color:#ffffff;stop-opacity:1;"
         offset="0"
         id="stop7742" />
      <stop
         style="stop-color:#000000;stop-opacity:1;"
         offset="1"
         id="stop7744" />
    </linearGradient>
    <linearGradient
       gradientTransform="translate(-0.38360769,1.5340371)"
       inkscape:collect="always"
       xlink:href="#linearGradient5318"
       id="linearGradient6056"
       x1="91.991798"
       y1="154.2856"
       x2="92.195442"
       y2="131.70004"
       gradientUnits="userSpaceOnUse" />
    <linearGradient
       id="linearGradient7747">
      <stop
         style="stop-color:#ffffff;stop-opacity:1;"
         offset="0"
         id="stop7749" />
      <stop
         style="stop-color:#000000;stop-opacity:1;"
         offset="1"
         id="stop7751" />
    </linearGradient>
    <linearGradient
       inkscape:collect="always"
       xlink:href="#linearGradient5318"
       id="linearGradient6064"
       x1="592.83405"
       y1="237.41403"
       x2="658.74683"
       y2="258.24808"
       gradientUnits="userSpaceOnUse" />
    <linearGradient
       id="linearGradient7754">
      <stop
         style="stop-color:#ffffff;stop-opacity:1;"
         offset="0"
         id="stop7756" />
      <stop
         style="stop-color:#000000;stop-opacity:1;"
         offset="1"
         id="stop7758" />
    </linearGradient>
    <linearGradient
       inkscape:collect="always"
       xlink:href="#linearGradient5318"
       id="linearGradient5324"
       x1="291.72986"
       y1="354.82562"
       x2="293.57449"
       y2="443.88025"
       gradientUnits="userSpaceOnUse" />
    <linearGradient
       id="linearGradient7761">
      <stop
         style="stop-color:#ffffff;stop-opacity:1;"
         offset="0"
         id="stop7763" />
      <stop
         style="stop-color:#000000;stop-opacity:1;"
         offset="1"
         id="stop7765" />
    </linearGradient>
    <radialGradient
       inkscape:collect="always"
       xlink:href="#linearGradient4947-5-0-7-3-9"
       id="radialGradient18291-2-4-0-3"
       gradientUnits="userSpaceOnUse"
       gradientTransform="matrix(-0.7316961,2.1285669,-1.4003566,-0.48137343,676.25046,-226.37449)"
       cx="237.44824"
       cy="189.28197"
       fx="237.44824"
       fy="189.28197"
       r="13.88452" />
    <linearGradient
       id="linearGradient4947-5-0-7-3-9">
      <stop
         id="stop4949-2-7-0-6-9"
         offset="0"
         style="stop-color:#fbf8fc;stop-opacity:1;" />
      <stop
         style="stop-color:#c37fff;stop-opacity:0.49803922;"
         offset="0.48298526"
         id="stop4953-5-5-1-1-7" />
      <stop
         id="stop4951-8-6-5-9-0"
         offset="1"
         style="stop-color:#492063;stop-opacity:1;" />
    </linearGradient>
    <linearGradient
       gradientTransform="matrix(1.4616718,0,0,1.4616718,-338.62059,-317.56702)"
       inkscape:collect="always"
       xlink:href="#linearGradient32286"
       id="linearGradient32314"
       x1="320.47412"
       y1="289.18347"
       x2="319.35144"
       y2="312.03287"
       gradientUnits="userSpaceOnUse" />
    <linearGradient
       inkscape:collect="always"
       id="linearGradient32286">
      <stop
         style="stop-color:#1d2c4a;stop-opacity:1;"
         offset="0"
         id="stop32288" />
      <stop
         style="stop-color:#1d2c4a;stop-opacity:0;"
         offset="1"
         id="stop32290" />
    </linearGradient>
    <linearGradient
       gradientTransform="translate(-0.38360769,1.5340371)"
       inkscape:collect="always"
       xlink:href="#linearGradient6879"
       id="linearGradient6885"
       x1="127.13274"
       y1="97.141052"
       x2="114.34079"
       y2="107.49597"
       gradientUnits="userSpaceOnUse" />
    <linearGradient
       inkscape:collect="always"
       id="linearGradient6879">
      <stop
         style="stop-color:#294172;stop-opacity:1;"
         offset="0"
         id="stop6881" />
      <stop
         style="stop-color:#294172;stop-opacity:0;"
         offset="1"
         id="stop6883" />
    </linearGradient>
    <linearGradient
       gradientTransform="matrix(1.4616718,0,0,1.4616718,-371.07765,-618.37027)"
       inkscape:collect="always"
       xlink:href="#linearGradient15830-5-0"
       id="linearGradient32304"
       x1="340.70831"
       y1="466.18604"
       x2="338.97745"
       y2="507.3194"
       gradientUnits="userSpaceOnUse" />
    <linearGradient
       id="linearGradient15830-5-0">
      <stop
         style="stop-color:#ffffff;stop-opacity:1;"
         offset="0"
         id="stop15832-7-1" />
      <stop
         style="stop-color:#ffffcf;stop-opacity:0;"
         offset="1"
         id="stop15834-1-1" />
    </linearGradient>
    <linearGradient
       inkscape:collect="always"
       xlink:href="#linearGradient5318"
       id="linearGradient8585"
       gradientUnits="userSpaceOnUse"
       x1="592.83405"
       y1="237.41403"
       x2="658.74683"
       y2="258.24808" />
    <linearGradient
       inkscape:collect="always"
       xlink:href="#linearGradient5318"
       id="linearGradient8587"
       gradientUnits="userSpaceOnUse"
       gradientTransform="translate(-231.25996,17.258174)"
       x1="91.991798"
       y1="154.2856"
       x2="92.195442"
       y2="131.70004" />
    <linearGradient
       inkscape:collect="always"
       xlink:href="#linearGradient5318"
       id="linearGradient8589"
       gradientUnits="userSpaceOnUse"
       gradientTransform="translate(-231.25996,17.258174)"
       x1="69.313126"
       y1="160.86015"
       x2="75.712608"
       y2="206.14597" />
    <linearGradient
       inkscape:collect="always"
       xlink:href="#linearGradient5318"
       id="linearGradient8591"
       gradientUnits="userSpaceOnUse"
       gradientTransform="translate(-231.25996,17.258174)"
       x1="98.179436"
       y1="193.99844"
       x2="130.60793"
       y2="222.77711" />
    <linearGradient
       inkscape:collect="always"
       xlink:href="#linearGradient5318"
       id="linearGradient8593"
       gradientUnits="userSpaceOnUse"
       gradientTransform="translate(-231.25996,17.258174)"
       x1="72.742928"
       y1="192.52098"
       x2="101.91525"
       y2="216.92775" />
    <linearGradient
       inkscape:collect="always"
       xlink:href="#linearGradient5318"
       id="linearGradient8595"
       gradientUnits="userSpaceOnUse"
       gradientTransform="translate(-231.25996,17.258174)"
       x1="170.92427"
       y1="157.8367"
       x2="171.42072"
       y2="129.09328" />
    <linearGradient
       inkscape:collect="always"
       xlink:href="#linearGradient5318"
       id="linearGradient8597"
       gradientUnits="userSpaceOnUse"
       gradientTransform="translate(-231.25996,17.258174)"
       x1="192.24194"
       y1="149.56042"
       x2="193.39502"
       y2="200.54347" />
    <radialGradient
       inkscape:collect="always"
       xlink:href="#linearGradient4123-8-9"
       id="radialGradient16298"
       gradientUnits="userSpaceOnUse"
       gradientTransform="matrix(0.91987058,1.0040795,-1.1410488,1.0453515,2112.1869,-1131.7579)"
       cx="1046.8716"
       cy="1777.5768"
       fx="1046.8716"
       fy="1777.5768"
       r="32.499802" />
    <linearGradient
       id="linearGradient4123-8-9">
      <stop
         style="stop-color:#ffffff;stop-opacity:1;"
         offset="0"
         id="stop4125-6-9" />
      <stop
         id="stop4155-5-2"
         offset="0.5"
         style="stop-color:#ffffff;stop-opacity:0.49152541;" />
      <stop
         style="stop-color:#ffffff;stop-opacity:0"
         offset="1"
         id="stop4127-3-7" />
    </linearGradient>
    <clipPath
       clipPathUnits="userSpaceOnUse"
       id="clipPath16933">
      <path
         style="fill:none;stroke:none;display:inline"
         id="path16935"
         d="m 1089.3409,1795.1414 c 0,-16.7572 -13.5836,-30.3419 -30.3402,-30.3419 -16.7489,0 -30.3272,13.5735 -30.3393,30.3205 l -9e-4,-9e-4 0,23.4796 9e-4,10e-4 c 0.01,3.8024 3.0927,6.8807 6.8975,6.8807 0.01,0 0.021,-9e-4 0.033,-9e-4 l 0,9e-4 23.4189,0 0,0 c 16.7518,-0.01 30.3287,-13.5865 30.3287,-30.3389 z"
         inkscape:connector-curvature="0"
         clip-path="none" />
    </clipPath>
    <linearGradient
       id="linearGradient9915">
      <stop
         style="stop-color:#ffffff;stop-opacity:1;"
         offset="0"
         id="stop9917" />
      <stop
         id="stop9919"
         offset="0.5"
         style="stop-color:#ffffff;stop-opacity:0.49152541;" />
      <stop
         style="stop-color:#ffffff;stop-opacity:0"
         offset="1"
         id="stop9921" />
    </linearGradient>
    <linearGradient
       id="linearGradient9924">
      <stop
         style="stop-color:#ffffff;stop-opacity:1;"
         offset="0"
         id="stop9926" />
      <stop
         id="stop9928"
         offset="0.5"
         style="stop-color:#ffffff;stop-opacity:0.49152541;" />
      <stop
         style="stop-color:#ffffff;stop-opacity:0"
         offset="1"
         id="stop9930" />
    </linearGradient>
    <linearGradient
       id="linearGradient9933">
      <stop
         style="stop-color:#ffffff;stop-opacity:1;"
         offset="0"
         id="stop9935" />
      <stop
         id="stop9937"
         offset="0.5"
         style="stop-color:#ffffff;stop-opacity:0.49152541;" />
      <stop
         style="stop-color:#ffffff;stop-opacity:0"
         offset="1"
         id="stop9939" />
    </linearGradient>
    <linearGradient
       id="linearGradient9942">
      <stop
         style="stop-color:#ffffff;stop-opacity:1;"
         offset="0"
         id="stop9944" />
      <stop
         id="stop9946"
         offset="0.5"
         style="stop-color:#ffffff;stop-opacity:0.49152541;" />
      <stop
         style="stop-color:#ffffff;stop-opacity:0"
         offset="1"
         id="stop9948" />
    </linearGradient>
    <linearGradient
       id="linearGradient9951">
      <stop
         style="stop-color:#ffffff;stop-opacity:1;"
         offset="0"
         id="stop9953" />
      <stop
         id="stop9955"
         offset="0.5"
         style="stop-color:#ffffff;stop-opacity:0.49152541;" />
      <stop
         style="stop-color:#ffffff;stop-opacity:0"
         offset="1"
         id="stop9957" />
    </linearGradient>
    <linearGradient
       id="linearGradient9960">
      <stop
         style="stop-color:#ffffff;stop-opacity:1;"
         offset="0"
         id="stop9962" />
      <stop
         id="stop9964"
         offset="0.5"
         style="stop-color:#ffffff;stop-opacity:0.49152541;" />
      <stop
         style="stop-color:#ffffff;stop-opacity:0"
         offset="1"
         id="stop9966" />
    </linearGradient>
    <linearGradient
       id="linearGradient9969">
      <stop
         style="stop-color:#ffffff;stop-opacity:1;"
         offset="0"
         id="stop9971" />
      <stop
         id="stop9973"
         offset="0.5"
         style="stop-color:#ffffff;stop-opacity:0.49152541;" />
      <stop
         style="stop-color:#ffffff;stop-opacity:0"
         offset="1"
         id="stop9975" />
    </linearGradient>
    <linearGradient
       id="linearGradient9978">
      <stop
         style="stop-color:#ffffff;stop-opacity:1;"
         offset="0"
         id="stop9980" />
      <stop
         id="stop9982"
         offset="0.5"
         style="stop-color:#ffffff;stop-opacity:0.49152541;" />
      <stop
         style="stop-color:#ffffff;stop-opacity:0"
         offset="1"
         id="stop9984" />
    </linearGradient>
    <linearGradient
       id="linearGradient9987">
      <stop
         style="stop-color:#ffffff;stop-opacity:1;"
         offset="0"
         id="stop9989" />
      <stop
         id="stop9991"
         offset="0.5"
         style="stop-color:#ffffff;stop-opacity:0.49152541;" />
      <stop
         style="stop-color:#ffffff;stop-opacity:0"
         offset="1"
         id="stop9993" />
    </linearGradient>
    <linearGradient
       id="linearGradient9996">
      <stop
         style="stop-color:#ffffff;stop-opacity:1;"
         offset="0"
         id="stop9998" />
      <stop
         id="stop10000"
         offset="0.5"
         style="stop-color:#ffffff;stop-opacity:0.49152541;" />
      <stop
         style="stop-color:#ffffff;stop-opacity:0"
         offset="1"
         id="stop10002" />
    </linearGradient>
    <linearGradient
       id="linearGradient10005">
      <stop
         style="stop-color:#ffffff;stop-opacity:1;"
         offset="0"
         id="stop10007" />
      <stop
         id="stop10009"
         offset="0.5"
         style="stop-color:#ffffff;stop-opacity:0.49152541;" />
      <stop
         style="stop-color:#ffffff;stop-opacity:0"
         offset="1"
         id="stop10011" />
    </linearGradient>
    <radialGradient
       inkscape:collect="always"
       xlink:href="#linearGradient4123-8-9"
       id="radialGradient16296"
       gradientUnits="userSpaceOnUse"
       gradientTransform="matrix(0.91987058,1.0040795,-1.1410488,1.0453515,2112.1869,-1131.7579)"
       cx="1046.8716"
       cy="1777.5768"
       fx="1046.8716"
       fy="1777.5768"
       r="32.499802" />
    <linearGradient
       id="linearGradient10014">
      <stop
         style="stop-color:#ffffff;stop-opacity:1;"
         offset="0"
         id="stop10016" />
      <stop
         id="stop10018"
         offset="0.5"
         style="stop-color:#ffffff;stop-opacity:0.49152541;" />
      <stop
         style="stop-color:#ffffff;stop-opacity:0"
         offset="1"
         id="stop10020" />
    </linearGradient>
    <radialGradient
       inkscape:collect="always"
       xlink:href="#linearGradient4123-8-9"
       id="radialGradient10397"
       gradientUnits="userSpaceOnUse"
       gradientTransform="matrix(0.91987058,1.0040795,-1.1410488,1.0453515,2112.1869,-1131.7579)"
       cx="1046.8716"
       cy="1777.5768"
       fx="1046.8716"
       fy="1777.5768"
       r="32.499802" />
    <radialGradient
       inkscape:collect="always"
       xlink:href="#linearGradient4123-8-9"
       id="radialGradient10438"
       gradientUnits="userSpaceOnUse"
       gradientTransform="matrix(0.91987058,1.0040795,-1.1410488,1.0453515,2112.1869,-1131.7579)"
       cx="1046.8716"
       cy="1777.5768"
       fx="1046.8716"
       fy="1777.5768"
       r="32.499802" />
    <radialGradient
       inkscape:collect="always"
       xlink:href="#linearGradient4123-8-9"
       id="radialGradient11300"
       gradientUnits="userSpaceOnUse"
       gradientTransform="matrix(0.91987058,1.0040795,-1.1410488,1.0453515,2112.1869,-1131.7579)"
       cx="1046.8716"
       cy="1777.5768"
       fx="1046.8716"
       fy="1777.5768"
       r="32.499802" />
    <radialGradient
       inkscape:collect="always"
       xlink:href="#linearGradient4123-8-9"
       id="radialGradient11501"
       gradientUnits="userSpaceOnUse"
       gradientTransform="matrix(0.91987058,1.0040795,-1.1410488,1.0453515,2112.1869,-1131.7579)"
       cx="1046.8716"
       cy="1777.5768"
       fx="1046.8716"
       fy="1777.5768"
       r="32.499802" />
    <radialGradient
       inkscape:collect="always"
       xlink:href="#linearGradient11208-1"
       id="radialGradient11360-1"
       gradientUnits="userSpaceOnUse"
       gradientTransform="matrix(-0.27845151,-0.02857569,-0.02657561,0.25896197,479.14511,134.36711)"
       cx="290.83282"
       cy="312.50259"
       fx="290.83282"
       fy="312.50259"
       r="48.435627" />
    <linearGradient
       id="linearGradient11208-1">
      <stop
         style="stop-color:#ffffff;stop-opacity:1;"
         offset="0"
         id="stop11210-4" />
      <stop
         style="stop-color:#8faed9;stop-opacity:1;"
         offset="1"
         id="stop11212-3" />
    </linearGradient>
    <clipPath
       clipPathUnits="userSpaceOnUse"
       id="clipPath11543">
      <path
         sodipodi:nodetypes="ccccc"
         inkscape:connector-curvature="0"
         id="path11545"
         d="m 284.81338,107.37079 c 0,0 19.91393,31.28807 40.12881,40.7949 22.18902,-6.96066 66.2192,-20.33372 66.2192,-20.33372 0,0 -20.10664,-16.05802 -27.9407,-49.510962 -42.40374,7.283604 -78.40731,29.049782 -78.40731,29.049782 z"
         style="fill:none;stroke:#878787;stroke-width:3.73500466;stroke-linecap:butt;stroke-linejoin:miter;stroke-miterlimit:4;stroke-opacity:1;stroke-dasharray:none" />
    </clipPath>
    <linearGradient
       id="linearGradient4219">
      <stop
         id="stop4221"
         offset="0"
         style="stop-color:#cccccc;stop-opacity:1;" />
      <stop
         id="stop4223"
         offset="1"
         style="stop-color:#9a9a9a;stop-opacity:1;" />
    </linearGradient>
    <filter
       id="filter37857"
       inkscape:label="Drop shadow"
       width="1.5"
       height="1.5"
       x="-.25"
       y="-.25">
      <feGaussianBlur
         id="feGaussianBlur37859"
         in="SourceAlpha"
         stdDeviation="1.0851612903225807"
         result="blur" />
      <feColorMatrix
         id="feColorMatrix37861"
         result="bluralpha"
         type="matrix"
         values="-1 0 0 0 1 0 -1 0 0 1 0 0 -1 0 1 0 0 0 1 0 " />
      <feOffset
         id="feOffset37863"
         in="bluralpha"
         dx="-2.77556e-17"
         dy="0"
         result="offsetBlur" />
      <feMerge
         id="feMerge37865"
         result="fbSourceGraphic">
        <feMergeNode
           id="feMergeNode37867"
           in="offsetBlur" />
        <feMergeNode
           id="feMergeNode37869"
           in="SourceGraphic" />
      </feMerge>
      <feColorMatrix
         result="fbSourceGraphicAlpha"
         in="fbSourceGraphic"
         values="0 0 0 -1 0 0 0 0 -1 0 0 0 0 -1 0 0 0 0 1 0"
         id="feColorMatrix37871" />
      <feGaussianBlur
         id="feGaussianBlur37873"
         in="fbSourceGraphicAlpha"
         stdDeviation="2"
         result="blur" />
      <feColorMatrix
         id="feColorMatrix37875"
         result="bluralpha"
         type="matrix"
         values="-1 0 0 0 1 0 -1 0 0 1 0 0 -1 0 1 0 0 0 1 0 " />
      <feOffset
         id="feOffset37877"
         in="bluralpha"
         dx="-2.77556e-17"
         dy="0"
         result="offsetBlur" />
      <feMerge
         id="feMerge37879">
        <feMergeNode
           id="feMergeNode37881"
           in="offsetBlur" />
        <feMergeNode
           id="feMergeNode37883"
           in="fbSourceGraphic" />
      </feMerge>
    </filter>
    <filter
       id="filter38210"
       inkscape:label="Drop shadow"
       width="1.5"
       height="1.5"
       x="-.25"
       y="-.25">
      <feGaussianBlur
         id="feGaussianBlur38212"
         in="SourceAlpha"
         stdDeviation="1"
         result="blur" />
      <feColorMatrix
         id="feColorMatrix38214"
         result="bluralpha"
         type="matrix"
         values="1 0 0 0 0 0 1 0 0 0 0 0 1 0 0 0 0 0 1 0 " />
      <feOffset
         id="feOffset38216"
         in="bluralpha"
         dx="0"
         dy="0.7"
         result="offsetBlur" />
      <feMerge
         id="feMerge38218">
        <feMergeNode
           id="feMergeNode38220"
           in="offsetBlur" />
        <feMergeNode
           id="feMergeNode38222"
           in="SourceGraphic" />
      </feMerge>
    </filter>
    <filter
       id="filter38233"
       inkscape:label="Drop shadow"
       width="1.5"
       height="1.5"
       x="-.25"
       y="-.25">
      <feGaussianBlur
         id="feGaussianBlur38235"
         in="SourceAlpha"
         stdDeviation="1"
         result="blur" />
      <feColorMatrix
         id="feColorMatrix38237"
         result="bluralpha"
         type="matrix"
         values="1 0 0 0 0 0 1 0 0 0 0 0 1 0 0 0 0 0 1 0 " />
      <feOffset
         id="feOffset38239"
         in="bluralpha"
         dx="0"
         dy="0.7"
         result="offsetBlur" />
      <feMerge
         id="feMerge38241">
        <feMergeNode
           id="feMergeNode38243"
           in="offsetBlur" />
        <feMergeNode
           id="feMergeNode38245"
           in="SourceGraphic" />
      </feMerge>
    </filter>
    <pattern
       patternTransform="matrix(1.0251511,0,0,1.0251511,-567.88897,480.33698)"
       id="pattern10196"
       xlink:href="#pattern6268"
       inkscape:collect="always" />
    <pattern
       inkscape:collect="always"
       xlink:href="#pattern6259"
       id="pattern6268"
       patternTransform="translate(-722,2884)" />
    <pattern
       inkscape:collect="always"
       xlink:href="#pattern6356"
       id="pattern6259"
       patternTransform="translate(-722,2924)" />
    <pattern
       inkscape:collect="always"
       xlink:href="#pattern6352"
       id="pattern6356"
       patternTransform="translate(-722,2884)" />
    <pattern
       inkscape:collect="always"
       xlink:href="#pattern6176"
       id="pattern6352"
       patternTransform="translate(-902,2884)" />
    <pattern
       inkscape:collect="always"
       xlink:href="#pattern4998"
       id="pattern6176"
       patternTransform="translate(-902,2844)" />
    <pattern
       inkscape:collect="always"
       xlink:href="#pattern8888"
       id="pattern4998"
       patternTransform="translate(-902,244)" />
    <pattern
       inkscape:collect="always"
       xlink:href="#pattern8884"
       id="pattern8888"
       patternTransform="translate(-902,244)" />
    <pattern
       inkscape:collect="always"
       xlink:href="#pattern8791"
       id="pattern8884"
       patternTransform="translate(-904,0)" />
    <pattern
       inkscape:collect="always"
       xlink:href="#pattern8787"
       id="pattern8791"
       patternTransform="translate(-724,0)" />
    <pattern
       inkscape:collect="always"
       xlink:href="#pattern8783"
       id="pattern8787"
       patternTransform="translate(-536,0)" />
    <pattern
       inkscape:collect="always"
       xlink:href="#pattern8775"
       id="pattern8783"
       patternTransform="translate(-360,0)" />
    <pattern
       inkscape:collect="always"
       xlink:href="#Wavywhite"
       id="pattern8775"
       patternTransform="translate(-180,0)" />
    <pattern
       inkscape:stockid="Wavy white"
       id="Wavywhite"
       height="5.1805778"
       width="30.066020"
       patternUnits="userSpaceOnUse"
       inkscape:collect="always">
      <path
         id="path8532"
         d="M 7.597,0.061 C 5.079,-0.187 2.656,0.302 -0.01,1.788 L -0.01,3.061 C 2.773,1.431 5.173,1.052 7.472,1.280 C 9.770,1.508 11.969,2.361 14.253,3.218 C 18.820,4.931 23.804,6.676 30.066,3.061 L 30.062,1.788 C 23.622,5.497 19.246,3.770 14.691,2.061 C 12.413,1.207 10.115,0.311 7.597,0.061 z "
         style="fill:white;stroke:none;" />
    </pattern>
    <pattern
       patternTransform="matrix(1.0232961,0,0,1.0232961,-566.02375,480.69738)"
       id="pattern10196-3"
       xlink:href="#pattern6268-2"
       inkscape:collect="always" />
    <pattern
       inkscape:collect="always"
       xlink:href="#pattern6259-8"
       id="pattern6268-2"
       patternTransform="translate(-722,2884)" />
    <pattern
       inkscape:collect="always"
       xlink:href="#pattern6356-5"
       id="pattern6259-8"
       patternTransform="translate(-722,2924)" />
    <pattern
       inkscape:collect="always"
       xlink:href="#pattern6352-8"
       id="pattern6356-5"
       patternTransform="translate(-722,2884)" />
    <pattern
       inkscape:collect="always"
       xlink:href="#pattern6176-9"
       id="pattern6352-8"
       patternTransform="translate(-902,2884)" />
    <pattern
       inkscape:collect="always"
       xlink:href="#pattern4998-3"
       id="pattern6176-9"
       patternTransform="translate(-902,2844)" />
    <pattern
       inkscape:collect="always"
       xlink:href="#pattern8888-6"
       id="pattern4998-3"
       patternTransform="translate(-902,244)" />
    <pattern
       inkscape:collect="always"
       xlink:href="#pattern8884-8"
       id="pattern8888-6"
       patternTransform="translate(-902,244)" />
    <pattern
       inkscape:collect="always"
       xlink:href="#pattern8791-4"
       id="pattern8884-8"
       patternTransform="translate(-904,0)" />
    <pattern
       inkscape:collect="always"
       xlink:href="#pattern8787-0"
       id="pattern8791-4"
       patternTransform="translate(-724,0)" />
    <pattern
       inkscape:collect="always"
       xlink:href="#pattern8783-7"
       id="pattern8787-0"
       patternTransform="translate(-536,0)" />
    <pattern
       inkscape:collect="always"
       xlink:href="#pattern8775-5"
       id="pattern8783-7"
       patternTransform="translate(-360,0)" />
    <pattern
       inkscape:collect="always"
       xlink:href="#Wavywhite-5"
       id="pattern8775-5"
       patternTransform="translate(-180,0)" />
    <pattern
       inkscape:stockid="Wavy white"
       id="Wavywhite-5"
       height="5.1805778"
       width="30.066020"
       patternUnits="userSpaceOnUse"
       inkscape:collect="always">
      <path
         id="path8532-3"
         d="M 7.597,0.061 C 5.079,-0.187 2.656,0.302 -0.01,1.788 L -0.01,3.061 C 2.773,1.431 5.173,1.052 7.472,1.280 C 9.770,1.508 11.969,2.361 14.253,3.218 C 18.820,4.931 23.804,6.676 30.066,3.061 L 30.062,1.788 C 23.622,5.497 19.246,3.770 14.691,2.061 C 12.413,1.207 10.115,0.311 7.597,0.061 z "
         style="fill:white;stroke:none;" />
    </pattern>
    <filter
       id="filter6605"
       inkscape:label="Drop shadow"
       inkscape:menu="Blurs"
       inkscape:menu-tooltip="Blur the contents of objects, preserving the outline"
       color-interpolation-filters="sRGB"
       width="1.5"
       height="1.5"
       x="-0.25"
       y="-0.25">
      <feColorMatrix
         id="feColorMatrix6607"
         values="1 0 0 0 0 0 1 0 0 0 0 0 1 0 0 0 0 0 1 0 "
         result="result7" />
      <feGaussianBlur
         id="feGaussianBlur6609"
         result="result6"
         stdDeviation="5" />
      <feComposite
         id="feComposite6611"
         in2="result7"
         operator="atop"
         in="result6"
         result="result91" />
      <feComposite
         id="feComposite6613"
         in2="result91"
         operator="in"
         result="fbSourceGraphic" />
      <feColorMatrix
         result="fbSourceGraphicAlpha"
         in="fbSourceGraphic"
         values="0 0 0 -1 0 0 0 0 -1 0 0 0 0 -1 0 0 0 0 1 0"
         id="feColorMatrix6659" />
      <feColorMatrix
         id="feColorMatrix6661"
         values="1 0 0 0 0 0 1 0 0 0 0 0 1 0 0 0 0 0 1 0 "
         result="result7"
         in="fbSourceGraphic" />
      <feGaussianBlur
         id="feGaussianBlur6663"
         result="result6"
         stdDeviation="5" />
      <feComposite
         id="feComposite6665"
         in2="result7"
         operator="atop"
         in="result6"
         result="result91" />
      <feComposite
         id="feComposite6667"
         in2="result91"
         operator="in"
         result="fbSourceGraphic" />
      <feColorMatrix
         result="fbSourceGraphicAlpha"
         in="fbSourceGraphic"
         values="0 0 0 -1 0 0 0 0 -1 0 0 0 0 -1 0 0 0 0 1 0"
         id="feColorMatrix7823" />
      <feGaussianBlur
         id="feGaussianBlur7825"
         in="fbSourceGraphicAlpha"
         stdDeviation="1"
         result="blur" />
      <feColorMatrix
         id="feColorMatrix7827"
         result="bluralpha"
         type="matrix"
         values="-1 0 0 0 1 0 -1 0 0 1 0 0 -1 0 1 0 0 0 1 0 " />
      <feOffset
         id="feOffset7829"
         in="bluralpha"
         dx="1.5"
         dy="-1.5"
         result="offsetBlur" />
      <feMerge
         id="feMerge7831">
        <feMergeNode
           id="feMergeNode7833"
           in="offsetBlur" />
        <feMergeNode
           id="feMergeNode7835"
           in="fbSourceGraphic" />
      </feMerge>
    </filter>
    <filter
       id="filter6595"
       inkscape:label="Drop shadow"
       inkscape:menu="Blurs"
       inkscape:menu-tooltip="Blur the contents of objects, preserving the outline"
       color-interpolation-filters="sRGB"
       width="1.5"
       height="1.5"
       x="-0.25"
       y="-0.25">
      <feColorMatrix
         id="feColorMatrix6597"
         values="1 0 0 0 0 0 1 0 0 0 0 0 1 0 0 0 0 0 1 0 "
         result="result7" />
      <feGaussianBlur
         id="feGaussianBlur6599"
         result="result6"
         stdDeviation="5" />
      <feComposite
         id="feComposite6601"
         in2="result7"
         operator="atop"
         in="result6"
         result="result91" />
      <feComposite
         id="feComposite6603"
         in2="result91"
         operator="in"
         result="fbSourceGraphic" />
      <feColorMatrix
         result="fbSourceGraphicAlpha"
         in="fbSourceGraphic"
         values="0 0 0 -1 0 0 0 0 -1 0 0 0 0 -1 0 0 0 0 1 0"
         id="feColorMatrix6669" />
      <feColorMatrix
         id="feColorMatrix6671"
         values="1 0 0 0 0 0 1 0 0 0 0 0 1 0 0 0 0 0 1 0 "
         result="result7"
         in="fbSourceGraphic" />
      <feGaussianBlur
         id="feGaussianBlur6673"
         result="result6"
         stdDeviation="5" />
      <feComposite
         id="feComposite6675"
         in2="result7"
         operator="atop"
         in="result6"
         result="result91" />
      <feComposite
         id="feComposite6677"
         in2="result91"
         operator="in"
         result="fbSourceGraphic" />
      <feColorMatrix
         result="fbSourceGraphicAlpha"
         in="fbSourceGraphic"
         values="0 0 0 -1 0 0 0 0 -1 0 0 0 0 -1 0 0 0 0 1 0"
         id="feColorMatrix7837" />
      <feGaussianBlur
         id="feGaussianBlur7839"
         in="fbSourceGraphicAlpha"
         stdDeviation="1"
         result="blur" />
      <feColorMatrix
         id="feColorMatrix7841"
         result="bluralpha"
         type="matrix"
         values="-1 0 0 0 1 0 -1 0 0 1 0 0 -1 0 1 0 0 0 1 0 " />
      <feOffset
         id="feOffset7843"
         in="bluralpha"
         dx="1.5"
         dy="-1.5"
         result="offsetBlur" />
      <feMerge
         id="feMerge7845">
        <feMergeNode
           id="feMergeNode7847"
           in="offsetBlur" />
        <feMergeNode
           id="feMergeNode7849"
           in="fbSourceGraphic" />
      </feMerge>
    </filter>
    <filter
       id="filter6615"
       inkscape:label="Drop shadow"
       inkscape:menu="Blurs"
       inkscape:menu-tooltip="Blur the contents of objects, preserving the outline"
       color-interpolation-filters="sRGB"
       width="1.5"
       height="1.5"
       x="-0.25"
       y="-0.25">
      <feColorMatrix
         id="feColorMatrix6617"
         values="1 0 0 0 0 0 1 0 0 0 0 0 1 0 0 0 0 0 1 0 "
         result="result7" />
      <feGaussianBlur
         id="feGaussianBlur6619"
         result="result6"
         stdDeviation="5" />
      <feComposite
         id="feComposite6621"
         in2="result7"
         operator="atop"
         in="result6"
         result="result91" />
      <feComposite
         id="feComposite6623"
         in2="result91"
         operator="in"
         result="fbSourceGraphic" />
      <feColorMatrix
         result="fbSourceGraphicAlpha"
         in="fbSourceGraphic"
         values="0 0 0 -1 0 0 0 0 -1 0 0 0 0 -1 0 0 0 0 1 0"
         id="feColorMatrix6679" />
      <feColorMatrix
         id="feColorMatrix6681"
         values="1 0 0 0 0 0 1 0 0 0 0 0 1 0 0 0 0 0 1 0 "
         result="result7"
         in="fbSourceGraphic" />
      <feGaussianBlur
         id="feGaussianBlur6683"
         result="result6"
         stdDeviation="5" />
      <feComposite
         id="feComposite6685"
         in2="result7"
         operator="atop"
         in="result6"
         result="result91" />
      <feComposite
         id="feComposite6687"
         in2="result91"
         operator="in"
         result="fbSourceGraphic" />
      <feColorMatrix
         result="fbSourceGraphicAlpha"
         in="fbSourceGraphic"
         values="0 0 0 -1 0 0 0 0 -1 0 0 0 0 -1 0 0 0 0 1 0"
         id="feColorMatrix7851" />
      <feGaussianBlur
         id="feGaussianBlur7853"
         in="fbSourceGraphicAlpha"
         stdDeviation="1"
         result="blur" />
      <feColorMatrix
         id="feColorMatrix7855"
         result="bluralpha"
         type="matrix"
         values="-1 0 0 0 1 0 -1 0 0 1 0 0 -1 0 1 0 0 0 1 0 " />
      <feOffset
         id="feOffset7857"
         in="bluralpha"
         dx="1.5"
         dy="-1.5"
         result="offsetBlur" />
      <feMerge
         id="feMerge7859">
        <feMergeNode
           id="feMergeNode7861"
           in="offsetBlur" />
        <feMergeNode
           id="feMergeNode7863"
           in="fbSourceGraphic" />
      </feMerge>
    </filter>
    <linearGradient
       id="linearGradient4976">
      <stop
         style="stop-color:#79db32;stop-opacity:1;"
         offset="0"
         id="stop4978" />
      <stop
         style="stop-color:#ffffff;stop-opacity:1;"
         offset="1"
         id="stop4980" />
    </linearGradient>
    <linearGradient
       id="linearGradient5201">
      <stop
         style="stop-color:#ffffff;stop-opacity:0;"
         offset="0"
         id="stop5203" />
      <stop
         id="stop5209"
         offset="0.73386818"
         style="stop-color:#ffffff;stop-opacity:0.779661;" />
      <stop
         style="stop-color:#c4c7cc;stop-opacity:0;"
         offset="1"
         id="stop5205" />
    </linearGradient>
    <clipPath
       clipPathUnits="userSpaceOnUse"
       id="clipPath4738">
      <path
         sodipodi:type="arc"
         style="fill:#eff0f1;fill-opacity:1;fill-rule:nonzero;stroke:#4c4c4c;stroke-opacity:1;display:inline"
         id="path4740"
         sodipodi:cx="350.08929"
         sodipodi:cy="319.77289"
         sodipodi:rx="6.6964288"
         sodipodi:ry="6.6964288"
         d="m 356.78572,319.77289 a 6.6964288,6.6964288 0 1 1 -13.39285,0 6.6964288,6.6964288 0 1 1 13.39285,0 z"
         transform="matrix(2.5292128,1.860414,-1.860414,2.5292128,221.80276,-811.86155)" />
    </clipPath>
    <clipPath
       clipPathUnits="userSpaceOnUse"
       id="clipPath7098-7">
      <path
         style="opacity:0.33399999;fill:url(#pattern7102);fill-opacity:1;stroke:#50a1af;stroke-width:2.5045166"
         id="path7100-7"
         d="m 596.65497,3410.9692 c 0,-44.9558 -36.44197,-81.4006 -81.39654,-81.4006 -44.93353,0 -81.36123,36.4147 -81.39379,81.3432 l -0.002,0 0,62.9908 0.002,0 c 0.025,10.2009 8.29722,18.4595 18.50462,18.4595 0.0276,0 0.0576,0 0.0877,0 l 0,0 62.82806,0 0,0 c 44.94627,-0.018 81.36995,-36.4499 81.36995,-81.3929 z"
         inkscape:connector-curvature="0"
         inkscape:export-filename="/home/duffy/Documents/Work/Projects/FedBadges/Badges/junior-editor.png"
         inkscape:export-xdpi="90"
         inkscape:export-ydpi="90" />
    </clipPath>
    <clipPath
       clipPathUnits="userSpaceOnUse"
       id="clipPath7092-0">
      <path
         style="opacity:0.33399999;fill:#82bac3;fill-opacity:1;stroke:none"
         id="path7094-2"
         d="m 596.65497,3410.9692 c 0,-44.9558 -36.44197,-81.4006 -81.39654,-81.4006 -44.93353,0 -81.36123,36.4147 -81.39379,81.3432 l -0.002,0 0,62.9908 0.002,0 c 0.025,10.2009 8.29722,18.4595 18.50462,18.4595 0.0276,0 0.0576,0 0.0877,0 l 0,0 62.82806,0 0,0 c 44.94627,-0.018 81.36995,-36.4499 81.36995,-81.3929 z"
         inkscape:connector-curvature="0"
         inkscape:export-filename="/home/duffy/Documents/Work/Projects/FedBadges/Badges/junior-editor.png"
         inkscape:export-xdpi="90"
         inkscape:export-ydpi="90" />
    </clipPath>
    <linearGradient
       id="linearGradient5329">
      <stop
         style="stop-color:#e59728;stop-opacity:1;"
         offset="0"
         id="stop5331" />
      <stop
         style="stop-color:#f8ff3c;stop-opacity:1;"
         offset="1"
         id="stop5333" />
    </linearGradient>
    <linearGradient
       id="linearGradient4770">
      <stop
         style="stop-color:#000000;stop-opacity:1;"
         offset="0"
         id="stop4772" />
      <stop
         id="stop4894"
         offset="0.28839085"
         style="stop-color:#142039;stop-opacity:1;" />
      <stop
         id="stop4778"
         offset="0.49761793"
         style="stop-color:#3c6eb4;stop-opacity:1;" />
      <stop
         style="stop-color:#ffffff;stop-opacity:1;"
         offset="0.72108096"
         id="stop4892" />
      <stop
         id="stop4900"
         offset="0.95970011"
         style="stop-color:#3c6eb4;stop-opacity:1;" />
      <stop
         style="stop-color:#000000;stop-opacity:1;"
         offset="1"
         id="stop4774" />
    </linearGradient>
    <filter
       color-interpolation-filters="sRGB"
       inkscape:collect="always"
       id="filter2620-9">
      <feGaussianBlur
         inkscape:collect="always"
         stdDeviation="0.78000015"
         id="feGaussianBlur2622-5" />
    </filter>
    <linearGradient
       inkscape:collect="always"
       xlink:href="#linearGradient23243-0-4"
       id="linearGradient11673-0"
       gradientUnits="userSpaceOnUse"
       x1="452.89532"
       y1="692.18036"
       x2="549.71472"
       y2="588.13464" />
    <linearGradient
       inkscape:collect="always"
       id="linearGradient23243-0-4">
      <stop
         style="stop-color:#db3279;stop-opacity:1;"
         offset="0"
         id="stop23245-9-8" />
      <stop
         style="stop-color:#db3279;stop-opacity:0;"
         offset="1"
         id="stop23247-6-5" />
    </linearGradient>
    <linearGradient
       inkscape:collect="always"
       xlink:href="#linearGradient29617-7-5"
       id="linearGradient11675-5"
       gradientUnits="userSpaceOnUse"
       x1="500.41754"
       y1="598.07538"
       x2="531.51129"
       y2="682.98608" />
    <linearGradient
       inkscape:collect="always"
       id="linearGradient29617-7-5">
      <stop
         style="stop-color:#6e0733;stop-opacity:1;"
         offset="0"
         id="stop29619-3-4" />
      <stop
         style="stop-color:#6e0733;stop-opacity:0;"
         offset="1"
         id="stop29621-9-2" />
    </linearGradient>
    <linearGradient
       inkscape:collect="always"
       xlink:href="#linearGradient17017-5-9"
       id="linearGradient11677-1"
       gradientUnits="userSpaceOnUse"
       x1="477.17944"
       y1="4054.9666"
       x2="507.65854"
       y2="4028.2605" />
    <linearGradient
       id="linearGradient17017-5-9">
      <stop
         style="stop-color:#313b31;stop-opacity:1;"
         offset="0"
         id="stop17019-8-2" />
      <stop
         style="stop-color:#313b31;stop-opacity:0.62711865;"
         offset="1"
         id="stop17021-3-4" />
    </linearGradient>
    <linearGradient
       inkscape:collect="always"
       xlink:href="#linearGradient22742-8-8"
       id="linearGradient11679-5"
       gradientUnits="userSpaceOnUse"
       x1="297.87323"
       y1="273.94583"
       x2="337.01941"
       y2="237.20154" />
    <linearGradient
       inkscape:collect="always"
       id="linearGradient22742-8-8">
      <stop
         style="stop-color:#361f00;stop-opacity:1;"
         offset="0"
         id="stop22744-4-6" />
      <stop
         style="stop-color:#361f00;stop-opacity:0;"
         offset="1"
         id="stop22746-6-2" />
    </linearGradient>
    <filter
       color-interpolation-filters="sRGB"
       id="filter22728-9-5"
       inkscape:label="Drop shadow"
       width="1.5"
       height="1.5"
       x="-0.25"
       y="-0.25">
      <feGaussianBlur
         id="feGaussianBlur22730-3-1"
         in="SourceAlpha"
         stdDeviation="0.2"
         result="blur" />
      <feColorMatrix
         id="feColorMatrix22732-4-3"
         result="bluralpha"
         type="matrix"
         values="1 0 0 0 0 0 1 0 0 0 0 0 1 0 0 0 0 0 0.9 0 " />
      <feOffset
         id="feOffset22734-1-9"
         in="bluralpha"
         dx="-0.4"
         dy="0.2"
         result="offsetBlur" />
      <feMerge
         id="feMerge22736-7-7">
        <feMergeNode
           id="feMergeNode22738-0-3"
           in="offsetBlur" />
        <feMergeNode
           id="feMergeNode22740-2-7"
           in="SourceGraphic" />
      </feMerge>
    </filter>
    <linearGradient
       inkscape:collect="always"
       xlink:href="#linearGradient6303"
       id="linearGradient6604"
       gradientUnits="userSpaceOnUse"
       gradientTransform="translate(54,444)"
       x1="285"
       y1="232"
       x2="284"
       y2="149" />
    <linearGradient
       inkscape:collect="always"
       id="linearGradient6303">
      <stop
         style="stop-color:#a0cedc;stop-opacity:1"
         offset="0"
         id="stop6305" />
      <stop
         style="stop-color:#d7e9f0;stop-opacity:1"
         offset="1"
         id="stop6307" />
    </linearGradient>
    <pattern
       inkscape:collect="always"
       xlink:href="#pattern8884-5"
       id="pattern6606"
       patternTransform="translate(-722,484)" />
    <pattern
       inkscape:collect="always"
       xlink:href="#pattern8791-0"
       id="pattern8884-5"
       patternTransform="translate(-904,0)" />
    <pattern
       inkscape:collect="always"
       xlink:href="#pattern8787-2"
       id="pattern8791-0"
       patternTransform="translate(-724,0)" />
    <pattern
       inkscape:collect="always"
       xlink:href="#pattern8783-1"
       id="pattern8787-2"
       patternTransform="translate(-536,0)" />
    <pattern
       inkscape:collect="always"
       xlink:href="#pattern8775-8"
       id="pattern8783-1"
       patternTransform="translate(-360,0)" />
    <pattern
       inkscape:collect="always"
       xlink:href="#Wavywhite-7"
       id="pattern8775-8"
       patternTransform="translate(-180,0)" />
    <pattern
       inkscape:stockid="Wavy white"
       id="Wavywhite-7"
       height="5.1805778"
       width="30.066020"
       patternUnits="userSpaceOnUse"
       inkscape:collect="always">
      <path
         id="path8532-1"
         d="M 7.597,0.061 C 5.079,-0.187 2.656,0.302 -0.01,1.788 L -0.01,3.061 C 2.773,1.431 5.173,1.052 7.472,1.280 C 9.770,1.508 11.969,2.361 14.253,3.218 C 18.820,4.931 23.804,6.676 30.066,3.061 L 30.062,1.788 C 23.622,5.497 19.246,3.770 14.691,2.061 C 12.413,1.207 10.115,0.311 7.597,0.061 z "
         style="fill:white;stroke:none;" />
    </pattern>
    <inkscape:path-effect
       effect="spiro"
       id="path-effect2194"
       is_visible="true" />
    <clipPath
       clipPathUnits="userSpaceOnUse"
       id="clipPath298">
      <path
         d="m 9.732,16.701 v -6.685 c 0.002,-1.083 0.88,-1.958 1.963,-1.958 v 0 h 0.009 10e-4 6.668 c 4.769,10e-4 8.635,3.868 8.635,8.637 v 0 c 0,4.771 -3.868,8.638 -8.638,8.638 v 0 c -4.769,0 -8.635,-3.864 -8.638,-8.632"
         id="path296"
         inkscape:connector-curvature="0" />
    </clipPath>
    <clipPath
       clipPathUnits="userSpaceOnUse"
       id="clipPath4103">
      <path
         style="fill:url(#linearGradient4107);fill-opacity:1;stroke:none"
         id="path4105"
         d="m 1080.9996,1774.5015 c 0,-17.9499 -14.5505,-32.5015 -32.4999,-32.5015 -17.941,0 -32.4858,14.5396 -32.4988,32.4786 l -9e-4,-9e-4 v 25.1509 l 9e-4,9e-4 c 0.01,4.073 3.3129,7.3705 7.3885,7.3705 0.011,0 0.023,-9e-4 0.035,-9e-4 v 9e-4 h 25.0858 v 0 c 17.9462,-0.01 32.4894,-14.5537 32.4894,-32.4985 z"
         inkscape:connector-curvature="0"
         clip-path="none" />
    </clipPath>
    <linearGradient
       inkscape:collect="always"
       xlink:href="#linearGradient23243-0"
       id="linearGradient1757"
       x1="996.57269"
       y1="1774.0616"
       x2="1103.2079"
       y2="1774.2477"
       gradientUnits="userSpaceOnUse" />
    <clipPath
       clipPathUnits="userSpaceOnUse"
       id="clipPath4103-0">
      <path
         style="fill:url(#linearGradient4107);fill-opacity:1;stroke:none"
         id="path4105-6"
         d="m 1080.9996,1774.5015 c 0,-17.9499 -14.5505,-32.5015 -32.4999,-32.5015 -17.941,0 -32.4858,14.5396 -32.4988,32.4786 l -9e-4,-9e-4 v 25.1509 l 9e-4,9e-4 c 0.01,4.073 3.3129,7.3705 7.3885,7.3705 0.011,0 0.023,-9e-4 0.035,-9e-4 v 9e-4 h 25.0858 v 0 c 17.9462,-0.01 32.4894,-14.5537 32.4894,-32.4985 z"
         inkscape:connector-curvature="0"
         clip-path="none" />
    </clipPath>
    <linearGradient
       inkscape:collect="always"
       xlink:href="#linearGradient23243-0"
       id="linearGradient1985"
       gradientUnits="userSpaceOnUse"
       x1="1016"
       y1="1774.5"
       x2="1080.9996"
       y2="1774.5" />
    <linearGradient
       inkscape:collect="always"
       xlink:href="#linearGradient23243-0"
       id="linearGradient1987"
       gradientUnits="userSpaceOnUse"
       x1="1016"
       y1="1774.5"
       x2="1080.9996"
       y2="1774.5" />
    <linearGradient
       inkscape:collect="always"
       xlink:href="#linearGradient23243-0"
       id="linearGradient1989"
       gradientUnits="userSpaceOnUse"
       x1="1016"
       y1="1774.5"
       x2="1080.9996"
       y2="1774.5" />
    <linearGradient
       inkscape:collect="always"
       xlink:href="#linearGradient23243-0"
       id="linearGradient1991"
       gradientUnits="userSpaceOnUse"
       x1="1016"
       y1="1774.5"
       x2="1080.9996"
       y2="1774.5" />
    <linearGradient
       inkscape:collect="always"
       xlink:href="#linearGradient23243-0"
       id="linearGradient1993"
       gradientUnits="userSpaceOnUse"
       x1="1016"
       y1="1774.5"
       x2="1080.9996"
       y2="1774.5" />
    <linearGradient
       inkscape:collect="always"
       xlink:href="#linearGradient23243-0"
       id="linearGradient1995"
       gradientUnits="userSpaceOnUse"
       x1="1016"
       y1="1774.5"
       x2="1080.9996"
       y2="1774.5" />
    <linearGradient
       inkscape:collect="always"
       xlink:href="#linearGradient23243-0"
       id="linearGradient1997"
       gradientUnits="userSpaceOnUse"
       x1="1016"
       y1="1774.5"
       x2="1080.9996"
       y2="1774.5" />
    <linearGradient
       inkscape:collect="always"
       xlink:href="#linearGradient23243-0"
       id="linearGradient1999"
       gradientUnits="userSpaceOnUse"
       x1="1016"
       y1="1774.5"
       x2="1080.9996"
       y2="1774.5" />
    <linearGradient
       inkscape:collect="always"
       xlink:href="#linearGradient23243-0"
       id="linearGradient2001"
       gradientUnits="userSpaceOnUse"
       x1="1016"
       y1="1774.5"
       x2="1080.9996"
       y2="1774.5" />
    <linearGradient
       inkscape:collect="always"
       xlink:href="#linearGradient23243-0"
       id="linearGradient2003"
       gradientUnits="userSpaceOnUse"
       x1="1016"
       y1="1774.5"
       x2="1080.9996"
       y2="1774.5" />
    <linearGradient
       inkscape:collect="always"
       xlink:href="#linearGradient23243-0"
       id="linearGradient2005"
       gradientUnits="userSpaceOnUse"
       x1="1016"
       y1="1774.5"
       x2="1080.9996"
       y2="1774.5" />
    <linearGradient
       inkscape:collect="always"
       xlink:href="#linearGradient23243-0"
       id="linearGradient2007"
       gradientUnits="userSpaceOnUse"
       x1="1016"
       y1="1774.5"
       x2="1080.9996"
       y2="1774.5" />
    <clipPath
       clipPathUnits="userSpaceOnUse"
       id="clipPath298-8">
      <path
         d="m 9.732,16.701 v -6.685 c 0.002,-1.083 0.88,-1.958 1.963,-1.958 v 0 h 0.009 10e-4 6.668 c 4.769,10e-4 8.635,3.868 8.635,8.637 v 0 c 0,4.771 -3.868,8.638 -8.638,8.638 v 0 c -4.769,0 -8.635,-3.864 -8.638,-8.632"
         id="path296-2"
         inkscape:connector-curvature="0" />
    </clipPath>
    <clipPath
       clipPathUnits="userSpaceOnUse"
       id="clipPath298-0">
      <path
         d="m 9.732,16.701 v -6.685 c 0.002,-1.083 0.88,-1.958 1.963,-1.958 v 0 h 0.009 10e-4 6.668 c 4.769,10e-4 8.635,3.868 8.635,8.637 v 0 c 0,4.771 -3.868,8.638 -8.638,8.638 v 0 c -4.769,0 -8.635,-3.864 -8.638,-8.632"
         id="path296-8"
         inkscape:connector-curvature="0" />
    </clipPath>
  </defs>
  <sodipodi:namedview
     pagecolor="#ffffff"
     bordercolor="#666666"
     borderopacity="1"
     objecttolerance="10"
     gridtolerance="10"
     guidetolerance="10"
     inkscape:pageopacity="0"
     inkscape:pageshadow="2"
     inkscape:window-width="1366"
     inkscape:window-height="705"
     id="namedview4328"
     showgrid="false"
     inkscape:zoom="2.4165554"
     inkscape:cx="275.26989"
     inkscape:cy="137.89265"
     inkscape:window-x="-8"
     inkscape:window-y="-8"
     inkscape:window-maximized="1"
     inkscape:current-layer="g2030"
     showguides="true"
     inkscape:guide-bbox="true"
     inkscape:document-rotation="0"
     inkscape:snap-global="false"
     inkscape:lockguides="true"
     inkscape:snap-bbox="true"
     inkscape:bbox-paths="true"
     inkscape:bbox-nodes="true"
     inkscape:snap-bbox-edge-midpoints="true"
     inkscape:snap-bbox-midpoints="true"
     inkscape:object-paths="true"
     inkscape:snap-intersection-paths="true"
     inkscape:snap-smooth-nodes="true"
     inkscape:snap-midpoints="true" />
  <g
     id="g8420">
    <path
       inkscape:export-ydpi="90"
       inkscape:export-xdpi="90"
       inkscape:export-filename="/home/duffy/Documents/Work/Projects/FedBadges/Badges/flock-2013-attendee.png"
       transform="matrix(2.5863923,0,0,2.5863923,-117.03776,-196.72146)"
       inkscape:connector-curvature="0"
       d="m 134.00002,125.00183 c 0,-21.53997 -17.46062,-39.00185 -38.999836,-39.00185 -21.529216,0 -38.982968,17.44751 -38.998584,38.97439 l -0.0016,-10e-4 0,30.18098 0.0016,9.9e-4 c 0.01184,4.88773 3.975508,8.84465 8.866181,8.84465 0.01374,0 0.02745,-9.9e-4 0.04187,-9.9e-4 l 0.0024,9.9e-4 30.10304,0 0,0 c 21.533049,-0.009 38.984919,-17.46443 38.984919,-38.99816 z"
       id="path6672"
       style="fill:#db3279;fill-opacity:1;stroke:#58595b;stroke-width:4.50271511;stroke-linejoin:round;stroke-miterlimit:4;stroke-opacity:1;stroke-dasharray:none;display:inline;filter:url(#filter2620-9)" />
    <path
       inkscape:export-ydpi="90"
       inkscape:export-xdpi="90"
       inkscape:export-filename="/home/duffy/Documents/Work/Projects/FedBadges/Badges/flock-2013-attendee.png"
       inkscape:connector-curvature="0"
       id="path6674"
       d="m 128.66952,19.370925 c -58.255701,0 -105.560403,47.14919 -105.961272,105.314655 -5.59e-4,0.082 3.73e-4,0.16049 0,0.24247 a 5.1733019,5.1733019 0 0 0 -0.08083,0.24249 c -1.16e-4,0.0548 4.7e-5,0.10691 0,0.16165 l 0,78.07671 a 5.1733019,5.1733019 0 0 0 0.404138,2.02061 5.1733019,5.1733019 0 0 0 0,0.0808 c 1.112566,13.76388 12.0603,24.57729 25.863915,25.54064 0.08642,0.005 0.155825,0.0757 0.242465,0.0808 a 5.1733019,5.1733019 0 0 0 0.242489,0.0808 5.1733019,5.1733019 0 0 0 1.374022,0.24246 5.1733019,5.1733019 0 0 0 0.08082,0 l 77.834254,0 a 5.1733019,5.1733019 0 0 0 0.0808,0 c 58.01578,-0.0232 105.04203,-46.82773 105.7996,-104.66798 a 5.1733019,5.1733019 0 0 0 0.0808,-0.32328 c 5.4e-4,-0.0545 -4.6e-4,-0.10693 0,-0.16165 a 5.1733019,5.1733019 0 0 0 0.0808,-0.88907 c 0,-58.506269 -47.5375,-106.042095 -106.04208,-106.042095 z"
       style="font-size:xx-small;font-style:normal;font-variant:normal;font-weight:normal;font-stretch:normal;text-indent:0;text-align:start;text-decoration:none;line-height:normal;letter-spacing:normal;word-spacing:normal;text-transform:none;direction:ltr;block-progression:tb;writing-mode:lr-tb;text-anchor:start;baseline-shift:baseline;color:#000000;fill:#ffffff;fill-opacity:1;fill-rule:nonzero;stroke:none;stroke-width:4;marker:none;visibility:visible;display:inline;overflow:visible;enable-background:accumulate;font-family:sans-serif;-inkscape-font-specification:sans-serif" />
    <path
       inkscape:export-ydpi="90"
       inkscape:export-xdpi="90"
       inkscape:export-filename="/home/duffy/Documents/Work/Projects/FedBadges/Badges/flock-2013-attendee.png"
       style="fill:#f9dde9;fill-opacity:1;stroke:none;display:inline"
       id="path6676"
       d="m 204.36627,126.58107 c 0,-41.80829 -33.89046,-75.701182 -75.69735,-75.701182 -41.787442,0 -75.66453,33.86501 -75.694856,75.647852 l -0.0023,-0.002 0,58.58023 0.0023,0.002 c 0.02352,9.48684 7.716358,17.16714 17.208959,17.16714 0.02655,0 0.05334,-0.002 0.08129,-0.002 l 0.0046,0.002 58.428943,0 0,0 c 41.79485,-0.0163 75.66832,-33.89781 75.66832,-75.69406 z"
       inkscape:connector-curvature="0"
       sodipodi:nodetypes="csccccscccccc" />
    <path
       inkscape:export-ydpi="90"
       inkscape:export-xdpi="90"
       inkscape:export-filename="/home/duffy/Documents/Work/Projects/FedBadges/Badges/flock-2013-attendee.png"
       style="fill:none;stroke:#db3279;stroke-width:11.64578818999999932;stroke-linejoin:round;stroke-miterlimit:4;stroke-opacity:1;stroke-dasharray:none;display:inline"
       id="path6678"
       d="m 218.66009,126.58152 c 0,-49.70262 -40.28975,-89.995185 -89.99069,-89.995185 -49.677809,0 -89.951622,40.259398 -89.987694,89.931815 l -0.0023,-0.002 0,69.64142 0.0023,0.002 c 0.02702,11.2782 9.173364,20.40871 20.458387,20.40871 0.03144,0 0.06336,-0.002 0.09666,-0.002 l 0.007,0.002 69.461577,0 0,0 c 49.68522,-0.021 89.9547,-40.29846 89.9547,-89.98672 z"
       inkscape:connector-curvature="0" />
    <g
       transform="matrix(2.5581985,0,0,2.4755804,-2545.779,-4270.6628)"
       id="g6883"
       clip-path="url(#clipPath4103-0)"
       style="fill:url(#linearGradient1757);fill-opacity:1"
       inkscape:export-filename="/home/duffy/Documents/Work/Projects/FedBadges/Badges/proven-packager.png"
       inkscape:export-xdpi="90"
       inkscape:export-ydpi="90">
      <path
         inkscape:transform-center-y="2.2220811"
         inkscape:transform-center-x="-23.959225"
         sodipodi:end="0.41971562"
         sodipodi:start="0.12052875"
         transform="rotate(-15,1018.4462,1817.5915)"
         sodipodi:ry="46.138718"
         sodipodi:rx="46.138718"
         sodipodi:cy="1786.5925"
         sodipodi:cx="1055.1801"
         id="path6885"
         style="color:#000000;display:inline;overflow:visible;visibility:visible;fill:url(#linearGradient1985);fill-opacity:1;fill-rule:nonzero;stroke:none;stroke-width:2;marker:none;enable-background:accumulate"
         sodipodi:type="arc"
         sodipodi:arc-type="slice"
         d="m 1100.984,1792.1401 a 46.138718,46.138718 0 0 1 -3.6698,13.254 l -42.1341,-18.8016 z" />
      <path
         sodipodi:type="arc"
         style="color:#000000;display:inline;overflow:visible;visibility:visible;fill:url(#linearGradient1987);fill-opacity:1;fill-rule:nonzero;stroke:none;stroke-width:2;marker:none;enable-background:accumulate"
         id="path6887"
         sodipodi:cx="1055.1801"
         sodipodi:cy="1786.5925"
         sodipodi:rx="46.138718"
         sodipodi:ry="46.138718"
         transform="rotate(-45,1039.3082,1793.1345)"
         sodipodi:start="0.12052875"
         sodipodi:end="0.41971562"
         inkscape:transform-center-x="-23.141112"
         inkscape:transform-center-y="-14.660493"
         sodipodi:arc-type="slice"
         d="m 1100.984,1792.1401 a 46.138718,46.138718 0 0 1 -3.6698,13.254 l -42.1341,-18.8016 z" />
      <path
         inkscape:transform-center-y="-22.572639"
         inkscape:transform-center-x="-15.702284"
         sodipodi:end="0.41971562"
         sodipodi:start="0.12052875"
         transform="rotate(-75,1043.7812,1787.8907)"
         sodipodi:ry="46.138718"
         sodipodi:rx="46.138718"
         sodipodi:cy="1786.5925"
         sodipodi:cx="1055.1801"
         id="path6889"
         style="color:#000000;display:inline;overflow:visible;visibility:visible;fill:url(#linearGradient1989);fill-opacity:1;fill-rule:nonzero;stroke:none;stroke-width:2;marker:none;enable-background:accumulate"
         sodipodi:type="arc"
         sodipodi:arc-type="slice"
         d="m 1100.984,1792.1401 a 46.138718,46.138718 0 0 1 -3.6698,13.254 l -42.1341,-18.8016 z" />
      <path
         sodipodi:type="arc"
         style="color:#000000;display:inline;overflow:visible;visibility:visible;fill:url(#linearGradient1991);fill-opacity:1;fill-rule:nonzero;stroke:none;stroke-width:2;marker:none;enable-background:accumulate"
         id="path6891"
         sodipodi:cx="1055.1801"
         sodipodi:cy="1786.5925"
         sodipodi:rx="46.138718"
         sodipodi:ry="46.138718"
         transform="rotate(-105,1045.9389,1785.3612)"
         sodipodi:start="0.12052875"
         sodipodi:end="0.41971562"
         inkscape:transform-center-x="-0.80787485"
         inkscape:transform-center-y="-24.666324"
         sodipodi:arc-type="slice"
         d="m 1100.984,1792.1401 a 46.138718,46.138718 0 0 1 -3.6698,13.254 l -42.1341,-18.8016 z" />
      <path
         inkscape:transform-center-y="-23.141104"
         inkscape:transform-center-x="14.660476"
         sodipodi:end="0.41971562"
         sodipodi:start="0.12052875"
         transform="rotate(-135,1047.3606,1783.6945)"
         sodipodi:ry="46.138718"
         sodipodi:rx="46.138718"
         sodipodi:cy="1786.5925"
         sodipodi:cx="1055.1801"
         id="path6893"
         style="color:#000000;display:inline;overflow:visible;visibility:visible;fill:url(#linearGradient1993);fill-opacity:1;fill-rule:nonzero;stroke:none;stroke-width:2;marker:none;enable-background:accumulate"
         sodipodi:type="arc"
         sodipodi:arc-type="slice"
         d="m 1100.984,1792.1401 a 46.138718,46.138718 0 0 1 -3.6698,13.254 l -42.1341,-18.8016 z" />
      <path
         sodipodi:type="arc"
         style="color:#000000;display:inline;overflow:visible;visibility:visible;fill:url(#linearGradient1995);fill-opacity:1;fill-rule:nonzero;stroke:none;stroke-width:2;marker:none;enable-background:accumulate"
         id="path6895"
         sodipodi:cx="1055.1801"
         sodipodi:cy="1786.5925"
         sodipodi:rx="46.138718"
         sodipodi:ry="46.138718"
         transform="rotate(-165,1048.4983,1782.3608)"
         sodipodi:start="0.12052875"
         sodipodi:end="0.41971562"
         inkscape:transform-center-x="22.572612"
         inkscape:transform-center-y="-15.702286"
         sodipodi:arc-type="slice"
         d="m 1100.984,1792.1401 a 46.138718,46.138718 0 0 1 -3.6698,13.254 l -42.1341,-18.8016 z" />
      <path
         inkscape:transform-center-y="-0.80789685"
         inkscape:transform-center-x="24.666297"
         sodipodi:end="0.41971562"
         sodipodi:start="0.12052875"
         transform="rotate(165,1049.5584,1781.118)"
         sodipodi:ry="46.138718"
         sodipodi:rx="46.138718"
         sodipodi:cy="1786.5925"
         sodipodi:cx="1055.1801"
         id="path6897"
         style="color:#000000;display:inline;overflow:visible;visibility:visible;fill:url(#linearGradient1997);fill-opacity:1;fill-rule:nonzero;stroke:none;stroke-width:2;marker:none;enable-background:accumulate"
         sodipodi:type="arc"
         sodipodi:arc-type="slice"
         d="m 1100.984,1792.1401 a 46.138718,46.138718 0 0 1 -3.6698,13.254 l -42.1341,-18.8016 z" />
      <path
         sodipodi:type="arc"
         style="color:#000000;display:inline;overflow:visible;visibility:visible;fill:url(#linearGradient1999);fill-opacity:1;fill-rule:nonzero;stroke:none;stroke-width:2;marker:none;enable-background:accumulate"
         id="path6899"
         sodipodi:cx="1055.1801"
         sodipodi:cy="1786.5925"
         sodipodi:rx="46.138718"
         sodipodi:ry="46.138718"
         transform="rotate(135,1050.696,1779.7843)"
         sodipodi:start="0.12052875"
         sodipodi:end="0.41971562"
         inkscape:transform-center-x="23.141077"
         inkscape:transform-center-y="14.660464"
         sodipodi:arc-type="slice"
         d="m 1100.984,1792.1401 a 46.138718,46.138718 0 0 1 -3.6698,13.254 l -42.1341,-18.8016 z" />
      <path
         inkscape:transform-center-y="22.57261"
         inkscape:transform-center-x="15.702259"
         sodipodi:end="0.41971562"
         sodipodi:start="0.12052875"
         transform="rotate(105,1052.1178,1778.1176)"
         sodipodi:ry="46.138718"
         sodipodi:rx="46.138718"
         sodipodi:cy="1786.5925"
         sodipodi:cx="1055.1801"
         id="path6901"
         style="color:#000000;display:inline;overflow:visible;visibility:visible;fill:url(#linearGradient2001);fill-opacity:1;fill-rule:nonzero;stroke:none;stroke-width:2;marker:none;enable-background:accumulate"
         sodipodi:type="arc"
         sodipodi:arc-type="slice"
         d="m 1100.984,1792.1401 a 46.138718,46.138718 0 0 1 -3.6698,13.254 l -42.1341,-18.8016 z" />
      <path
         sodipodi:type="arc"
         style="color:#000000;display:inline;overflow:visible;visibility:visible;fill:url(#linearGradient2003);fill-opacity:1;fill-rule:nonzero;stroke:none;stroke-width:2;marker:none;enable-background:accumulate"
         id="path6903"
         sodipodi:cx="1055.1801"
         sodipodi:cy="1786.5925"
         sodipodi:rx="46.138718"
         sodipodi:ry="46.138718"
         transform="rotate(75,1054.2754,1775.5882)"
         sodipodi:start="0.12052875"
         sodipodi:end="0.41971562"
         inkscape:transform-center-x="0.80786985"
         inkscape:transform-center-y="24.666275"
         sodipodi:arc-type="slice"
         d="m 1100.984,1792.1401 a 46.138718,46.138718 0 0 1 -3.6698,13.254 l -42.1341,-18.8016 z" />
      <path
         inkscape:transform-center-y="23.141065"
         inkscape:transform-center-x="-14.660491"
         sodipodi:end="0.41971562"
         sodipodi:start="0.12052875"
         transform="rotate(45,1058.7485,1770.3443)"
         sodipodi:ry="46.138718"
         sodipodi:rx="46.138718"
         sodipodi:cy="1786.5925"
         sodipodi:cx="1055.1801"
         id="path6905"
         style="color:#000000;display:inline;overflow:visible;visibility:visible;fill:url(#linearGradient2005);fill-opacity:1;fill-rule:nonzero;stroke:none;stroke-width:2;marker:none;enable-background:accumulate"
         sodipodi:type="arc"
         sodipodi:arc-type="slice"
         d="m 1100.984,1792.1401 a 46.138718,46.138718 0 0 1 -3.6698,13.254 l -42.1341,-18.8016 z" />
      <path
         sodipodi:type="arc"
         style="color:#000000;display:inline;overflow:visible;visibility:visible;fill:url(#linearGradient2007);fill-opacity:1;fill-rule:nonzero;stroke:none;stroke-width:2;marker:none;enable-background:accumulate"
         id="path6907"
         sodipodi:cx="1055.1801"
         sodipodi:cy="1786.5925"
         sodipodi:rx="46.138718"
         sodipodi:ry="46.138718"
         transform="rotate(15,1079.6106,1745.8873)"
         sodipodi:start="0.12052875"
         sodipodi:end="0.41971562"
         inkscape:transform-center-x="-22.572647"
         inkscape:transform-center-y="15.702247"
         sodipodi:arc-type="slice"
         d="m 1100.984,1792.1401 a 46.138718,46.138718 0 0 1 -3.6698,13.254 l -42.1341,-18.8016 z" />
    </g>
    <g
       id="g2706"
       transform="matrix(1.0442269,0,0,1.0442269,-9.690632,-14.0554)">
      <g
         id="g699"
         transform="matrix(0.47307943,0,0,0.43540113,293.26574,91.491329)"
         clip-path="none">
        <g
           id="g1633"
           transform="translate(373.60778,-11.89663)">
          <g
             id="g1353"
             transform="matrix(1.1396282,0,0,1.1396282,-389.89351,-128.95851)">
            <g
               id="g2030"
               transform="matrix(1.0246694,0,0,1.0246694,18.793124,-27.101182)">
              <rect
                 style="fill:#ffffff;fill-opacity:1;stroke:#424242;stroke-width:6.66328;stroke-linecap:round;stroke-linejoin:round;stroke-miterlimit:4;stroke-dasharray:none;stroke-dashoffset:3.5;stroke-opacity:1;paint-order:fill markers stroke;stop-color:#000000"
                 id="rect1263"
                 width="181.75769"
                 height="91.695625"
                 x="-398.12198"
                 y="241.07964" />
              <text
                 xml:space="preserve"
                 style="font-size:26.5019px;line-height:1.25;font-family:sans-serif;fill:#3c6eb4;fill-opacity:1;stroke:#294172;stroke-width:2.20337;stroke-miterlimit:4;stroke-dasharray:none;stroke-opacity:1"
                 x="-393.57791"
                 y="285.61325"
                 id="text1289"
                 transform="scale(0.95935142,1.0423709)"><tspan
                   sodipodi:role="line"
                   id="tspan1287"
                   x="-393.57791"
                   y="285.61325"
                   style="font-style:normal;font-variant:normal;font-weight:bold;font-stretch:normal;font-size:26.5019px;font-family:Comfortaa;-inkscape-font-specification:'Comfortaa Bold';fill:#294172;fill-opacity:1;stroke:#294172;stroke-width:2.20337;stroke-miterlimit:4;stroke-dasharray:none;stroke-opacity:1"><tspan
                     style="font-style:normal;font-variant:normal;font-weight:normal;font-stretch:normal;font-size:26.5019px;font-family:Comfortaa;-inkscape-font-specification:Comfortaa"
                     id="tspan423">WELCOME</tspan></tspan></text>
            </g>
          </g>
        </g>
      </g>
      <g
         id="g2413"
         transform="matrix(0.59634307,-0.33472002,0.33472002,0.59634307,-36.837802,197.80035)">
        <g
           id="g7514"
           transform="matrix(1.855063,-3.7829299,3.7283616,1.8911705,-1716.9526,443.88107)">
          <path
             style="fill:#3c6eb4;fill-opacity:1;stroke:#294172;stroke-width:1.00104;stroke-miterlimit:4;stroke-dasharray:none;stroke-opacity:1"
             d="m 283.60774,399.69972 c -0.3844,-1.3366 -0.3118,-2.42672 0.32231,-2.61654 0.20121,-0.0602 0.33248,-0.22094 0.29171,-0.35714 0.20348,-0.87981 1.19412,-1.49878 1.83177,-1.31325 0.5055,0.15033 0.66795,0.14347 1.0106,-0.0472 0.63902,-0.35568 1.64711,-0.0879 1.85693,0.61415 0.0704,0.23562 0.30558,0.38981 0.65994,0.55867 0.83322,0.39708 1.18659,1.59248 0.84996,2.87526 -2.51426,2.41807 -6.5183,0.74343 -6.8232,0.28608 z"
             id="path7506"
             sodipodi:nodetypes="csccssscsc" />
          <path
             style="fill:#3c6eb4;fill-opacity:1;stroke:#294172;stroke-width:0.79375;stroke-linecap:round;stroke-linejoin:miter;stroke-miterlimit:4;stroke-dasharray:none;stroke-opacity:1"
             d="m 284.196,396.93762 c 0.40498,0.16989 0.62506,0.76616 0.64566,0.99598"
             id="path7508"
             sodipodi:nodetypes="cc" />
          <path
             style="fill:#3c6eb4;fill-opacity:1;stroke:#294172;stroke-width:0.79375;stroke-linecap:round;stroke-linejoin:miter;stroke-miterlimit:4;stroke-dasharray:none;stroke-opacity:1"
             d="m 286.63754,395.65415 c 0.12035,0.34526 0.10428,0.52279 0.17416,0.87816"
             id="path7510"
             sodipodi:nodetypes="cc" />
          <path
             style="fill:#3c6eb4;fill-opacity:1;stroke:#294172;stroke-width:0.79375;stroke-linecap:round;stroke-linejoin:miter;stroke-miterlimit:4;stroke-dasharray:none;stroke-opacity:1"
             d="m 289.21925,396.33896 c -0.21425,0.21147 -0.46169,0.16157 -0.60828,0.93564"
             id="path7512"
             sodipodi:nodetypes="cc" />
        </g>
      </g>
      <g
         id="g2413-2"
         transform="matrix(-0.64015978,0.24053692,-0.24053692,-0.64015978,294.12336,162.13567)">
        <g
           id="g7514-6"
           transform="matrix(1.855063,-3.7829299,3.7283616,1.8911705,-1716.9526,443.88107)">
          <path
             style="fill:#3c6eb4;fill-opacity:1;stroke:#294172;stroke-width:1.00104;stroke-miterlimit:4;stroke-dasharray:none;stroke-opacity:1"
             d="m 283.60774,399.69972 c -0.3844,-1.3366 -0.3118,-2.42672 0.32231,-2.61654 0.20121,-0.0602 0.33248,-0.22094 0.29171,-0.35714 0.20348,-0.87981 1.19412,-1.49878 1.83177,-1.31325 0.5055,0.15033 0.66795,0.14347 1.0106,-0.0472 0.63902,-0.35568 1.64711,-0.0879 1.85693,0.61415 0.0704,0.23562 0.30558,0.38981 0.65994,0.55867 0.83322,0.39708 1.18659,1.59248 0.84996,2.87526 -2.51426,2.41807 -6.5183,0.74343 -6.8232,0.28608 z"
             id="path7506-3"
             sodipodi:nodetypes="csccssscsc" />
          <path
             style="fill:#3c6eb4;fill-opacity:1;stroke:#294172;stroke-width:0.79375;stroke-linecap:round;stroke-linejoin:miter;stroke-miterlimit:4;stroke-dasharray:none;stroke-opacity:1"
             d="m 284.196,396.93762 c 0.40498,0.16989 0.62506,0.76616 0.64566,0.99598"
             id="path7508-1"
             sodipodi:nodetypes="cc" />
          <path
             style="fill:#3c6eb4;fill-opacity:1;stroke:#294172;stroke-width:0.79375;stroke-linecap:round;stroke-linejoin:miter;stroke-miterlimit:4;stroke-dasharray:none;stroke-opacity:1"
             d="m 286.63754,395.65415 c 0.12035,0.34526 0.10428,0.52279 0.17416,0.87816"
             id="path7510-6"
             sodipodi:nodetypes="cc" />
          <path
             style="fill:#3c6eb4;fill-opacity:1;stroke:#294172;stroke-width:0.79375;stroke-linecap:round;stroke-linejoin:miter;stroke-miterlimit:4;stroke-dasharray:none;stroke-opacity:1"
             d="m 289.21925,396.33896 c -0.21425,0.21147 -0.46169,0.16157 -0.60828,0.93564"
             id="path7512-8"
             sodipodi:nodetypes="cc" />
        </g>
      </g>
      <g
         id="g292"
         transform="matrix(7.4277491,-0.22507143,-0.22736532,-7.5034525,-0.17719806,258.31168)">
        <g
           id="g294"
           clip-path="url(#clipPath298-0)">
          <g
             id="g300"
             transform="translate(14.8221,22.4974)">
            <path
               d="m 0,0 c -0.21,-0.011 -0.433,-0.105 -0.583,-0.258 l -0.849,-0.869 c -0.3,-0.306 -0.365,-0.894 0.014,-1.096 l 0.775,-0.415 c 0.048,-0.026 0.095,-0.042 0.144,-0.063 -0.357,-0.628 -0.552,-1.346 -0.512,-2.113 0.115,-2.203 2.056,-3.892 4.336,-3.773 2.279,0.119 4.034,2.001 3.92,4.203 -0.038,0.734 -0.285,1.402 -0.674,1.973 0.107,0.038 0.215,0.098 0.316,0.166 l 0.729,0.494 c 0.355,0.24 0.229,0.817 -0.101,1.091 L 6.571,0.115 C 6.241,0.388 5.658,0.4 5.489,0.006 L 5.137,-0.802 C 5.099,-0.892 5.065,-0.979 5.046,-1.069 4.41,-0.747 3.679,-0.571 2.908,-0.611 2.214,-0.647 1.567,-0.853 1.009,-1.175 0.986,-1.123 0.968,-1.072 0.939,-1.021 L 0.513,-0.254 C 0.409,-0.066 0.21,0.011 0,0"
               style="fill:#fbfbfb;fill-opacity:1;fill-rule:nonzero;stroke:none"
               id="path302"
               inkscape:connector-curvature="0" />
          </g>
          <g
             id="g304"
             transform="translate(14.8221,22.4974)"
             style="fill:#ffffff;fill-opacity:1;stroke:#294172">
            <path
               d="m 0,0 c -0.21,-0.011 -0.433,-0.105 -0.583,-0.258 l -0.849,-0.869 c -0.3,-0.306 -0.365,-0.894 0.014,-1.096 l 0.775,-0.415 c 0.048,-0.026 0.095,-0.042 0.144,-0.063 -0.357,-0.628 -0.552,-1.346 -0.512,-2.113 0.115,-2.203 2.056,-3.892 4.336,-3.773 2.279,0.119 4.034,2.001 3.92,4.203 -0.038,0.734 -0.285,1.402 -0.674,1.973 0.107,0.038 0.215,0.098 0.316,0.166 l 0.729,0.494 c 0.355,0.24 0.229,0.817 -0.101,1.091 L 6.571,0.115 C 6.241,0.388 5.658,0.4 5.489,0.006 L 5.137,-0.802 C 5.099,-0.892 5.065,-0.979 5.046,-1.069 4.41,-0.747 3.679,-0.571 2.908,-0.611 2.214,-0.647 1.567,-0.853 1.009,-1.175 0.986,-1.123 0.968,-1.072 0.939,-1.021 L 0.513,-0.254 C 0.409,-0.066 0.21,0.011 0,0 Z"
               style="fill:#ffffff;fill-opacity:1;stroke:#294172;stroke-width:0.565102;stroke-linecap:butt;stroke-linejoin:miter;stroke-miterlimit:4;stroke-dasharray:none;stroke-opacity:1"
               id="path306"
               inkscape:connector-curvature="0" />
          </g>
          <g
             id="g312"
             transform="matrix(0.84476468,0,0,0.78713371,17.029655,18.305514)"
             style="fill:#3c6eb4">
            <path
               d="m 0,0 c 0.043,-0.831 -0.36,-1.527 -0.901,-1.555 -0.541,-0.028 -1.015,0.622 -1.058,1.453 -0.043,0.831 0.36,1.527 0.901,1.555 C -0.517,1.481 -0.043,0.831 0,0"
               style="fill:#3c6eb4;fill-opacity:1;fill-rule:nonzero;stroke:none"
               id="path314"
               inkscape:connector-curvature="0" />
          </g>
          <g
             id="g316"
             transform="translate(14.3148,22.0828)"
             style="fill:#3c6eb4">
            <path
               d="M 0,0 -0.761,-0.776 C -1.03,-1.05 -1.09,-1.575 -0.751,-1.755 l 0.694,-0.37 c 0.277,-0.147 0.582,-0.216 0.802,0.008 l 0.625,0.638 c 0.22,0.224 0.145,0.527 -0.008,0.802 L 0.979,0.01 C 0.792,0.345 0.269,0.274 0,0"
               style="fill:#3c6eb4;fill-opacity:1;fill-rule:nonzero;stroke:none"
               id="path318"
               inkscape:connector-curvature="0" />
            <path
               d="M 7.7692256,-0.33328192 6.9295035,0.35676425 C 6.6329777,0.60070982 6.1047392,0.61445726 5.9551489,0.26098344 L 5.6474095,-0.46277923 C 5.5252572,-0.75159896 5.4832591,-1.0614734 5.7256821,-1.2609906 l 0.6903316,-0.5666667 c 0.2424228,-0.1995174 0.537682,-0.098245 0.798211,0.078275 l 0.6507816,0.4417482 c 0.3173179,0.2156462 0.2007449,0.73040898 -0.095781,0.97435457"
               style="fill:#3c6eb4;fill-opacity:1;fill-rule:nonzero;stroke:none"
               id="path2052"
               inkscape:connector-curvature="0" />
          </g>
          <g
             id="g320"
             transform="translate(18.034,17.3773)"
             style="fill:#3c6eb4">
            <path
               d="M 0,0 C 0.27,0.014 0.496,-0.117 0.505,-0.292 0.514,-0.468 0.303,-0.622 0.033,-0.636 -0.236,-0.65 -0.462,-0.519 -0.471,-0.343 -0.48,-0.167 -0.27,-0.014 0,0"
               style="fill:#3c6eb4;fill-opacity:1;fill-rule:nonzero;stroke:none"
               id="path322"
               inkscape:connector-curvature="0" />
          </g>
          <g
             id="g324"
             transform="rotate(180,8.7177454,8.1544771)"
             style="fill:#3c6eb4">
            <path
               d="M 0,0 C 0.074,0.019 0.124,0.104 0.104,0.178 0.067,0.336 -0.023,0.605 -0.149,0.85 -0.211,0.972 -0.28,1.087 -0.366,1.179 -0.451,1.271 -0.562,1.35 -0.701,1.343 -0.84,1.336 -0.942,1.245 -1.017,1.145 -1.093,1.045 -1.149,0.923 -1.199,0.795 -1.298,0.539 -1.359,0.262 -1.38,0.101 c -0.012,-0.084 0.065,-0.168 0.149,-0.165 0.42850806,0.12969889 0.83780491,0.18255298 1.204,0.063 0.005,0 0.009,0 0.013,0.001 H 0"
               style="fill:#3c6eb4;fill-opacity:1;fill-rule:nonzero;stroke:none"
               id="path326"
               inkscape:connector-curvature="0"
               sodipodi:nodetypes="ccccsccccccc" />
          </g>
          <g
             id="g332"
             transform="translate(18.223,19.6492)"
             style="fill:#9a9fa6;stroke:#294172" />
          <g
             id="g340"
             transform="translate(19.1278,18.6986)" />
          <g
             id="g360"
             transform="translate(21.3416,22.6776)"
             style="fill:#3c6eb4" />
          <g
             id="g312-5"
             transform="matrix(0.84476468,0,0,0.78713371,20.436709,18.529864)"
             style="fill:#3c6eb4">
            <path
               d="m 0,0 c 0.043,-0.831 -0.36,-1.527 -0.901,-1.555 -0.541,-0.028 -1.015,0.622 -1.058,1.453 -0.043,0.831 0.36,1.527 0.901,1.555 C -0.517,1.481 -0.043,0.831 0,0"
               style="fill:#3c6eb4;fill-opacity:1;fill-rule:nonzero;stroke:none"
               id="path314-0"
               inkscape:connector-curvature="0" />
          </g>
        </g>
      </g>
    </g>
  </g>
</svg>
