{
	"id": "3f3697bb-3d75-4c50-9ce4-5ef573a9bec2",
	"name": "Env",
	"values": [
		{
			"key": "post_url2",
			"value": "https://reqres.in/api/users",
			"type": "default",
			"enabled": true
		},
		{
			"key": "patch_url2",
			"value": "https://reqres.in/api/users/2",
			"type": "default",
			"enabled": true
		},
		{
			"key": "put_url2",
			"value": "https://reqres.in/api/users/2",
			"type": "default",
			"enabled": true
		}
	],
	"_postman_variable_scope": "environment",
	"_postman_exported_at": "2024-01-16T05:18:26.606Z",
	"_postman_exported_using": "Postman/10.22.2"
}