{
  "https://opensource-demo.orangehrmlive.com/web/index.php/auth/logout" : {
    "transaction" : "https://opensource-demo.orangehrmlive.com/web/index.php/auth/logout",
    "sampleCount" : 2,
    "errorCount" : 0,
    "errorPct" : 0.0,
    "meanResTime" : 1404.0,
    "medianResTime" : 1404.0,
    "minResTime" : 1349.0,
    "maxResTime" : 1459.0,
    "pct1ResTime" : 1459.0,
    "pct2ResTime" : 1459.0,
    "pct3ResTime" : 1459.0,
    "throughput" : 0.7468259895444362,
    "receivedKBytesPerSec" : 7.994101241598208,
    "sentKBytesPerSec" : 3.3154989731142646
  },
  "https://opensource-demo.orangehrmlive.com/web/index.php/auth/validate-0" : {
    "transaction" : "https://opensource-demo.orangehrmlive.com/web/index.php/auth/validate-0",
    "sampleCount" : 2,
    "errorCount" : 0,
    "errorPct" : 0.0,
    "meanResTime" : 1533.0,
    "medianResTime" : 1533.0,
    "minResTime" : 1279.0,
    "maxResTime" : 1787.0,
    "pct1ResTime" : 1787.0,
    "pct2ResTime" : 1787.0,
    "pct3ResTime" : 1787.0,
    "throughput" : 1.1191941801902632,
    "receivedKBytesPerSec" : 1.9247079602686066,
    "sentKBytesPerSec" : 0.8361167459429212
  },
  "https://opensource-demo.orangehrmlive.com/web/index.php/auth/validate-1" : {
    "transaction" : "https://opensource-demo.orangehrmlive.com/web/index.php/auth/validate-1",
    "sampleCount" : 2,
    "errorCount" : 0,
    "errorPct" : 0.0,
    "meanResTime" : 539.0,
    "medianResTime" : 539.0,
    "minResTime" : 535.0,
    "maxResTime" : 543.0,
    "pct1ResTime" : 543.0,
    "pct2ResTime" : 543.0,
    "pct3ResTime" : 543.0,
    "throughput" : 3.6832412523020257,
    "receivedKBytesPerSec" : 16.051234461325965,
    "sentKBytesPerSec" : 2.2516689686924494
  },
  "https://opensource-demo.orangehrmlive.com/web/index.php/auth/validate-2" : {
    "transaction" : "https://opensource-demo.orangehrmlive.com/web/index.php/auth/validate-2",
    "sampleCount" : 2,
    "errorCount" : 0,
    "errorPct" : 0.0,
    "meanResTime" : 270.5,
    "medianResTime" : 270.5,
    "minResTime" : 269.0,
    "maxResTime" : 272.0,
    "pct1ResTime" : 272.0,
    "pct2ResTime" : 272.0,
    "pct3ResTime" : 272.0,
    "throughput" : 7.352941176470588,
    "receivedKBytesPerSec" : 12.020335477941176,
    "sentKBytesPerSec" : 4.566865808823529
  },
  "https://opensource-demo.orangehrmlive.com/web/index.php/api/v2/dashboard/employees/subunit" : {
    "transaction" : "https://opensource-demo.orangehrmlive.com/web/index.php/api/v2/dashboard/employees/subunit",
    "sampleCount" : 2,
    "errorCount" : 2,
    "errorPct" : 100.0,
    "meanResTime" : 475.5,
    "medianResTime" : 475.5,
    "minResTime" : 440.0,
    "maxResTime" : 511.0,
    "pct1ResTime" : 511.0,
    "pct2ResTime" : 511.0,
    "pct3ResTime" : 511.0,
    "throughput" : 2.7137042062415193,
    "receivedKBytesPerSec" : 0.8692333785617368,
    "sentKBytesPerSec" : 1.4072040366350067
  },
  "https://opensource-demo.orangehrmlive.com/web/index.php/auth/validate" : {
    "transaction" : "https://opensource-demo.orangehrmlive.com/web/index.php/auth/validate",
    "sampleCount" : 2,
    "errorCount" : 0,
    "errorPct" : 0.0,
    "meanResTime" : 23721.5,
    "medianResTime" : 23721.5,
    "minResTime" : 23415.0,
    "maxResTime" : 24028.0,
    "pct1ResTime" : 24028.0,
    "pct2ResTime" : 24028.0,
    "pct3ResTime" : 24028.0,
    "throughput" : 0.083236224404861,
    "receivedKBytesPerSec" : 350.5929686849717,
    "sentKBytesPerSec" : 0.3728560169385717
  },
  "https://opensource-demo.orangehrmlive.com/web/index.php/auth/validate-3" : {
    "transaction" : "https://opensource-demo.orangehrmlive.com/web/index.php/auth/validate-3",
    "sampleCount" : 2,
    "errorCount" : 0,
    "errorPct" : 0.0,
    "meanResTime" : 7820.5,
    "medianResTime" : 7820.5,
    "minResTime" : 7799.0,
    "maxResTime" : 7842.0,
    "pct1ResTime" : 7842.0,
    "pct2ResTime" : 7842.0,
    "pct3ResTime" : 7842.0,
    "throughput" : 0.2550369803621525,
    "receivedKBytesPerSec" : 140.17644374840603,
    "sentKBytesPerSec" : 0.16089247003315482
  },
  "https://opensource-demo.orangehrmlive.com/web/index.php/auth/validate-4" : {
    "transaction" : "https://opensource-demo.orangehrmlive.com/web/index.php/auth/validate-4",
    "sampleCount" : 2,
    "errorCount" : 0,
    "errorPct" : 0.0,
    "meanResTime" : 8967.5,
    "medianResTime" : 8967.5,
    "minResTime" : 8962.0,
    "maxResTime" : 8973.0,
    "pct1ResTime" : 8973.0,
    "pct2ResTime" : 8973.0,
    "pct3ResTime" : 8973.0,
    "throughput" : 0.22289089490694303,
    "receivedKBytesPerSec" : 145.0856475677031,
    "sentKBytesPerSec" : 0.13843614175860916
  },
  "https://opensource-demo.orangehrmlive.com/web/index.php/auth/validate-5" : {
    "transaction" : "https://opensource-demo.orangehrmlive.com/web/index.php/auth/validate-5",
    "sampleCount" : 2,
    "errorCount" : 0,
    "errorPct" : 0.0,
    "meanResTime" : 21640.5,
    "medianResTime" : 21640.5,
    "minResTime" : 21586.0,
    "maxResTime" : 21695.0,
    "pct1ResTime" : 21695.0,
    "pct2ResTime" : 21695.0,
    "pct3ResTime" : 21695.0,
    "throughput" : 0.09217014608968155,
    "receivedKBytesPerSec" : 141.31510596686482,
    "sentKBytesPerSec" : 0.05796638093921378
  },
  "https://opensource-demo.orangehrmlive.com/web/index.php/auth/validate-6" : {
    "transaction" : "https://opensource-demo.orangehrmlive.com/web/index.php/auth/validate-6",
    "sampleCount" : 2,
    "errorCount" : 0,
    "errorPct" : 0.0,
    "meanResTime" : 20663.0,
    "medianResTime" : 20663.0,
    "minResTime" : 20616.0,
    "maxResTime" : 20710.0,
    "pct1ResTime" : 20710.0,
    "pct2ResTime" : 20710.0,
    "pct3ResTime" : 20710.0,
    "throughput" : 0.09657170449058426,
    "receivedKBytesPerSec" : 142.01397271849348,
    "sentKBytesPerSec" : 0.05979146547561564
  },
  "https://opensource-demo.orangehrmlive.com/web/index.php/api/v2/buzz/feed?limit=5&offset=0&sortOrder=DESC&sortField=share.createdAtUtc" : {
    "transaction" : "https://opensource-demo.orangehrmlive.com/web/index.php/api/v2/buzz/feed?limit=5&offset=0&sortOrder=DESC&sortField=share.createdAtUtc",
    "sampleCount" : 2,
    "errorCount" : 2,
    "errorPct" : 100.0,
    "meanResTime" : 483.5,
    "medianResTime" : 483.5,
    "minResTime" : 480.0,
    "maxResTime" : 487.0,
    "pct1ResTime" : 487.0,
    "pct2ResTime" : 487.0,
    "pct3ResTime" : 487.0,
    "throughput" : 3.1695721077654517,
    "receivedKBytesPerSec" : 1.0152535657686212,
    "sentKBytesPerSec" : 1.5847860538827259
  },
  "https://opensource-demo.orangehrmlive.com/web/index.php/core/i18n/messages" : {
    "transaction" : "https://opensource-demo.orangehrmlive.com/web/index.php/core/i18n/messages",
    "sampleCount" : 4,
    "errorCount" : 0,
    "errorPct" : 0.0,
    "meanResTime" : 514.75,
    "medianResTime" : 528.5,
    "minResTime" : 457.0,
    "maxResTime" : 545.0,
    "pct1ResTime" : 545.0,
    "pct2ResTime" : 545.0,
    "pct3ResTime" : 545.0,
    "throughput" : 0.19747235387045814,
    "receivedKBytesPerSec" : 0.20287198854660346,
    "sentKBytesPerSec" : 0.10220737065560821
  },
  "Test" : {
    "transaction" : "Test",
    "sampleCount" : 2,
    "errorCount" : 2,
    "errorPct" : 100.0,
    "meanResTime" : 30681.5,
    "medianResTime" : 30681.5,
    "minResTime" : 30261.0,
    "maxResTime" : 31102.0,
    "pct1ResTime" : 31102.0,
    "pct2ResTime" : 31102.0,
    "pct3ResTime" : 31102.0,
    "throughput" : 0.06430454633142563,
    "receivedKBytesPerSec" : 272.50445610410907,
    "sentKBytesPerSec" : 1.1027852911388336
  },
  "https://opensource-demo.orangehrmlive.com/web/index.php/api/v2/dashboard/employees/locations" : {
    "transaction" : "https://opensource-demo.orangehrmlive.com/web/index.php/api/v2/dashboard/employees/locations",
    "sampleCount" : 2,
    "errorCount" : 2,
    "errorPct" : 100.0,
    "meanResTime" : 450.5,
    "medianResTime" : 450.5,
    "minResTime" : 445.0,
    "maxResTime" : 456.0,
    "pct1ResTime" : 456.0,
    "pct2ResTime" : 456.0,
    "pct3ResTime" : 456.0,
    "throughput" : 2.6490066225165565,
    "receivedKBytesPerSec" : 0.8485099337748344,
    "sentKBytesPerSec" : 1.3788286423841059
  },
  "https://opensource-demo.orangehrmlive.com/web/index.php/events/push" : {
    "transaction" : "https://opensource-demo.orangehrmlive.com/web/index.php/events/push",
    "sampleCount" : 2,
    "errorCount" : 0,
    "errorPct" : 0.0,
    "meanResTime" : 1233.5,
    "medianResTime" : 1233.5,
    "minResTime" : 1231.0,
    "maxResTime" : 1236.0,
    "pct1ResTime" : 1236.0,
    "pct2ResTime" : 1236.0,
    "pct3ResTime" : 1236.0,
    "throughput" : 1.29366106080207,
    "receivedKBytesPerSec" : 13.831687621280723,
    "sentKBytesPerSec" : 4.531603735446313
  },
  "https://opensource-demo.orangehrmlive.com/web/index.php/events/push-5" : {
    "transaction" : "https://opensource-demo.orangehrmlive.com/web/index.php/events/push-5",
    "sampleCount" : 2,
    "errorCount" : 0,
    "errorPct" : 0.0,
    "meanResTime" : 302.0,
    "medianResTime" : 302.0,
    "minResTime" : 297.0,
    "maxResTime" : 307.0,
    "pct1ResTime" : 307.0,
    "pct2ResTime" : 307.0,
    "pct3ResTime" : 307.0,
    "throughput" : 3.2679738562091503,
    "receivedKBytesPerSec" : 3.172232434640523,
    "sentKBytesPerSec" : 1.7073886846405228
  },
  "https://opensource-demo.orangehrmlive.com/web/index.php/events/push-4" : {
    "transaction" : "https://opensource-demo.orangehrmlive.com/web/index.php/events/push-4",
    "sampleCount" : 2,
    "errorCount" : 0,
    "errorPct" : 0.0,
    "meanResTime" : 309.5,
    "medianResTime" : 309.5,
    "minResTime" : 308.0,
    "maxResTime" : 311.0,
    "pct1ResTime" : 311.0,
    "pct2ResTime" : 311.0,
    "pct3ResTime" : 311.0,
    "throughput" : 3.1948881789137378,
    "receivedKBytesPerSec" : 3.098167931309904,
    "sentKBytesPerSec" : 1.6411242012779552
  },
  "https://opensource-demo.orangehrmlive.com/web/index.php/api/v2/dashboard/employees/action-summary" : {
    "transaction" : "https://opensource-demo.orangehrmlive.com/web/index.php/api/v2/dashboard/employees/action-summary",
    "sampleCount" : 2,
    "errorCount" : 2,
    "errorPct" : 100.0,
    "meanResTime" : 505.0,
    "medianResTime" : 505.0,
    "minResTime" : 504.0,
    "maxResTime" : 506.0,
    "pct1ResTime" : 506.0,
    "pct2ResTime" : 506.0,
    "pct3ResTime" : 506.0,
    "throughput" : 3.3112582781456954,
    "receivedKBytesPerSec" : 1.060637417218543,
    "sentKBytesPerSec" : 1.7397040562913908
  },
  "https://opensource-demo.orangehrmlive.com/web/index.php/events/push-6" : {
    "transaction" : "https://opensource-demo.orangehrmlive.com/web/index.php/events/push-6",
    "sampleCount" : 2,
    "errorCount" : 0,
    "errorPct" : 0.0,
    "meanResTime" : 304.5,
    "medianResTime" : 304.5,
    "minResTime" : 302.0,
    "maxResTime" : 307.0,
    "pct1ResTime" : 307.0,
    "pct2ResTime" : 307.0,
    "pct3ResTime" : 307.0,
    "throughput" : 3.2414910858995136,
    "receivedKBytesPerSec" : 3.1465255267423013,
    "sentKBytesPerSec" : 1.6618972852512155
  },
  "https://opensource-demo.orangehrmlive.com/web/index.php/api/v2/dashboard/shortcuts" : {
    "transaction" : "https://opensource-demo.orangehrmlive.com/web/index.php/api/v2/dashboard/shortcuts",
    "sampleCount" : 2,
    "errorCount" : 2,
    "errorPct" : 100.0,
    "meanResTime" : 459.0,
    "medianResTime" : 459.0,
    "minResTime" : 438.0,
    "maxResTime" : 480.0,
    "pct1ResTime" : 480.0,
    "pct2ResTime" : 480.0,
    "pct3ResTime" : 480.0,
    "throughput" : 3.442340791738382,
    "receivedKBytesPerSec" : 1.1026247848537005,
    "sentKBytesPerSec" : 1.7581486660929433
  },
  "https://opensource-demo.orangehrmlive.com/web/index.php/events/push-1" : {
    "transaction" : "https://opensource-demo.orangehrmlive.com/web/index.php/events/push-1",
    "sampleCount" : 2,
    "errorCount" : 0,
    "errorPct" : 0.0,
    "meanResTime" : 474.0,
    "medianResTime" : 474.0,
    "minResTime" : 473.0,
    "maxResTime" : 475.0,
    "pct1ResTime" : 475.0,
    "pct2ResTime" : 475.0,
    "pct3ResTime" : 475.0,
    "throughput" : 2.5380710659898473,
    "receivedKBytesPerSec" : 10.718640942258883,
    "sentKBytesPerSec" : 1.060834390862944
  },
  "https://opensource-demo.orangehrmlive.com/web/index.php/events/push-0" : {
    "transaction" : "https://opensource-demo.orangehrmlive.com/web/index.php/events/push-0",
    "sampleCount" : 2,
    "errorCount" : 0,
    "errorPct" : 0.0,
    "meanResTime" : 439.5,
    "medianResTime" : 439.5,
    "minResTime" : 439.0,
    "maxResTime" : 440.0,
    "pct1ResTime" : 440.0,
    "pct2ResTime" : 440.0,
    "pct3ResTime" : 440.0,
    "throughput" : 2.6525198938992043,
    "receivedKBytesPerSec" : 4.297393070291777,
    "sentKBytesPerSec" : 1.328850298408488
  },
  "https://opensource-demo.orangehrmlive.com/web/index.php/events/push-3" : {
    "transaction" : "https://opensource-demo.orangehrmlive.com/web/index.php/events/push-3",
    "sampleCount" : 2,
    "errorCount" : 0,
    "errorPct" : 0.0,
    "meanResTime" : 309.0,
    "medianResTime" : 309.0,
    "minResTime" : 298.0,
    "maxResTime" : 320.0,
    "pct1ResTime" : 320.0,
    "pct2ResTime" : 320.0,
    "pct3ResTime" : 320.0,
    "throughput" : 3.2626427406199023,
    "receivedKBytesPerSec" : 3.1638713295269167,
    "sentKBytesPerSec" : 1.70778955954323
  },
  "https://opensource-demo.orangehrmlive.com/web/index.php/events/push-2" : {
    "transaction" : "https://opensource-demo.orangehrmlive.com/web/index.php/events/push-2",
    "sampleCount" : 2,
    "errorCount" : 0,
    "errorPct" : 0.0,
    "meanResTime" : 311.5,
    "medianResTime" : 311.5,
    "minResTime" : 308.0,
    "maxResTime" : 315.0,
    "pct1ResTime" : 315.0,
    "pct2ResTime" : 315.0,
    "pct3ResTime" : 315.0,
    "throughput" : 3.1746031746031744,
    "receivedKBytesPerSec" : 3.072296626984127,
    "sentKBytesPerSec" : 1.6245039682539681
  },
  "https://opensource-demo.orangehrmlive.com/web/index.php/auth/logout-1" : {
    "transaction" : "https://opensource-demo.orangehrmlive.com/web/index.php/auth/logout-1",
    "sampleCount" : 2,
    "errorCount" : 0,
    "errorPct" : 0.0,
    "meanResTime" : 547.0,
    "medianResTime" : 547.0,
    "minResTime" : 505.0,
    "maxResTime" : 589.0,
    "pct1ResTime" : 589.0,
    "pct2ResTime" : 589.0,
    "pct3ResTime" : 589.0,
    "throughput" : 1.1098779134295227,
    "receivedKBytesPerSec" : 4.700723154827969,
    "sentKBytesPerSec" : 0.62539019145394
  },
  "https://opensource-demo.orangehrmlive.com/web/index.php/auth/logout-2" : {
    "transaction" : "https://opensource-demo.orangehrmlive.com/web/index.php/auth/logout-2",
    "sampleCount" : 2,
    "errorCount" : 0,
    "errorPct" : 0.0,
    "meanResTime" : 316.0,
    "medianResTime" : 316.0,
    "minResTime" : 310.0,
    "maxResTime" : 322.0,
    "pct1ResTime" : 322.0,
    "pct2ResTime" : 322.0,
    "pct3ResTime" : 322.0,
    "throughput" : 1.3131976362442546,
    "receivedKBytesPerSec" : 1.270877790544977,
    "sentKBytesPerSec" : 0.863068368351937
  },
  "https://opensource-demo.orangehrmlive.com/web/index.php/auth/logout-0" : {
    "transaction" : "https://opensource-demo.orangehrmlive.com/web/index.php/auth/logout-0",
    "sampleCount" : 2,
    "errorCount" : 0,
    "errorPct" : 0.0,
    "meanResTime" : 531.0,
    "medianResTime" : 531.0,
    "minResTime" : 515.0,
    "maxResTime" : 547.0,
    "pct1ResTime" : 547.0,
    "pct2ResTime" : 547.0,
    "pct3ResTime" : 547.0,
    "throughput" : 1.0845986984815619,
    "receivedKBytesPerSec" : 1.7571769929501084,
    "sentKBytesPerSec" : 0.6122051247288502
  },
  "https://opensource-demo.orangehrmlive.com/web/index.php/auth/logout-5" : {
    "transaction" : "https://opensource-demo.orangehrmlive.com/web/index.php/auth/logout-5",
    "sampleCount" : 2,
    "errorCount" : 0,
    "errorPct" : 0.0,
    "meanResTime" : 309.5,
    "medianResTime" : 309.5,
    "minResTime" : 305.0,
    "maxResTime" : 314.0,
    "pct1ResTime" : 314.0,
    "pct2ResTime" : 314.0,
    "pct3ResTime" : 314.0,
    "throughput" : 1.309757694826457,
    "receivedKBytesPerSec" : 1.2713858873608384,
    "sentKBytesPerSec" : 0.8748772102161101
  },
  "https://opensource-demo.orangehrmlive.com/web/index.php/auth/logout-6" : {
    "transaction" : "https://opensource-demo.orangehrmlive.com/web/index.php/auth/logout-6",
    "sampleCount" : 2,
    "errorCount" : 0,
    "errorPct" : 0.0,
    "meanResTime" : 313.0,
    "medianResTime" : 313.0,
    "minResTime" : 308.0,
    "maxResTime" : 318.0,
    "pct1ResTime" : 318.0,
    "pct2ResTime" : 318.0,
    "pct3ResTime" : 318.0,
    "throughput" : 1.3063357282821686,
    "receivedKBytesPerSec" : 1.268064173742652,
    "sentKBytesPerSec" : 0.8598342586544743
  },
  "https://opensource-demo.orangehrmlive.com/web/index.php/auth/logout-3" : {
    "transaction" : "https://opensource-demo.orangehrmlive.com/web/index.php/auth/logout-3",
    "sampleCount" : 2,
    "errorCount" : 0,
    "errorPct" : 0.0,
    "meanResTime" : 323.0,
    "medianResTime" : 323.0,
    "minResTime" : 317.0,
    "maxResTime" : 329.0,
    "pct1ResTime" : 329.0,
    "pct2ResTime" : 329.0,
    "pct3ResTime" : 329.0,
    "throughput" : 1.297016861219196,
    "receivedKBytesPerSec" : 1.2577517023346303,
    "sentKBytesPerSec" : 0.8676333495460441
  },
  "Total" : {
    "transaction" : "Total",
    "sampleCount" : 66,
    "errorCount" : 14,
    "errorPct" : 21.212122,
    "meanResTime" : 2945.954545454546,
    "medianResTime" : 474.0,
    "minResTime" : 269.0,
    "maxResTime" : 24028.0,
    "pct1ResTime" : 12465.900000000049,
    "pct2ResTime" : 21656.85,
    "pct3ResTime" : 24028.0,
    "throughput" : 1.4941591958706875,
    "receivedKBytesPerSec" : 383.5523281150956,
    "sentKBytesPerSec" : 1.3389155601965046
  },
  "https://opensource-demo.orangehrmlive.com/web/index.php/auth/logout-4" : {
    "transaction" : "https://opensource-demo.orangehrmlive.com/web/index.php/auth/logout-4",
    "sampleCount" : 2,
    "errorCount" : 0,
    "errorPct" : 0.0,
    "meanResTime" : 311.5,
    "medianResTime" : 311.5,
    "minResTime" : 305.0,
    "maxResTime" : 318.0,
    "pct1ResTime" : 318.0,
    "pct2ResTime" : 318.0,
    "pct3ResTime" : 318.0,
    "throughput" : 1.3063357282821686,
    "receivedKBytesPerSec" : 1.2667884552580013,
    "sentKBytesPerSec" : 0.8611099771391248
  },
  "https://opensource-demo.orangehrmlive.com/web/index.php/api/v2/dashboard/employees/time-at-work?timezoneOffset=5.5&currentDate=2023-01-20&currentTime=16:24" : {
    "transaction" : "https://opensource-demo.orangehrmlive.com/web/index.php/api/v2/dashboard/employees/time-at-work?timezoneOffset=5.5&currentDate=2023-01-20&currentTime=16:24",
    "sampleCount" : 2,
    "errorCount" : 2,
    "errorPct" : 100.0,
    "meanResTime" : 443.0,
    "medianResTime" : 443.0,
    "minResTime" : 440.0,
    "maxResTime" : 446.0,
    "pct1ResTime" : 446.0,
    "pct2ResTime" : 446.0,
    "pct3ResTime" : 446.0,
    "throughput" : 3.676470588235294,
    "receivedKBytesPerSec" : 1.1776194852941175,
    "sentKBytesPerSec" : 2.1470013786764706
  },
  "https://opensource-demo.orangehrmlive.com/web/index.php/api/v2/dashboard/employees/leaves?date=2023-01-20" : {
    "transaction" : "https://opensource-demo.orangehrmlive.com/web/index.php/api/v2/dashboard/employees/leaves?date=2023-01-20",
    "sampleCount" : 2,
    "errorCount" : 2,
    "errorPct" : 100.0,
    "meanResTime" : 476.5,
    "medianResTime" : 476.5,
    "minResTime" : 440.0,
    "maxResTime" : 513.0,
    "pct1ResTime" : 513.0,
    "pct2ResTime" : 513.0,
    "pct3ResTime" : 513.0,
    "throughput" : 3.003003003003003,
    "receivedKBytesPerSec" : 0.9618993993993994,
    "sentKBytesPerSec" : 1.6012105855855856
  }
}