1,PASS,Application started successfully,12:23:20,12:23:37,17
2,PASS,Toast alert of invalid user login is display with message: Invalid user credentials.,12:23:38,12:23:54,16
3,PASS,Toast alert of invalid user login is display with message: Invalid user credentials.,12:23:54,12:24:05,11
4,PASS,Toast alert of invalid user login is display with message: Invalid user credentials.,12:24:06,12:24:14,8
5,PASS,Toast alert of enter password is display with message: Enter password,12:24:15,12:24:25,10
6,PASS,Toast alert of enter user is display with message: Enter username,12:24:26,12:24:34,8
7,PASS,Logged in successfully with Username:7575 & Password:7575,12:24:35,12:24:44,9
8,PASS,Scan to Bill button displayed.,12:24:45,12:24:46,1
9,PASS,Invalid Mobile Number toast message found : Invalid Mobile Number,12:24:46,12:24:52,6
11,PASS,Cart page found found.,12:24:53,12:24:58,5
10,PASS,Toast alert of no inventory barcode is display with message: -Products information not found,12:24:58,12:25:07,9
14,PASS,Item is removed successfully.,12:25:07,12:25:20,13
13,PASS,Enter Barcode popup opened successfully from side menu.,12:25:20,12:25:24,4
15,PASS,Item is removed successfully.,12:25:34,12:25:47,13
16,PASS,Item is removed successfully.,12:26:01,12:26:15,14
17,PASS,Toast alert of blank barcode available is display : Enter Barcode,12:26:15,12:26:28,13
18,PASS,Discount applied successfully.,12:26:28,12:26:44,16
12,PASS,Toast alert of cart refresh is display with message: Cart is refreshed successfully,12:26:45,12:26:57,12
19,PASS,Another item added successfully in the cart.,12:26:58,12:27:16,18
20,PASS,Toast alert of 0% offer is display with message: Invalid Offer Entered! Kindly enter a Valid Offer,12:27:17,12:27:26,9
21,PASS,Toast alert of 0% offer is display with message: Invalid Offer Entered! Kindly enter a Valid Offer,12:27:27,12:27:30,3
22,PASS,Offer override is not apply.,12:27:30,12:27:44,14
23,PASS,Toast alert of 0 Rs offer is display with text: Invalid Offer Entered! Kindly enter a Valid Offer,12:27:45,12:28:01,16
24,PASS,Toast alert of entered value more than Net is display with text:Invalid Offer Entered! Kindly enter a Valid Offer,12:28:01,12:28:14,13
25,PASS,Offer successfully overridden.,12:28:14,12:28:21,7
26,PASS,Offer successfully overridden for Rs Off.,12:28:21,12:28:22,1
33,PASS,Checkout button exists.,12:28:23,12:28:39,16
35,PASS,Proceed button exists.,12:28:40,12:28:42,2
36,PASS,Cash payment option is available.,12:28:42,12:28:56,14
37,PASS,Second payment option added automatically.,12:28:56,12:29:04,8
38,PASS,Second payment option removed successfully.,12:29:05,12:29:12,7
39,PASS,Toast alert of enter more amount than bill is display with message: The Amount entered is more than the Amount to be Paid! Please enter the correct Amount,12:29:12,12:29:17,5
40,PASS,Toast alert of enter more amount than bill is display with message: The Amount entered is more than the Amount to be Paid! Please enter the correct Amount,12:29:18,12:29:22,4
41,PASS,Receipt generated successfully with Cash payment.,12:29:22,12:29:26,4
42,PASS,Cash payment mode is display on bill.,12:29:27,12:29:31,4
43,PASS,Print Bill option available.,12:29:32,12:29:32,0
44,PASS,Show bill button available.,12:29:33,12:29:33,0
45,PASS,Payment successful message is appear.,12:29:34,12:29:36,2
27,PASS,Discount applied successfully.,12:29:40,12:29:54,14
28,PASS,Promotion applied.,12:29:54,12:30:02,8
34,PASS,Checkout cancelled.,12:30:02,12:30:09,7
46,PASS,Supplier GV option is available.,12:30:09,12:30:20,11
47,PASS,Toast alert of Enter SP GV Number is display with message: Enter SP GV Number,12:30:21,12:30:24,3
48,PASS,Toast alert of Enter SP GV Name is display with message: Enter SP GV Name,12:30:24,12:30:32,8
49,PASS,Payment successful using Supplier GV.,12:30:33,12:30:42,9
50,PASS,Supplier GV payment mode is display on bill.,12:30:42,12:30:49,7
29,PASS,Shub Muhurath barcode popup found.,12:30:53,12:31:05,12
31,PASS,Discount not applied.,12:31:05,12:31:16,11
32,PASS,Toast alert of remove ShubMuhurath qualifier is display with message: Shub Muhurath Qualifier removed,12:31:16,12:31:21,5
30,PASS,Shub Muhurath discount applied successfully.,12:31:21,12:31:31,10
51,PASS,Payment successful using FYND.,12:31:31,12:31:46,15
52,PASS,FYND payment mode is display on bill.,12:31:46,12:31:52,6
53,PASS,FYND payment mode is display on bill.,12:31:52,12:32:08,16
54,PASS,Logout successful.,12:32:08,12:32:11,3
55,PASS,All the fields exists properly.,12:32:12,12:32:25,13
56,PASS,Total cash amount verified and logout successful.,12:32:25,12:32:37,12