@startuml

rectangle "<$oscal_component_definition>\nAuthentication Server" as cdef_auth {
    artifact "Component:\nTerraform Code" as cdef_auth_iac
    artifact "Component:\nLDAP AMI" as cdef_auth_bin
    artifact "Capability:\nAuthentication" as cdef_auth_capability {
        artifact "AUTH-1: Configuration allows users to specify minimum password requirements" as cdef_auth_capability_auth1
    }
    cdef_auth_iac --> cdef_auth_capability
    cdef_auth_bin --> cdef_auth_capability
}

@enduml