*** Darwin 5x4 ***
Turn = 0.
  0123
0 ..f.
1 ....
2 ....
3 ....
4 ..fr

Turn = 4.
  0123
0 ..f.
1 ....
2 ....
3 ....
4 .rr.

Turn = 8.
  0123
0 ..f.
1 ....
2 rr..
3 ....
4 ....

*** Darwin 3x5 ***
Turn = 0.
  01234
0 .....
1 .r...
2 ...f.

Turn = 3.
  01234
0 ..r..
1 .....
2 ...f.

Turn = 6.
  01234
0 ....r
1 .....
2 ...f.

*** Darwin 4x4 ***
Turn = 0.
  0123
0 ..h.
1 ....
2 ....
3 r...

*** Darwin 4x3 ***
Turn = 0.
  012
0 ..t
1 ...
2 t..
3 f..

Turn = 1.
  012
0 ..t
1 ...
2 t..
3 f..

Turn = 2.
  012
0 ..t
1 ...
2 t..
3 f..

Turn = 3.
  012
0 ..t
1 ...
2 t..
3 t..

Turn = 4.
  012
0 ..t
1 ...
2 t..
3 t..

Turn = 5.
  012
0 ..t
1 ...
2 t..
3 t..

Turn = 6.
  012
0 ..t
1 ...
2 t..
3 t..

Turn = 7.
  012
0 ..t
1 ...
2 t..
3 t..

Turn = 8.
  012
0 ..t
1 ...
2 t..
3 t..

Turn = 9.
  012
0 ..t
1 ...
2 t..
3 t..

*** Darwin 5x3 ***
Turn = 0.
  012
0 ..f
1 .f.
2 f..
3 ...
4 ...

Turn = 2.
  012
0 ..f
1 .f.
2 f..
3 ...
4 ...

Turn = 4.
  012
0 ..f
1 .f.
2 f..
3 ...
4 ...

Turn = 6.
  012
0 ..f
1 .f.
2 f..
3 ...
4 ...

Turn = 8.
  012
0 ..f
1 .f.
2 f..
3 ...
4 ...

*** Darwin 9x9 ***
Turn = 0.
  012345678
0 .........
1 .........
2 .....f...
3 ....h....
4 rrt......
5 .t.......
6 ......ff.
7 t........
8 .....h...

Turn = 92.
  012345678
0 r....r...
1 .........
2 r........
3 ...r..r..
4 .........
5 ........r
6 .......r.
7 .........
8 ....r..rr

Turn = 184.
  012345678
0 .r.....r.
1 ....r....
2 r........
3 .........
4 .........
5 .........
6 r........
7 ...r...r.
8 r....r..r

Turn = 276.
  012345678
0 .r.......
1 .........
2 .........
3 .r.......
4 .........
5 rr.......
6 rr.......
7 ........r
8 ..rr....r

Turn = 368.
  012345678
0 rr...r...
1 ..r......
2 ........r
3 ........r
4 .........
5 .........
6 .........
7 r........
8 ...r.r..r

Turn = 460.
  012345678
0 r........
1 ...r.....
2 ....r...r
3 ........r
4 ........r
5 .........
6 ........r
7 .......r.
8 .r......r

Turn = 552.
  012345678
0 .........
1 .........
2 r........
3 .........
4 r........
5 r........
6 .rr......
7 ..r......
8 r..r.r..r

Turn = 644.
  012345678
0 r......r.
1 r..r.....
2 .........
3 .........
4 .........
5 ..r.....r
6 r........
7 r........
8 ....rr...

*** Darwin 2x3 ***
Turn = 0.
  012
0 .r.
1 f.t

Turn = 115.
  012
0 .r.
1 r.r

Turn = 230.
  012
0 r..
1 rr.

Turn = 345.
  012
0 ..r
1 .rr

Turn = 460.
  012
0 .r.
1 .rr

Turn = 575.
  012
0 r..
1 rr.

Turn = 690.
  012
0 r.r
1 ..r

Turn = 805.
  012
0 r.r
1 r..

Turn = 920.
  012
0 r..
1 .rr

Turn = 1035.
  012
0 ..r
1 .rr

Turn = 1150.
  012
0 rr.
1 r..

Turn = 1265.
  012
0 r.r
1 r..

Turn = 1380.
  012
0 rr.
1 r..

Turn = 1495.
  012
0 r..
1 r.r

*** Darwin 6x3 ***
Turn = 0.
  012
0 ...
1 ...
2 rtf
3 .f.
4 f..
5 .t.

Turn = 26.
  012
0 ...
1 ...
2 .tt
3 .t.
4 .t.
5 tt.

Turn = 52.
  012
0 ...
1 ...
2 .tt
3 .t.
4 .t.
5 tt.

Turn = 78.
  012
0 ...
1 ...
2 .tt
3 .t.
4 .t.
5 tt.

Turn = 104.
  012
0 ...
1 ...
2 .tt
3 .t.
4 .t.
5 tt.

Turn = 130.
  012
0 ...
1 ...
2 .tt
3 .t.
4 .t.
5 tt.

Turn = 156.
  012
0 ...
1 ...
2 .tt
3 .t.
4 .t.
5 tt.

Turn = 182.
  012
0 ...
1 ...
2 .tt
3 .t.
4 .t.
5 tt.

Turn = 208.
  012
0 ...
1 ...
2 .tt
3 .t.
4 .t.
5 tt.

Turn = 234.
  012
0 ...
1 ...
2 .tt
3 .t.
4 .t.
5 tt.

Turn = 260.
  012
0 ...
1 ...
2 .tt
3 .t.
4 .t.
5 tt.

Turn = 286.
  012
0 ...
1 ...
2 .tt
3 .t.
4 .t.
5 tt.

Turn = 312.
  012
0 ...
1 ...
2 .tt
3 .t.
4 .t.
5 tt.

Turn = 338.
  012
0 ...
1 ...
2 .tt
3 .t.
4 .t.
5 tt.

Turn = 364.
  012
0 ...
1 ...
2 .tt
3 .t.
4 .t.
5 tt.

Turn = 390.
  012
0 ...
1 ...
2 .tt
3 .t.
4 .t.
5 tt.

Turn = 416.
  012
0 ...
1 ...
2 .tt
3 .t.
4 .t.
5 tt.

Turn = 442.
  012
0 ...
1 ...
2 .tt
3 .t.
4 .t.
5 tt.

Turn = 468.
  012
0 ...
1 ...
2 .tt
3 .t.
4 .t.
5 tt.

Turn = 494.
  012
0 ...
1 ...
2 .tt
3 .t.
4 .t.
5 tt.

Turn = 520.
  012
0 ...
1 ...
2 .tt
3 .t.
4 .t.
5 tt.

Turn = 546.
  012
0 ...
1 ...
2 .tt
3 .t.
4 .t.
5 tt.

Turn = 572.
  012
0 ...
1 ...
2 .tt
3 .t.
4 .t.
5 tt.

Turn = 598.
  012
0 ...
1 ...
2 .tt
3 .t.
4 .t.
5 tt.

Turn = 624.
  012
0 ...
1 ...
2 .tt
3 .t.
4 .t.
5 tt.

Turn = 650.
  012
0 ...
1 ...
2 .tt
3 .t.
4 .t.
5 tt.

Turn = 676.
  012
0 ...
1 ...
2 .tt
3 .t.
4 .t.
5 tt.

Turn = 702.
  012
0 ...
1 ...
2 .tt
3 .t.
4 .t.
5 tt.

Turn = 728.
  012
0 ...
1 ...
2 .tt
3 .t.
4 .t.
5 tt.

Turn = 754.
  012
0 ...
1 ...
2 .tt
3 .t.
4 .t.
5 tt.

Turn = 780.
  012
0 ...
1 ...
2 .tt
3 .t.
4 .t.
5 tt.

Turn = 806.
  012
0 ...
1 ...
2 .tt
3 .t.
4 .t.
5 tt.

Turn = 832.
  012
0 ...
1 ...
2 .tt
3 .t.
4 .t.
5 tt.

Turn = 858.
  012
0 ...
1 ...
2 .tt
3 .t.
4 .t.
5 tt.

Turn = 884.
  012
0 ...
1 ...
2 .tt
3 .t.
4 .t.
5 tt.

Turn = 910.
  012
0 ...
1 ...
2 .tt
3 .t.
4 .t.
5 tt.

Turn = 936.
  012
0 ...
1 ...
2 .tt
3 .t.
4 .t.
5 tt.

Turn = 962.
  012
0 ...
1 ...
2 .tt
3 .t.
4 .t.
5 tt.

Turn = 988.
  012
0 ...
1 ...
2 .tt
3 .t.
4 .t.
5 tt.

Turn = 1014.
  012
0 ...
1 ...
2 .tt
3 .t.
4 .t.
5 tt.

*** Darwin 5x6 ***
Turn = 0.
  012345
0 ......
1 .....f
2 ..r...
3 ...hr.
4 ......

Turn = 37.
  012345
0 .r....
1 ......
2 ......
3 ......
4 rr..r.

Turn = 74.
  012345
0 r.....
1 r.....
2 ......
3 ......
4 .r...r

Turn = 111.
  012345
0 r.....
1 ......
2 r.....
3 ......
4 ..r..r

Turn = 148.
  012345
0 r.r...
1 r.....
2 ......
3 ......
4 r.....

Turn = 185.
  012345
0 r.....
1 ......
2 ......
3 ...r..
4 ....rr

Turn = 222.
  012345
0 .r...r
1 r.....
2 ......
3 ......
4 .....r

Turn = 259.
  012345
0 ......
1 .....r
2 ...r..
3 .....r
4 .r....

Turn = 296.
  012345
0 r.....
1 r..r..
2 .....r
3 ......
4 ......

Turn = 333.
  012345
0 ....rr
1 ......
2 r.....
3 ......
4 ..r...

Turn = 370.
  012345
0 .....r
1 ......
2 .r....
3 .r....
4 .....r

*** Darwin 10x10 ***
Turn = 0.
  0123456789
0 ..f.......
1 ..........
2 ..........
3 ......r...
4 ..........
5 ..........
6 ..........
7 ..........
8 ..........
9 ......r...

Turn = 148.
  0123456789
0 r.........
1 ..........
2 ..........
3 ..........
4 r.........
5 ..........
6 ..........
7 ..........
8 ..........
9 ........r.

Turn = 296.
  0123456789
0 .....r....
1 ..........
2 ..........
3 .........r
4 ..........
5 ..........
6 ........r.
7 ..........
8 ..........
9 ..........

*** Darwin 7x15 ***
Turn = 0.
  012345678901234
0 .....t..htt....
1 ...f...........
2 .....r.....r...
3 ..........f....
4 ........t......
5 ...............
6 ........f.....t

Turn = 8.
  012345678901234
0 .....t..ttt....
1 ...f...........
2 ...............
3 ..........f....
4 r.......t......
5 ...............
6 ........rr....t

*** Darwin 6x10 ***
Turn = 0.
  0123456789
0 ..f..fr...
1 ..rh....f.
2 ..f.f.....
3 .ft...f...
4 ...t......
5 .f........

Turn = 1.
  0123456789
0 ..f..f.r..
1 ..r.....f.
2 ..frf.....
3 .tt...f...
4 ...t......
5 .f........

Turn = 2.
  0123456789
0 ..f..f..r.
1 ...r....f.
2 ..f.f.....
3 .ttr..f...
4 ...t......
5 .f........

Turn = 3.
  0123456789
0 ..f..f...r
1 ....r...f.
2 ..f.f.....
3 .ttr..f...
4 ....r.....
5 .f........

Turn = 4.
  0123456789
0 ..f..f...r
1 .....r..f.
2 ..f.f.....
3 .ttt..f...
4 .....r....
5 .f........

Turn = 5.
  0123456789
0 ..f..f....
1 ......r.fr
2 ..f.f.....
3 .ttt..f...
4 ......r...
5 .f........

Turn = 6.
  0123456789
0 ..f..f....
1 .......rf.
2 ..t.f....r
3 .ttt..f...
4 .......r..
5 .f........

Turn = 7.
  0123456789
0 ..f..f..r.
1 .......r..
2 ..t.f.....
3 .ttt..f..r
4 ........r.
5 .f........

Turn = 8.
  0123456789
0 ..f..f..r.
1 ........r.
2 ..t.f.....
3 .ttt..f...
4 ........rr
5 .f........

Turn = 9.
  0123456789
0 ..f..f.r..
1 .........r
2 ..t.f.....
3 .ttt..f...
4 ..........
5 .f......rr

Turn = 10.
  0123456789
0 ..f..fr...
1 .........r
2 ..t.f.....
3 .ttt..f...
4 ..........
5 .f......rr

Turn = 11.
  0123456789
0 ..f..rr...
1 ..........
2 ..t.f....r
3 .ttt..f...
4 ..........
5 .f.....rr.

Turn = 12.
  0123456789
0 ..f..rr...
1 ..........
2 ..t.f.....
3 .ttt..f..r
4 ..........
5 .f....rr..

Turn = 13.
  0123456789
0 ..f..r....
1 ......r...
2 ..t.f.....
3 .ttt..f...
4 .........r
5 .f...rr...

Turn = 14.
  0123456789
0 ..f...r...
1 ..........
2 ..t.f.r...
3 .ttt..f...
4 ..........
5 .f..rr...r

Turn = 15.
  0123456789
0 ..f....r..
1 ..........
2 ..t.f.r...
3 .ttt.r....
4 ..........
5 .f.rr....r

Turn = 16.
  0123456789
0 ..f.....r.
1 ..........
2 ..t.f.....
3 .tttr.r...
4 ..........
5 .frr....r.

Turn = 17.
  0123456789
0 ..f......r
1 ..........
2 ..t.f.....
3 .tttt.....
4 ......r...
5 .rrr...r..

*** Darwin 1x9 ***
Turn = 0.
  012345678
0 ..hffrr.f

Turn = 3.
  012345678
0 ..hrrrr.f

Turn = 6.
  012345678
0 ..rrr.rrr

Turn = 9.
  012345678
0 r..rr.rrr

Turn = 12.
  012345678
0 .rr.rrrr.

Turn = 15.
  012345678
0 .rr.rrrr.

*** Darwin 9x12 ***
Turn = 0.
  012345678901
0 ............
1 .......ff...
2 ......r.....
3 ..r....h....
4 ..........h.
5 .....r......
6 .....h......
7 h.......r...
8 .......h..t.

Turn = 1.
  012345678901
0 ............
1 .......ff...
2 .......r....
3 ...r........
4 .......h...h
5 .....hr.....
6 ............
7 .........r..
8 h......h..t.

Turn = 2.
  012345678901
0 ............
1 .......ff...
2 ........r...
3 ....r.......
4 .....h.....h
5 ......rr....
6 ............
7 ..........r.
8 h......h..t.

Turn = 3.
  012345678901
0 ............
1 .......ff...
2 .........r..
3 .....r......
4 .....h.....h
5 ......r.....
6 .......r....
7 ...........r
8 h......h..t.

Turn = 4.
  012345678901
0 ............
1 .......ff...
2 ..........r.
3 .....hr.....
4 ...........h
5 ............
6 ......r.....
7 .......r...r
8 h......h..t.

Turn = 5.
  012345678901
0 ............
1 .......ff...
2 .....h.....r
3 .......r....
4 ...........h
5 ............
6 ...........r
7 ......rr....
8 h......r..t.

Turn = 6.
  012345678901
0 ............
1 .....h.ff...
2 ...........r
3 ........r...
4 ...........h
5 ...........r
6 ............
7 .......r....
8 h.....rr..t.

Turn = 7.
  012345678901
0 .....h......
1 .......ff...
2 ............
3 .........r.r
4 ...........r
5 ...........r
6 ............
7 ......rr....
8 h.....r...t.

Turn = 8.
  012345678901
0 .....h......
1 .......ff...
2 ............
3 ..........rr
4 ...........r
5 ...........r
6 .......r....
7 .....r......
8 h......r..t.

Turn = 9.
  012345678901
0 .....h......
1 .......ff...
2 ............
3 ..........rr
4 ...........r
5 .......r...r
6 ............
7 ....r.......
8 h.......r.t.

Turn = 10.
  012345678901
0 .....h......
1 .......ff...
2 ..........r.
3 ...........r
4 .......r...r
5 ............
6 ...........r
7 ...r........
8 h........tt.

Turn = 11.
  012345678901
0 .....h......
1 .......ff.r.
2 ............
3 .......r..rr
4 ............
5 ............
6 ............
7 ..r........r
8 h........tt.

Turn = 12.
  012345678901
0 .....h....r.
1 .......ff...
2 .......r...r
3 .........r..
4 ............
5 ............
6 ............
7 .r..........
8 h........ttr

Turn = 13.
  012345678901
0 .....h....r.
1 .......rf..r
2 .......r....
3 ........r...
4 ............
5 ............
6 ............
7 r...........
8 h........ttt

Turn = 14.
  012345678901
0 .....h...r.r
1 .......r.r..
2 .......r....
3 .......r....
4 ............
5 ............
6 ............
7 r...........
8 h........ttt

Turn = 15.
  012345678901
0 .....h..r..r
1 ........r.r.
2 ......r.....
3 ......r.....
4 ............
5 ............
6 ............
7 r...........
8 r........ttt

*** Darwin 9x20 ***
Turn = 0.
  01234567890123456789
0 ............r.......
1 ....................
2 ....................
3 ....................
4 ....................
5 ....................
6 ...t................
7 ....................
8 ....................

Turn = 4.
  01234567890123456789
0 ...............r....
1 ....................
2 ....................
3 ....................
4 ....................
5 ....................
6 ...t................
7 ....................
8 ....................

Turn = 8.
  01234567890123456789
0 ...................r
1 ....................
2 ....................
3 ....................
4 ....................
5 ....................
6 ...t................
7 ....................
8 ....................

Turn = 12.
  01234567890123456789
0 ....................
1 ...................r
2 ....................
3 ....................
4 ....................
5 ....................
6 ...t................
7 ....................
8 ....................

*** Darwin 2x2 ***
Turn = 0.
  01
0 f.
1 .f

Turn = 1.
  01
0 f.
1 .f

Turn = 2.
  01
0 f.
1 .f

*** Darwin 3x3 ***
Turn = 0.
  012
0 r..
1 .h.
2 ..t

Turn = 1.
  012
0 .h.
1 r..
2 ..t

Turn = 2.
  012
0 .h.
1 ...
2 r.t

Turn = 3.
  012
0 .h.
1 ...
2 r.t

Turn = 4.
  012
0 .h.
1 ...
2 r.t

Turn = 5.
  012
0 .h.
1 ...
2 r.t

*** Darwin 10x1 ***
Turn = 0.
  0
0 r
1 .
2 .
3 .
4 .
5 .
6 .
7 .
8 .
9 f

Turn = 1.
  0
0 .
1 r
2 .
3 .
4 .
5 .
6 .
7 .
8 .
9 f

Turn = 2.
  0
0 .
1 .
2 r
3 .
4 .
5 .
6 .
7 .
8 .
9 f

Turn = 3.
  0
0 .
1 .
2 .
3 r
4 .
5 .
6 .
7 .
8 .
9 f

Turn = 4.
  0
0 .
1 .
2 .
3 .
4 r
5 .
6 .
7 .
8 .
9 f

Turn = 5.
  0
0 .
1 .
2 .
3 .
4 .
5 r
6 .
7 .
8 .
9 f

Turn = 6.
  0
0 .
1 .
2 .
3 .
4 .
5 .
6 r
7 .
8 .
9 f

Turn = 7.
  0
0 .
1 .
2 .
3 .
4 .
5 .
6 .
7 r
8 .
9 f

Turn = 8.
  0
0 .
1 .
2 .
3 .
4 .
5 .
6 .
7 .
8 r
9 f

Turn = 9.
  0
0 .
1 .
2 .
3 .
4 .
5 .
6 .
7 .
8 r
9 r

Turn = 10.
  0
0 .
1 .
2 .
3 .
4 .
5 .
6 .
7 .
8 r
9 r

Turn = 11.
  0
0 .
1 .
2 .
3 .
4 .
5 .
6 .
7 .
8 r
9 r

*** Darwin 2x2 ***
Turn = 0.
  01
0 f.
1 .f

Turn = 2.
  01
0 f.
1 .f

*** Darwin 4x2 ***
Turn = 0.
  01
0 hh
1 ..
2 ..
3 hh

Turn = 1.
  01
0 hh
1 ..
2 .h
3 h.

Turn = 2.
  01
0 hh
1 .h
2 ..
3 h.

Turn = 3.
  01
0 hh
1 .h
2 ..
3 h.

Turn = 4.
  01
0 hh
1 .h
2 ..
3 h.

Turn = 5.
  01
0 hh
1 .h
2 ..
3 h.

Turn = 6.
  01
0 hh
1 .h
2 ..
3 h.

Turn = 7.
  01
0 hh
1 .h
2 ..
3 h.

Turn = 8.
  01
0 hh
1 .h
2 ..
3 h.

Turn = 9.
  01
0 hh
1 .h
2 ..
3 h.

Turn = 10.
  01
0 hh
1 .h
2 ..
3 h.

*** Darwin 20x20 ***
Turn = 0.
  01234567890123456789
0 fhrtrhfftthhhrrrrfft
1 ....................
2 ....................
3 ....................
4 ....................
5 ....................
6 ....................
7 ....................
8 ....................
9 ....................
0 ....................
1 ....................
2 ....................
3 ....................
4 ....................
5 ....................
6 ....................
7 ....................
8 ....................
9 ....................

Turn = 20.
  01234567890123456789
0 f..ttttttttttt....tt
1 ....................
2 ....................
3 ....................
4 ....................
5 ....................
6 ....................
7 ....................
8 ....................
9 ....................
0 ....................
1 ....................
2 ....................
3 ....................
4 ....................
5 ..............r.....
6 ................rr..
7 ...............r....
8 .rr.................
9 ....................

Turn = 40.
  01234567890123456789
0 f..ttttttttttt....tt
1 ....................
2 .rr.................
3 ....................
4 ....................
5 ....................
6 ...................r
7 ....................
8 ....................
9 ....................
0 ....................
1 ....................
2 ....................
3 ....................
4 ....................
5 ....................
6 ....................
7 ....................
8 ....................
9 rrr.................

Turn = 60.
  01234567890123456789
0 ..r..rr..ttttt....tt
1 ...................t
2 .....r..............
3 ......r.............
4 r.......r...........
5 ...r................
6 ....................
7 ....................
8 ....................
9 ....................
0 ...rr...............
1 ....................
2 ......r.............
3 ....................
4 ....................
5 ....r...............
6 ....................
7 ....................
8 ....................
9 ....................

Turn = 80.
  01234567890123456789
0 .....r...ttttt....tt
1 ...................t
2 ....................
3 ....................
4 ....................
5 ....................
6 ....................
7 ....................
8 ....................
9 ...r................
0 ....................
1 ....................
2 ....................
3 ....................
4 ....r..r............
5 r.r..........r......
6 r........r.r........
7 ....................
8 ....................
9 ...rr...............

Turn = 100.
  01234567890123456789
0 r...r.....tttt....tt
1 r..................t
2 ....................
3 .r..................
4 ..................r.
5 ....................
6 ....................
7 ....................
8 ....................
9 ..r.................
0 ....................
1 ....................
2 ........r...........
3 .........r..........
4 ....................
5 ...............r....
6 ..............r.....
7 ................rr..
8 ....................
9 ............r.......
