*** Darwin 8x3 ***
Turn = 0.
  012
0 ...
1 ..t
2 .hr
3 ...
4 .hh
5 .h.
6 .r.
7 .h.

Turn = 84.
  012
0 rrr
1 ..r
2 ...
3 .r.
4 ..r
5 ...
6 ...
7 .rr

Turn = 168.
  012
0 .rr
1 r..
2 ..r
3 r..
4 r..
5 ..r
6 ..r
7 ...

Turn = 252.
  012
0 rrr
1 ...
2 ...
3 r..
4 .r.
5 .r.
6 ..r
7 r..

Turn = 336.
  012
0 rr.
1 ..r
2 r..
3 r.r
4 ...
5 .r.
6 ...
7 r..

*** Darwin 6x13 ***
Turn = 0.
  0123456789012
0 ..........f.r
1 .............
2 ........t....
3 .............
4 ...f.........
5 ....f.h..r...

Turn = 98.
  0123456789012
0 .............
1 .............
2 ........t....
3 ...........r.
4 r...........r
5 rr..........r

Turn = 196.
  0123456789012
0 .r..r....r...
1 r............
2 .............
3 r............
4 .............
5 ........r.r..

*** Darwin 2x1 ***
Turn = 0.
  0
0 t
1 t

*** Darwin 2x6 ***
Turn = 0.
  012345
0 h.....
1 rtt...

Turn = 49.
  012345
0 .t....
1 ttt...

Turn = 98.
  012345
0 .t....
1 ttt...

Turn = 147.
  012345
0 .t....
1 ttt...

*** Darwin 10x11 ***
Turn = 0.
  01234567890
0 r..........
1 ...........
2 ........r..
3 ...........
4 f..........
5 ...........
6 ...f.h.....
7 .t.........
8 ..t.......h
9 ...........

*** Darwin 8x5 ***
Turn = 0.
  01234
0 t.f..
1 ..tr.
2 .....
3 .....
4 .....
5 ....t
6 .....
7 ..f..

Turn = 83.
  01234
0 ..r..
1 .....
2 .....
3 .....
4 r....
5 .....
6 r....
7 rr..r

Turn = 166.
  01234
0 .r...
1 .....
2 .r...
3 .....
4 r....
5 .....
6 ....r
7 ...rr

Turn = 249.
  01234
0 r...r
1 r....
2 .....
3 ....r
4 .....
5 .....
6 .....
7 ..r.r

*** Darwin 8x4 ***
Turn = 0.
  0123
0 .r..
1 f.h.
2 ....
3 ....
4 ...f
5 ....
6 ....
7 r...

Turn = 127.
  0123
0 r...
1 ....
2 r...
3 r...
4 ....
5 ....
6 ....
7 ..rr

*** Darwin 1x12 ***
Turn = 0.
  012345678901
0 r...........

*** Darwin 9x5 ***
Turn = 0.
  01234
0 ....h
1 .h...
2 h....
3 ....f
4 .t...
5 ..f..
6 ....h
7 ...t.
8 .....

Turn = 17.
  01234
0 .h..h
1 .....
2 ....h
3 ....f
4 .t...
5 ..f..
6 ....h
7 ...t.
8 .....

Turn = 34.
  01234
0 .h..h
1 .....
2 ....h
3 ....f
4 .t...
5 ..f..
6 ....h
7 ...t.
8 .....

Turn = 51.
  01234
0 .h..h
1 .....
2 ....h
3 ....f
4 .t...
5 ..f..
6 ....h
7 ...t.
8 .....

Turn = 68.
  01234
0 .h..h
1 .....
2 ....h
3 ....f
4 .t...
5 ..f..
6 ....h
7 ...t.
8 .....

Turn = 85.
  01234
0 .h..h
1 .....
2 ....h
3 ....f
4 .t...
5 ..f..
6 ....h
7 ...t.
8 .....

Turn = 102.
  01234
0 .h..h
1 .....
2 ....h
3 ....f
4 .t...
5 ..f..
6 ....h
7 ...t.
8 .....

Turn = 119.
  01234
0 .h..h
1 .....
2 ....h
3 ....f
4 .t...
5 ..f..
6 ....h
7 ...t.
8 .....

Turn = 136.
  01234
0 .h..h
1 .....
2 ....h
3 ....f
4 .t...
5 ..f..
6 ....h
7 ...t.
8 .....

Turn = 153.
  01234
0 .h..h
1 .....
2 ....h
3 ....f
4 .t...
5 ..f..
6 ....h
7 ...t.
8 .....

Turn = 170.
  01234
0 .h..h
1 .....
2 ....h
3 ....f
4 .t...
5 ..f..
6 ....h
7 ...t.
8 .....

Turn = 187.
  01234
0 .h..h
1 .....
2 ....h
3 ....f
4 .t...
5 ..f..
6 ....h
7 ...t.
8 .....

Turn = 204.
  01234
0 .h..h
1 .....
2 ....h
3 ....f
4 .t...
5 ..f..
6 ....h
7 ...t.
8 .....

Turn = 221.
  01234
0 .h..h
1 .....
2 ....h
3 ....f
4 .t...
5 ..f..
6 ....h
7 ...t.
8 .....

Turn = 238.
  01234
0 .h..h
1 .....
2 ....h
3 ....f
4 .t...
5 ..f..
6 ....h
7 ...t.
8 .....

Turn = 255.
  01234
0 .h..h
1 .....
2 ....h
3 ....f
4 .t...
5 ..f..
6 ....h
7 ...t.
8 .....

Turn = 272.
  01234
0 .h..h
1 .....
2 ....h
3 ....f
4 .t...
5 ..f..
6 ....h
7 ...t.
8 .....

Turn = 289.
  01234
0 .h..h
1 .....
2 ....h
3 ....f
4 .t...
5 ..f..
6 ....h
7 ...t.
8 .....

Turn = 306.
  01234
0 .h..h
1 .....
2 ....h
3 ....f
4 .t...
5 ..f..
6 ....h
7 ...t.
8 .....

Turn = 323.
  01234
0 .h..h
1 .....
2 ....h
3 ....f
4 .t...
5 ..f..
6 ....h
7 ...t.
8 .....

Turn = 340.
  01234
0 .h..h
1 .....
2 ....h
3 ....f
4 .t...
5 ..f..
6 ....h
7 ...t.
8 .....

*** Darwin 1x6 ***
Turn = 0.
  012345
0 ....t.

Turn = 31.
  012345
0 ....t.

*** Darwin 9x8 ***
Turn = 0.
  01234567
0 ....f...
1 ........
2 ........
3 ........
4 ........
5 .r...t..
6 ........
7 ......r.
8 ........

Turn = 145.
  01234567
0 .......r
1 ........
2 ........
3 ........
4 ....t...
5 ....tt..
6 ........
7 ........
8 ........

*** Darwin 3x13 ***
Turn = 0.
  0123456789012
0 .............
1 ......h..f...
2 .............

Turn = 177.
  0123456789012
0 .............
1 h........f...
2 .............

*** Darwin 1x11 ***
Turn = 0.
  01234567890
0 ..t...h..hr

Turn = 61.
  01234567890
0 rr.......rr

Turn = 122.
  01234567890
0 ..rrr.r....

Turn = 183.
  01234567890
0 rr.....r.r.

Turn = 244.
  01234567890
0 .rrrr......

Turn = 305.
  01234567890
0 ......rr.rr

*** Darwin 1x11 ***
Turn = 0.
  01234567890
0 h......r...

Turn = 70.
  01234567890
0 ..r...r....

Turn = 140.
  01234567890
0 ......r.r..

Turn = 210.
  01234567890
0 .........rr

Turn = 280.
  01234567890
0 ....r.r....

Turn = 350.
  01234567890
0 ........r.r

*** Darwin 3x12 ***
Turn = 0.
  012345678901
0 ........f...
1 .t.r....t.r.
2 .......r....

*** Darwin 6x7 ***
Turn = 0.
  0123456
0 .....r.
1 .......
2 .......
3 ....h..
4 ..h....
5 ....r..

*** Darwin 2x1 ***
Turn = 0.
  0
0 t
1 t

Turn = 52.
  0
0 t
1 t

Turn = 104.
  0
0 t
1 t

Turn = 156.
  0
0 t
1 t

Turn = 208.
  0
0 t
1 t

Turn = 260.
  0
0 t
1 t

Turn = 312.
  0
0 t
1 t

*** Darwin 3x4 ***
Turn = 0.
  0123
0 ..rr
1 .ft.
2 r.f.

Turn = 88.
  0123
0 r.r.
1 r...
2 rr.r

*** Darwin 4x4 ***
Turn = 0.
  0123
0 .tf.
1 h.fh
2 ...f
3 ....

*** Darwin 8x13 ***
Turn = 0.
  0123456789012
0 .............
1 .............
2 .............
3 .............
4 .............
5 .............
6 .............
7 ...........t.

*** Darwin 6x12 ***
Turn = 0.
  012345678901
0 ............
1 f...........
2 h...........
3 ......f.....
4 ............
5 ............

Turn = 179.
  012345678901
0 ............
1 f...........
2 h...........
3 ......f.....
4 ............
5 ............

*** Darwin 5x13 ***
Turn = 0.
  0123456789012
0 .t...........
1 .............
2 ....f........
3 .............
4 ....f........

Turn = 40.
  0123456789012
0 .t...........
1 .............
2 ....f........
3 .............
4 ....f........

Turn = 80.
  0123456789012
0 .t...........
1 .............
2 ....f........
3 .............
4 ....f........

Turn = 120.
  0123456789012
0 .t...........
1 .............
2 ....f........
3 .............
4 ....f........

Turn = 160.
  0123456789012
0 .t...........
1 .............
2 ....f........
3 .............
4 ....f........

Turn = 200.
  0123456789012
0 .t...........
1 .............
2 ....f........
3 .............
4 ....f........

Turn = 240.
  0123456789012
0 .t...........
1 .............
2 ....f........
3 .............
4 ....f........

Turn = 280.
  0123456789012
0 .t...........
1 .............
2 ....f........
3 .............
4 ....f........

*** Darwin 6x5 ***
Turn = 0.
  01234
0 .....
1 ....t
2 .....
3 ....h
4 .....
5 r...t

*** Darwin 6x9 ***
Turn = 0.
  012345678
0 .h.t.f...
1 h........
2 ..t.f....
3 .......h.
4 .......r.
5 .........

Turn = 71.
  012345678
0 .r.t.f...
1 ..r......
2 ..t.f....
3 .........
4 ........r
5 .......r.

Turn = 142.
  012345678
0 .r.......
1 .........
2 .........
3 .......r.
4 ...r....r
5 r.r.r.r..
