*** Darwin 9x9 ***
Turn = 0.
  012345678
0 h........
1 ......h.h
2 .h.h.....
3 ...h.....
4 .........
5 .h.......
6 hh.......
7 ....h....
8 .........

Turn = 1.
  012345678
0 .........
1 h....h.h.
2 h...h....
3 ....h....
4 .........
5 hh.......
6 h........
7 .........
8 ....h....

Turn = 2.
  012345678
0 .........
1 h...h.h..
2 h....h...
3 .....h...
4 .h.......
5 h........
6 h........
7 .........
8 ....h....

*** Darwin 11x11 ***
Turn = 0.
  01234567890
0 f..........
1 ......f.f..
2 .h.h.......
3 ...r.......
4 ...........
5 .h.........
6 rr.........
7 ....r......
8 ...........
9 ...........
0 ...........

Turn = 2.
  01234567890
0 f..........
1 ......f.f..
2 h....h.....
3 .....r.....
4 .r.........
5 r..........
6 r..........
7 ...........
8 ...........
9 ....r......
0 ...........

Turn = 4.
  01234567890
0 f..........
1 ......f.f..
2 hr.....h...
3 r......r...
4 ...........
5 r..........
6 ...........
7 ...........
8 ...........
9 ...........
0 ....r......

*** Darwin 6x7 ***
Turn = 0.
  0123456
0 .......
1 .......
2 ..t....
3 .......
4 ....r..
5 rt...tr

Turn = 5.
  0123456
0 r...r.r
1 .......
2 ..t....
3 .......
4 .......
5 .t...t.

Turn = 10.
  0123456
0 .......
1 r......
2 ..t....
3 .....rr
4 .......
5 .t...t.

Turn = 15.
  0123456
0 .......
1 .......
2 ..t....
3 .....r.
4 ...r...
5 tt..r..

Turn = 20.
  0123456
0 ......r
1 .......
2 ..t....
3 r......
4 .......
5 ttt....

*** Darwin 6x5 ***
Turn = 0.
  01234
0 .....
1 .r...
2 .h...
3 .r...
4 h.h..
5 h...f

Turn = 5.
  01234
0 r....
1 h....
2 h...r
3 .....
4 h....
5 .r..f

Turn = 10.
  01234
0 h..rr
1 h....
2 .....
3 .....
4 r....
5 r...f

Turn = 15.
  01234
0 rr...
1 h....
2 .....
3 .....
4 ....r
5 .r.rr

Turn = 20.
  01234
0 rr.r.
1 ..r..
2 ...r.
3 .....
4 r....
5 ....r

*** Darwin 4x4 ***
Turn = 0.
  0123
0 ..r.
1 ..rf
2 ..h.
3 ff.h

Turn = 4.
  0123
0 r...
1 ..r.
2 ...r
3 ffrr

Turn = 8.
  0123
0 ....
1 r..r
2 r...
3 rfrr

Turn = 12.
  0123
0 r..r
1 ..r.
2 .r.r
3 .fr.

Turn = 16.
  0123
0 rrrr
1 ....
2 ....
3 rr.r

Turn = 20.
  0123
0 r...
1 r.r.
2 r...
3 rrr.

*** Darwin 8x5 ***
Turn = 0.
  01234
0 .f...
1 th...
2 .....
3 ...f.
4 .f...
5 r....
6 rt...
7 ...f.

Turn = 1.
  01234
0 .f...
1 t.h..
2 .....
3 ...f.
4 .f...
5 r....
6 .t...
7 r..f.

Turn = 2.
  01234
0 .f...
1 t..h.
2 .....
3 ...f.
4 .f...
5 r....
6 .t...
7 r..f.

Turn = 3.
  01234
0 .f...
1 t...h
2 .....
3 ...f.
4 .f...
5 .....
6 rt...
7 r..f.

*** Darwin 9x4 ***
Turn = 0.
  0123
0 ....
1 ....
2 ....
3 ....
4 .r..
5 .h..
6 ...t
7 trrr
8 .f..

Turn = 1.
  0123
0 ....
1 ....
2 ....
3 ....
4 .r..
5 ..r.
6 ...t
7 tr..
8 .rrr

Turn = 2.
  0123
0 ....
1 ....
2 ....
3 ....
4 ....
5 .r.r
6 ...t
7 tr..
8 .rrr

Turn = 3.
  0123
0 ....
1 ....
2 ....
3 ....
4 ....
5 ...r
6 .r.t
7 tt..
8 .rrr

Turn = 4.
  0123
0 ....
1 ....
2 ....
3 ....
4 ....
5 ...r
6 .t.r
7 tt.r
8 .rr.

Turn = 5.
  0123
0 ....
1 ....
2 ....
3 ....
4 ....
5 ...r
6 .t.r
7 tr.r
8 .rr.

*** Darwin 13x2 ***
Turn = 0.
  01
0 ..
1 .t
2 ..
3 ..
4 ..
5 ..
6 ..
7 h.
8 ..
9 ..
0 ..
1 ..
2 ..

Turn = 2.
  01
0 ..
1 .t
2 ..
3 ..
4 ..
5 h.
6 ..
7 ..
8 ..
9 ..
0 ..
1 ..
2 ..

Turn = 4.
  01
0 ..
1 .t
2 ..
3 h.
4 ..
5 ..
6 ..
7 ..
8 ..
9 ..
0 ..
1 ..
2 ..

Turn = 6.
  01
0 ..
1 ht
2 ..
3 ..
4 ..
5 ..
6 ..
7 ..
8 ..
9 ..
0 ..
1 ..
2 ..

Turn = 8.
  01
0 h.
1 .t
2 ..
3 ..
4 ..
5 ..
6 ..
7 ..
8 ..
9 ..
0 ..
1 ..
2 ..

*** Darwin 14x3 ***
Turn = 0.
  012
0 r.t
1 .f.
2 tt.
3 ...
4 ...
5 t..
6 h..
7 .h.
8 ...
9 f.t
0 .r.
1 ...
2 ...
3 ..h

Turn = 4.
  012
0 .tt
1 .t.
2 tt.
3 ...
4 ...
5 t..
6 ..h
7 h..
8 ...
9 f.t
0 ...
1 ...
2 ...
3 hr.

Turn = 8.
  012
0 .tt
1 .t.
2 tt.
3 ...
4 ...
5 t..
6 ..h
7 h..
8 ...
9 f.t
0 ...
1 ...
2 ...
3 hr.

Turn = 12.
  012
0 .tt
1 .t.
2 tt.
3 ...
4 ...
5 t..
6 ..h
7 h..
8 ...
9 f.t
0 ...
1 rr.
2 ...
3 ...

*** Darwin 2x1 ***
Turn = 0.
  0
0 t
1 r

Turn = 1.
  0
0 t
1 r

Turn = 2.
  0
0 r
1 r

Turn = 3.
  0
0 r
1 r

Turn = 4.
  0
0 r
1 r

Turn = 5.
  0
0 r
1 r

*** Darwin 8x7 ***
Turn = 0.
  0123456
0 .......
1 .......
2 t......
3 .......
4 r...f..
5 .......
6 .......
7 .......

Turn = 2.
  0123456
0 .......
1 .......
2 t......
3 r......
4 ....f..
5 .......
6 .......
7 .......

Turn = 4.
  0123456
0 .......
1 .......
2 t......
3 t......
4 ....f..
5 .......
6 .......
7 .......

*** Darwin 1x3 ***
Turn = 0.
  012
0 trt

Turn = 1.
  012
0 rtt

Turn = 2.
  012
0 ttt

Turn = 3.
  012
0 ttt

Turn = 4.
  012
0 ttt

Turn = 5.
  012
0 ttt

*** Darwin 20x6 ***
Turn = 0.
  012345
0 ......
1 .r....
2 ......
3 ......
4 ......
5 ......
6 ....t.
7 ......
8 ......
9 ..f...
0 ......
1 .....r
2 ..t...
3 ..f.f.
4 ......
5 ....t.
6 ......
7 ......
8 ..h...
9 ......

Turn = 5.
  012345
0 ......
1 ......
2 ......
3 ......
4 ......
5 ......
6 .r..t.
7 ......
8 ......
9 ..f...
0 ......
1 r.....
2 ..t...
3 ..t.f.
4 ......
5 ....t.
6 ......
7 ......
8 .....h
9 ......

Turn = 10.
  012345
0 ......
1 ......
2 ......
3 ......
4 ......
5 ......
6 ....t.
7 r.....
8 ......
9 ..f...
0 ......
1 .r....
2 ..t...
3 ..t.f.
4 ......
5 ....t.
6 ......
7 ......
8 .....h
9 ......

*** Darwin 14x1 ***
Turn = 0.
  0
0 .
1 .
2 t
3 .
4 h
5 r
6 r
7 .
8 .
9 .
0 t
1 .
2 .
3 r

Turn = 5.
  0
0 .
1 .
2 t
3 r
4 r
5 r
6 .
7 .
8 .
9 .
0 r
1 r
2 .
3 .

Turn = 10.
  0
0 .
1 .
2 t
3 t
4 t
5 .
6 .
7 .
8 .
9 r
0 .
1 r
2 .
3 r

*** Darwin 14x14 ***
Turn = 0.
  01234567890123
0 ..............
1 ..............
2 ..............
3 ..............
4 ..............
5 ..............
6 ..........t...
7 ..............
8 ..............
9 ..............
0 ..............
1 ..............
2 ...........t..
3 ..............

Turn = 5.
  01234567890123
0 ..............
1 ..............
2 ..............
3 ..............
4 ..............
5 ..............
6 ..........t...
7 ..............
8 ..............
9 ..............
0 ..............
1 ..............
2 ...........t..
3 ..............

Turn = 10.
  01234567890123
0 ..............
1 ..............
2 ..............
3 ..............
4 ..............
5 ..............
6 ..........t...
7 ..............
8 ..............
9 ..............
0 ..............
1 ..............
2 ...........t..
3 ..............

*** Darwin 8x6 ***
Turn = 0.
  012345
0 ......
1 ......
2 ......
3 ......
4 ......
5 ......
6 ..hh..
7 ......

Turn = 100.
  012345
0 ......
1 ......
2 ......
3 ......
4 ......
5 ......
6 h.....
7 ..h...

*** Darwin 6x12 ***
Turn = 0.
  012345678901
0 ............
1 .......r....
2 .......f....
3 ............
4 .t..........
5 ............

Turn = 69.
  012345678901
0 r...........
1 ............
2 ............
3 ............
4 .t..........
5 ......r.....

*** Darwin 9x3 ***
Turn = 0.
  012
0 ...
1 ...
2 ...
3 ..h
4 h..
5 ...
6 ..h
7 ...
8 ...

Turn = 100.
  012
0 ...
1 ...
2 ...
3 ...
4 h..
5 ...
6 h..
7 ...
8 ..h

*** Darwin 2x10 ***
Turn = 0.
  0123456789
0 .......fh.
1 ..hf..t...

Turn = 100.
  0123456789
0 .......fh.
1 ..hf..t...

*** Darwin 20x6 ***
Turn = 0.
  012345
0 ......
1 .r....
2 ......
3 ......
4 ......
5 ......
6 ....t.
7 ......
8 ......
9 ..f...
0 ......
1 .....r
2 ..t...
3 ..f.f.
4 ......
5 ....t.
6 ......
7 ......
8 ..h...
9 ......

Turn = 5.
  012345
0 ......
1 ......
2 ......
3 ......
4 ......
5 ......
6 .r..t.
7 ......
8 ......
9 ..f...
0 ......
1 r.....
2 ..t...
3 ..t.f.
4 ......
5 ....t.
6 ......
7 ......
8 .....h
9 ......

Turn = 10.
  012345
0 ......
1 ......
2 ......
3 ......
4 ......
5 ......
6 ....t.
7 r.....
8 ......
9 ..f...
0 ......
1 .r....
2 ..t...
3 ..t.f.
4 ......
5 ....t.
6 ......
7 ......
8 .....h
9 ......
