('/Users/deepanshuvishwakarma/Downloads/cam_ser_macos/cam_service/build/cam_service_for_ws/PYZ-00.pyz',
 [('os',
   '/Library/Frameworks/Python.framework/Versions/3.6/lib/python3.6/os.py',
   'PYMODULE'),
  ('subprocess',
   '/Library/Frameworks/Python.framework/Versions/3.6/lib/python3.6/subprocess.py',
   'PYMODULE'),
  ('dummy_threading',
   '/Library/Frameworks/Python.framework/Versions/3.6/lib/python3.6/dummy_threading.py',
   'PYMODULE'),
  ('_dummy_thread',
   '/Library/Frameworks/Python.framework/Versions/3.6/lib/python3.6/_dummy_thread.py',
   'PYMODULE'),
  ('selectors',
   '/Library/Frameworks/Python.framework/Versions/3.6/lib/python3.6/selectors.py',
   'PYMODULE'),
  ('signal',
   '/Library/Frameworks/Python.framework/Versions/3.6/lib/python3.6/signal.py',
   'PYMODULE'),
  ('ntpath',
   '/Library/Frameworks/Python.framework/Versions/3.6/lib/python3.6/ntpath.py',
   'PYMODULE'),
  ('string',
   '/Library/Frameworks/Python.framework/Versions/3.6/lib/python3.6/string.py',
   'PYMODULE'),
  ('genericpath',
   '/Library/Frameworks/Python.framework/Versions/3.6/lib/python3.6/genericpath.py',
   'PYMODULE'),
  ('posixpath',
   '/Library/Frameworks/Python.framework/Versions/3.6/lib/python3.6/posixpath.py',
   'PYMODULE'),
  ('stat',
   '/Library/Frameworks/Python.framework/Versions/3.6/lib/python3.6/stat.py',
   'PYMODULE'),
  ('inspect',
   '/Library/Frameworks/Python.framework/Versions/3.6/lib/python3.6/inspect.py',
   'PYMODULE'),
  ('importlib',
   '/Library/Frameworks/Python.framework/Versions/3.6/lib/python3.6/importlib/__init__.py',
   'PYMODULE'),
  ('importlib.abc',
   '/Library/Frameworks/Python.framework/Versions/3.6/lib/python3.6/importlib/abc.py',
   'PYMODULE'),
  ('importlib._bootstrap_external',
   '/Library/Frameworks/Python.framework/Versions/3.6/lib/python3.6/importlib/_bootstrap_external.py',
   'PYMODULE'),
  ('importlib._bootstrap',
   '/Library/Frameworks/Python.framework/Versions/3.6/lib/python3.6/importlib/_bootstrap.py',
   'PYMODULE'),
  ('argparse',
   '/Library/Frameworks/Python.framework/Versions/3.6/lib/python3.6/argparse.py',
   'PYMODULE'),
  ('gettext',
   '/Library/Frameworks/Python.framework/Versions/3.6/lib/python3.6/gettext.py',
   'PYMODULE'),
  ('struct',
   '/Library/Frameworks/Python.framework/Versions/3.6/lib/python3.6/struct.py',
   'PYMODULE'),
  ('textwrap',
   '/Library/Frameworks/Python.framework/Versions/3.6/lib/python3.6/textwrap.py',
   'PYMODULE'),
  ('copy',
   '/Library/Frameworks/Python.framework/Versions/3.6/lib/python3.6/copy.py',
   'PYMODULE'),
  ('token',
   '/Library/Frameworks/Python.framework/Versions/3.6/lib/python3.6/token.py',
   'PYMODULE'),
  ('importlib.machinery',
   '/Library/Frameworks/Python.framework/Versions/3.6/lib/python3.6/importlib/machinery.py',
   'PYMODULE'),
  ('dis',
   '/Library/Frameworks/Python.framework/Versions/3.6/lib/python3.6/dis.py',
   'PYMODULE'),
  ('opcode',
   '/Library/Frameworks/Python.framework/Versions/3.6/lib/python3.6/opcode.py',
   'PYMODULE'),
  ('ast',
   '/Library/Frameworks/Python.framework/Versions/3.6/lib/python3.6/ast.py',
   'PYMODULE'),
  ('pkgutil',
   '/Library/Frameworks/Python.framework/Versions/3.6/lib/python3.6/pkgutil.py',
   'PYMODULE'),
  ('importlib.util',
   '/Library/Frameworks/Python.framework/Versions/3.6/lib/python3.6/importlib/util.py',
   'PYMODULE'),
  ('contextlib',
   '/Library/Frameworks/Python.framework/Versions/3.6/lib/python3.6/contextlib.py',
   'PYMODULE'),
  ('tracemalloc',
   '/Library/Frameworks/Python.framework/Versions/3.6/lib/python3.6/tracemalloc.py',
   'PYMODULE'),
  ('pickle',
   '/Library/Frameworks/Python.framework/Versions/3.6/lib/python3.6/pickle.py',
   'PYMODULE'),
  ('pprint',
   '/Library/Frameworks/Python.framework/Versions/3.6/lib/python3.6/pprint.py',
   'PYMODULE'),
  ('doctest',
   '/Library/Frameworks/Python.framework/Versions/3.6/lib/python3.6/doctest.py',
   'PYMODULE'),
  ('unittest',
   '/Library/Frameworks/Python.framework/Versions/3.6/lib/python3.6/unittest/__init__.py',
   'PYMODULE'),
  ('unittest.signals',
   '/Library/Frameworks/Python.framework/Versions/3.6/lib/python3.6/unittest/signals.py',
   'PYMODULE'),
  ('unittest.main',
   '/Library/Frameworks/Python.framework/Versions/3.6/lib/python3.6/unittest/main.py',
   'PYMODULE'),
  ('unittest.runner',
   '/Library/Frameworks/Python.framework/Versions/3.6/lib/python3.6/unittest/runner.py',
   'PYMODULE'),
  ('unittest.loader',
   '/Library/Frameworks/Python.framework/Versions/3.6/lib/python3.6/unittest/loader.py',
   'PYMODULE'),
  ('unittest.suite',
   '/Library/Frameworks/Python.framework/Versions/3.6/lib/python3.6/unittest/suite.py',
   'PYMODULE'),
  ('unittest.case',
   '/Library/Frameworks/Python.framework/Versions/3.6/lib/python3.6/unittest/case.py',
   'PYMODULE'),
  ('logging',
   '/Library/Frameworks/Python.framework/Versions/3.6/lib/python3.6/logging/__init__.py',
   'PYMODULE'),
  ('unittest.result',
   '/Library/Frameworks/Python.framework/Versions/3.6/lib/python3.6/unittest/result.py',
   'PYMODULE'),
  ('unittest.util',
   '/Library/Frameworks/Python.framework/Versions/3.6/lib/python3.6/unittest/util.py',
   'PYMODULE'),
  ('pdb',
   '/Library/Frameworks/Python.framework/Versions/3.6/lib/python3.6/pdb.py',
   'PYMODULE'),
  ('getopt',
   '/Library/Frameworks/Python.framework/Versions/3.6/lib/python3.6/getopt.py',
   'PYMODULE'),
  ('pydoc',
   '/Library/Frameworks/Python.framework/Versions/3.6/lib/python3.6/pydoc.py',
   'PYMODULE'),
  ('webbrowser',
   '/Library/Frameworks/Python.framework/Versions/3.6/lib/python3.6/webbrowser.py',
   'PYMODULE'),
  ('socket',
   '/Library/Frameworks/Python.framework/Versions/3.6/lib/python3.6/socket.py',
   'PYMODULE'),
  ('shutil',
   '/Library/Frameworks/Python.framework/Versions/3.6/lib/python3.6/shutil.py',
   'PYMODULE'),
  ('zipfile',
   '/Library/Frameworks/Python.framework/Versions/3.6/lib/python3.6/zipfile.py',
   'PYMODULE'),
  ('py_compile',
   '/Library/Frameworks/Python.framework/Versions/3.6/lib/python3.6/py_compile.py',
   'PYMODULE'),
  ('tarfile',
   '/Library/Frameworks/Python.framework/Versions/3.6/lib/python3.6/tarfile.py',
   'PYMODULE'),
  ('gzip',
   '/Library/Frameworks/Python.framework/Versions/3.6/lib/python3.6/gzip.py',
   'PYMODULE'),
  ('_compression',
   '/Library/Frameworks/Python.framework/Versions/3.6/lib/python3.6/_compression.py',
   'PYMODULE'),
  ('lzma',
   '/Library/Frameworks/Python.framework/Versions/3.6/lib/python3.6/lzma.py',
   'PYMODULE'),
  ('bz2',
   '/Library/Frameworks/Python.framework/Versions/3.6/lib/python3.6/bz2.py',
   'PYMODULE'),
  ('email.message',
   '/Library/Frameworks/Python.framework/Versions/3.6/lib/python3.6/email/message.py',
   'PYMODULE'),
  ('email.policy',
   '/Library/Frameworks/Python.framework/Versions/3.6/lib/python3.6/email/policy.py',
   'PYMODULE'),
  ('email.contentmanager',
   '/Library/Frameworks/Python.framework/Versions/3.6/lib/python3.6/email/contentmanager.py',
   'PYMODULE'),
  ('email.quoprimime',
   '/Library/Frameworks/Python.framework/Versions/3.6/lib/python3.6/email/quoprimime.py',
   'PYMODULE'),
  ('email.headerregistry',
   '/Library/Frameworks/Python.framework/Versions/3.6/lib/python3.6/email/headerregistry.py',
   'PYMODULE'),
  ('email._header_value_parser',
   '/Library/Frameworks/Python.framework/Versions/3.6/lib/python3.6/email/_header_value_parser.py',
   'PYMODULE'),
  ('email.iterators',
   '/Library/Frameworks/Python.framework/Versions/3.6/lib/python3.6/email/iterators.py',
   'PYMODULE'),
  ('email.generator',
   '/Library/Frameworks/Python.framework/Versions/3.6/lib/python3.6/email/generator.py',
   'PYMODULE'),
  ('random',
   '/Library/Frameworks/Python.framework/Versions/3.6/lib/python3.6/random.py',
   'PYMODULE'),
  ('bisect',
   '/Library/Frameworks/Python.framework/Versions/3.6/lib/python3.6/bisect.py',
   'PYMODULE'),
  ('hashlib',
   '/Library/Frameworks/Python.framework/Versions/3.6/lib/python3.6/hashlib.py',
   'PYMODULE'),
  ('email._encoded_words',
   '/Library/Frameworks/Python.framework/Versions/3.6/lib/python3.6/email/_encoded_words.py',
   'PYMODULE'),
  ('email.charset',
   '/Library/Frameworks/Python.framework/Versions/3.6/lib/python3.6/email/charset.py',
   'PYMODULE'),
  ('email.encoders',
   '/Library/Frameworks/Python.framework/Versions/3.6/lib/python3.6/email/encoders.py',
   'PYMODULE'),
  ('email.base64mime',
   '/Library/Frameworks/Python.framework/Versions/3.6/lib/python3.6/email/base64mime.py',
   'PYMODULE'),
  ('email._policybase',
   '/Library/Frameworks/Python.framework/Versions/3.6/lib/python3.6/email/_policybase.py',
   'PYMODULE'),
  ('email.header',
   '/Library/Frameworks/Python.framework/Versions/3.6/lib/python3.6/email/header.py',
   'PYMODULE'),
  ('email.errors',
   '/Library/Frameworks/Python.framework/Versions/3.6/lib/python3.6/email/errors.py',
   'PYMODULE'),
  ('email.utils',
   '/Library/Frameworks/Python.framework/Versions/3.6/lib/python3.6/email/utils.py',
   'PYMODULE'),
  ('email._parseaddr',
   '/Library/Frameworks/Python.framework/Versions/3.6/lib/python3.6/email/_parseaddr.py',
   'PYMODULE'),
  ('calendar',
   '/Library/Frameworks/Python.framework/Versions/3.6/lib/python3.6/calendar.py',
   'PYMODULE'),
  ('datetime',
   '/Library/Frameworks/Python.framework/Versions/3.6/lib/python3.6/datetime.py',
   'PYMODULE'),
  ('_strptime',
   '/Library/Frameworks/Python.framework/Versions/3.6/lib/python3.6/_strptime.py',
   'PYMODULE'),
  ('email',
   '/Library/Frameworks/Python.framework/Versions/3.6/lib/python3.6/email/__init__.py',
   'PYMODULE'),
  ('email.parser',
   '/Library/Frameworks/Python.framework/Versions/3.6/lib/python3.6/email/parser.py',
   'PYMODULE'),
  ('email.feedparser',
   '/Library/Frameworks/Python.framework/Versions/3.6/lib/python3.6/email/feedparser.py',
   'PYMODULE'),
  ('quopri',
   '/Library/Frameworks/Python.framework/Versions/3.6/lib/python3.6/quopri.py',
   'PYMODULE'),
  ('uu',
   '/Library/Frameworks/Python.framework/Versions/3.6/lib/python3.6/uu.py',
   'PYMODULE'),
  ('optparse',
   '/Library/Frameworks/Python.framework/Versions/3.6/lib/python3.6/optparse.py',
   'PYMODULE'),
  ('http.server',
   '/Library/Frameworks/Python.framework/Versions/3.6/lib/python3.6/http/server.py',
   'PYMODULE'),
  ('http',
   '/Library/Frameworks/Python.framework/Versions/3.6/lib/python3.6/http/__init__.py',
   'PYMODULE'),
  ('socketserver',
   '/Library/Frameworks/Python.framework/Versions/3.6/lib/python3.6/socketserver.py',
   'PYMODULE'),
  ('mimetypes',
   '/Library/Frameworks/Python.framework/Versions/3.6/lib/python3.6/mimetypes.py',
   'PYMODULE'),
  ('http.client',
   '/Library/Frameworks/Python.framework/Versions/3.6/lib/python3.6/http/client.py',
   'PYMODULE'),
  ('ssl',
   '/Library/Frameworks/Python.framework/Versions/3.6/lib/python3.6/ssl.py',
   'PYMODULE'),
  ('ipaddress',
   '/Library/Frameworks/Python.framework/Versions/3.6/lib/python3.6/ipaddress.py',
   'PYMODULE'),
  ('html',
   '/Library/Frameworks/Python.framework/Versions/3.6/lib/python3.6/html/__init__.py',
   'PYMODULE'),
  ('html.entities',
   '/Library/Frameworks/Python.framework/Versions/3.6/lib/python3.6/html/entities.py',
   'PYMODULE'),
  ('pydoc_data.topics',
   '/Library/Frameworks/Python.framework/Versions/3.6/lib/python3.6/pydoc_data/topics.py',
   'PYMODULE'),
  ('pydoc_data',
   '/Library/Frameworks/Python.framework/Versions/3.6/lib/python3.6/pydoc_data/__init__.py',
   'PYMODULE'),
  ('tty',
   '/Library/Frameworks/Python.framework/Versions/3.6/lib/python3.6/tty.py',
   'PYMODULE'),
  ('tempfile',
   '/Library/Frameworks/Python.framework/Versions/3.6/lib/python3.6/tempfile.py',
   'PYMODULE'),
  ('urllib.parse',
   '/Library/Frameworks/Python.framework/Versions/3.6/lib/python3.6/urllib/parse.py',
   'PYMODULE'),
  ('platform',
   '/Library/Frameworks/Python.framework/Versions/3.6/lib/python3.6/platform.py',
   'PYMODULE'),
  ('plistlib',
   '/Library/Frameworks/Python.framework/Versions/3.6/lib/python3.6/plistlib.py',
   'PYMODULE'),
  ('xml.parsers.expat',
   '/Library/Frameworks/Python.framework/Versions/3.6/lib/python3.6/xml/parsers/expat.py',
   'PYMODULE'),
  ('xml.parsers',
   '/Library/Frameworks/Python.framework/Versions/3.6/lib/python3.6/xml/parsers/__init__.py',
   'PYMODULE'),
  ('xml',
   '/Library/Frameworks/Python.framework/Versions/3.6/lib/python3.6/xml/__init__.py',
   'PYMODULE'),
  ('xml.sax.expatreader',
   '/Library/Frameworks/Python.framework/Versions/3.6/lib/python3.6/xml/sax/expatreader.py',
   'PYMODULE'),
  ('xml.sax.saxutils',
   '/Library/Frameworks/Python.framework/Versions/3.6/lib/python3.6/xml/sax/saxutils.py',
   'PYMODULE'),
  ('xml.sax',
   '/Library/Frameworks/Python.framework/Versions/3.6/lib/python3.6/xml/sax/__init__.py',
   'PYMODULE'),
  ('xml.sax.handler',
   '/Library/Frameworks/Python.framework/Versions/3.6/lib/python3.6/xml/sax/handler.py',
   'PYMODULE'),
  ('xml.sax._exceptions',
   '/Library/Frameworks/Python.framework/Versions/3.6/lib/python3.6/xml/sax/_exceptions.py',
   'PYMODULE'),
  ('xml.sax.xmlreader',
   '/Library/Frameworks/Python.framework/Versions/3.6/lib/python3.6/xml/sax/xmlreader.py',
   'PYMODULE'),
  ('shlex',
   '/Library/Frameworks/Python.framework/Versions/3.6/lib/python3.6/shlex.py',
   'PYMODULE'),
  ('glob',
   '/Library/Frameworks/Python.framework/Versions/3.6/lib/python3.6/glob.py',
   'PYMODULE'),
  ('code',
   '/Library/Frameworks/Python.framework/Versions/3.6/lib/python3.6/code.py',
   'PYMODULE'),
  ('codeop',
   '/Library/Frameworks/Python.framework/Versions/3.6/lib/python3.6/codeop.py',
   'PYMODULE'),
  ('bdb',
   '/Library/Frameworks/Python.framework/Versions/3.6/lib/python3.6/bdb.py',
   'PYMODULE'),
  ('cmd',
   '/Library/Frameworks/Python.framework/Versions/3.6/lib/python3.6/cmd.py',
   'PYMODULE'),
  ('difflib',
   '/Library/Frameworks/Python.framework/Versions/3.6/lib/python3.6/difflib.py',
   'PYMODULE'),
  ('__future__',
   '/Library/Frameworks/Python.framework/Versions/3.6/lib/python3.6/__future__.py',
   'PYMODULE'),
  ('_compat_pickle',
   '/Library/Frameworks/Python.framework/Versions/3.6/lib/python3.6/_compat_pickle.py',
   'PYMODULE'),
  ('fnmatch',
   '/Library/Frameworks/Python.framework/Versions/3.6/lib/python3.6/fnmatch.py',
   'PYMODULE'),
  ('stringprep',
   '/Library/Frameworks/Python.framework/Versions/3.6/lib/python3.6/stringprep.py',
   'PYMODULE'),
  ('tldextract',
   '/Library/Frameworks/Python.framework/Versions/3.6/lib/python3.6/site-packages/tldextract/__init__.py',
   'PYMODULE'),
  ('tldextract._version',
   '/Library/Frameworks/Python.framework/Versions/3.6/lib/python3.6/site-packages/tldextract/_version.py',
   'PYMODULE'),
  ('tldextract.tldextract',
   '/Library/Frameworks/Python.framework/Versions/3.6/lib/python3.6/site-packages/tldextract/tldextract.py',
   'PYMODULE'),
  ('tldextract.remote',
   '/Library/Frameworks/Python.framework/Versions/3.6/lib/python3.6/site-packages/tldextract/remote.py',
   'PYMODULE'),
  ('requests_file',
   '/Library/Frameworks/Python.framework/Versions/3.6/lib/python3.6/site-packages/requests_file.py',
   'PYMODULE'),
  ('six',
   '/Library/Frameworks/Python.framework/Versions/3.6/lib/python3.6/site-packages/six.py',
   'PYMODULE'),
  ('requests.compat',
   '/Library/Frameworks/Python.framework/Versions/3.6/lib/python3.6/site-packages/requests/compat.py',
   'PYMODULE'),
  ('http.cookies',
   '/Library/Frameworks/Python.framework/Versions/3.6/lib/python3.6/http/cookies.py',
   'PYMODULE'),
  ('http.cookiejar',
   '/Library/Frameworks/Python.framework/Versions/3.6/lib/python3.6/http/cookiejar.py',
   'PYMODULE'),
  ('charset_normalizer',
   '/Library/Frameworks/Python.framework/Versions/3.6/lib/python3.6/site-packages/charset_normalizer/__init__.py',
   'PYMODULE'),
  ('charset_normalizer.version',
   '/Library/Frameworks/Python.framework/Versions/3.6/lib/python3.6/site-packages/charset_normalizer/version.py',
   'PYMODULE'),
  ('charset_normalizer.utils',
   '/Library/Frameworks/Python.framework/Versions/3.6/lib/python3.6/site-packages/charset_normalizer/utils.py',
   'PYMODULE'),
  ('charset_normalizer.constant',
   '/Library/Frameworks/Python.framework/Versions/3.6/lib/python3.6/site-packages/charset_normalizer/constant.py',
   'PYMODULE'),
  ('charset_normalizer.assets',
   '/Library/Frameworks/Python.framework/Versions/3.6/lib/python3.6/site-packages/charset_normalizer/assets/__init__.py',
   'PYMODULE'),
  ('typing',
   '/Library/Frameworks/Python.framework/Versions/3.6/lib/python3.6/typing.py',
   'PYMODULE'),
  ('charset_normalizer.models',
   '/Library/Frameworks/Python.framework/Versions/3.6/lib/python3.6/site-packages/charset_normalizer/models.py',
   'PYMODULE'),
  ('charset_normalizer.cd',
   '/Library/Frameworks/Python.framework/Versions/3.6/lib/python3.6/site-packages/charset_normalizer/cd.py',
   'PYMODULE'),
  ('charset_normalizer.md',
   '/Library/Frameworks/Python.framework/Versions/3.6/lib/python3.6/site-packages/charset_normalizer/md.py',
   'PYMODULE'),
  ('charset_normalizer.legacy',
   '/Library/Frameworks/Python.framework/Versions/3.6/lib/python3.6/site-packages/charset_normalizer/legacy.py',
   'PYMODULE'),
  ('charset_normalizer.api',
   '/Library/Frameworks/Python.framework/Versions/3.6/lib/python3.6/site-packages/charset_normalizer/api.py',
   'PYMODULE'),
  ('requests.adapters',
   '/Library/Frameworks/Python.framework/Versions/3.6/lib/python3.6/site-packages/requests/adapters.py',
   'PYMODULE'),
  ('urllib3.contrib.socks',
   '/Library/Frameworks/Python.framework/Versions/3.6/lib/python3.6/site-packages/urllib3/contrib/socks.py',
   'PYMODULE'),
  ('urllib3.contrib',
   '/Library/Frameworks/Python.framework/Versions/3.6/lib/python3.6/site-packages/urllib3/contrib/__init__.py',
   'PYMODULE'),
  ('urllib3.contrib.pyopenssl',
   '/Library/Frameworks/Python.framework/Versions/3.6/lib/python3.6/site-packages/urllib3/contrib/pyopenssl.py',
   'PYMODULE'),
  ('urllib3.util.ssl_',
   '/Library/Frameworks/Python.framework/Versions/3.6/lib/python3.6/site-packages/urllib3/util/ssl_.py',
   'PYMODULE'),
  ('urllib3.util.ssltransport',
   '/Library/Frameworks/Python.framework/Versions/3.6/lib/python3.6/site-packages/urllib3/util/ssltransport.py',
   'PYMODULE'),
  ('hmac',
   '/Library/Frameworks/Python.framework/Versions/3.6/lib/python3.6/hmac.py',
   'PYMODULE'),
  ('urllib3.packages.six',
   '/Library/Frameworks/Python.framework/Versions/3.6/lib/python3.6/site-packages/urllib3/packages/six.py',
   'PYMODULE'),
  ('urllib3.packages',
   '/Library/Frameworks/Python.framework/Versions/3.6/lib/python3.6/site-packages/urllib3/packages/__init__.py',
   'PYMODULE'),
  ('urllib3.packages.backports.makefile',
   '/Library/Frameworks/Python.framework/Versions/3.6/lib/python3.6/site-packages/urllib3/packages/backports/makefile.py',
   'PYMODULE'),
  ('urllib3.packages.backports',
   '/Library/Frameworks/Python.framework/Versions/3.6/lib/python3.6/site-packages/urllib3/packages/backports/__init__.py',
   'PYMODULE'),
  ('urllib3.contrib._appengine_environ',
   '/Library/Frameworks/Python.framework/Versions/3.6/lib/python3.6/site-packages/urllib3/contrib/_appengine_environ.py',
   'PYMODULE'),
  ('urllib3',
   '/Library/Frameworks/Python.framework/Versions/3.6/lib/python3.6/site-packages/urllib3/__init__.py',
   'PYMODULE'),
  ('urllib3.util.timeout',
   '/Library/Frameworks/Python.framework/Versions/3.6/lib/python3.6/site-packages/urllib3/util/timeout.py',
   'PYMODULE'),
  ('urllib3.util.request',
   '/Library/Frameworks/Python.framework/Versions/3.6/lib/python3.6/site-packages/urllib3/util/request.py',
   'PYMODULE'),
  ('urllib3.filepost',
   '/Library/Frameworks/Python.framework/Versions/3.6/lib/python3.6/site-packages/urllib3/filepost.py',
   'PYMODULE'),
  ('urllib3.fields',
   '/Library/Frameworks/Python.framework/Versions/3.6/lib/python3.6/site-packages/urllib3/fields.py',
   'PYMODULE'),
  ('urllib3._version',
   '/Library/Frameworks/Python.framework/Versions/3.6/lib/python3.6/site-packages/urllib3/_version.py',
   'PYMODULE'),
  ('urllib3.util.url',
   '/Library/Frameworks/Python.framework/Versions/3.6/lib/python3.6/site-packages/urllib3/util/url.py',
   'PYMODULE'),
  ('urllib3.connectionpool',
   '/Library/Frameworks/Python.framework/Versions/3.6/lib/python3.6/site-packages/urllib3/connectionpool.py',
   'PYMODULE'),
  ('urllib3.util.ssl_match_hostname',
   '/Library/Frameworks/Python.framework/Versions/3.6/lib/python3.6/site-packages/urllib3/util/ssl_match_hostname.py',
   'PYMODULE'),
  ('urllib3.util.response',
   '/Library/Frameworks/Python.framework/Versions/3.6/lib/python3.6/site-packages/urllib3/util/response.py',
   'PYMODULE'),
  ('urllib3.util.queue',
   '/Library/Frameworks/Python.framework/Versions/3.6/lib/python3.6/site-packages/urllib3/util/queue.py',
   'PYMODULE'),
  ('urllib3.util.proxy',
   '/Library/Frameworks/Python.framework/Versions/3.6/lib/python3.6/site-packages/urllib3/util/proxy.py',
   'PYMODULE'),
  ('urllib3.util.connection',
   '/Library/Frameworks/Python.framework/Versions/3.6/lib/python3.6/site-packages/urllib3/util/connection.py',
   'PYMODULE'),
  ('urllib3.util.wait',
   '/Library/Frameworks/Python.framework/Versions/3.6/lib/python3.6/site-packages/urllib3/util/wait.py',
   'PYMODULE'),
  ('urllib3.request',
   '/Library/Frameworks/Python.framework/Versions/3.6/lib/python3.6/site-packages/urllib3/request.py',
   'PYMODULE'),
  ('queue',
   '/Library/Frameworks/Python.framework/Versions/3.6/lib/python3.6/queue.py',
   'PYMODULE'),
  ('urllib3.connection',
   '/Library/Frameworks/Python.framework/Versions/3.6/lib/python3.6/site-packages/urllib3/connection.py',
   'PYMODULE'),
  ('urllib3._collections',
   '/Library/Frameworks/Python.framework/Versions/3.6/lib/python3.6/site-packages/urllib3/_collections.py',
   'PYMODULE'),
  ('requests.auth',
   '/Library/Frameworks/Python.framework/Versions/3.6/lib/python3.6/site-packages/requests/auth.py',
   'PYMODULE'),
  ('requests._internal_utils',
   '/Library/Frameworks/Python.framework/Versions/3.6/lib/python3.6/site-packages/requests/_internal_utils.py',
   'PYMODULE'),
  ('requests.exceptions',
   '/Library/Frameworks/Python.framework/Versions/3.6/lib/python3.6/site-packages/requests/exceptions.py',
   'PYMODULE'),
  ('requests.cookies',
   '/Library/Frameworks/Python.framework/Versions/3.6/lib/python3.6/site-packages/requests/cookies.py',
   'PYMODULE'),
  ('requests.structures',
   '/Library/Frameworks/Python.framework/Versions/3.6/lib/python3.6/site-packages/requests/structures.py',
   'PYMODULE'),
  ('requests.utils',
   '/Library/Frameworks/Python.framework/Versions/3.6/lib/python3.6/site-packages/requests/utils.py',
   'PYMODULE'),
  ('netrc',
   '/Library/Frameworks/Python.framework/Versions/3.6/lib/python3.6/netrc.py',
   'PYMODULE'),
  ('requests.certs',
   '/Library/Frameworks/Python.framework/Versions/3.6/lib/python3.6/site-packages/requests/certs.py',
   'PYMODULE'),
  ('certifi',
   '/Library/Frameworks/Python.framework/Versions/3.6/lib/python3.6/site-packages/certifi/__init__.py',
   'PYMODULE'),
  ('certifi.core',
   '/Library/Frameworks/Python.framework/Versions/3.6/lib/python3.6/site-packages/certifi/core.py',
   'PYMODULE'),
  ('requests.__version__',
   '/Library/Frameworks/Python.framework/Versions/3.6/lib/python3.6/site-packages/requests/__version__.py',
   'PYMODULE'),
  ('requests.models',
   '/Library/Frameworks/Python.framework/Versions/3.6/lib/python3.6/site-packages/requests/models.py',
   'PYMODULE'),
  ('requests.status_codes',
   '/Library/Frameworks/Python.framework/Versions/3.6/lib/python3.6/site-packages/requests/status_codes.py',
   'PYMODULE'),
  ('requests.hooks',
   '/Library/Frameworks/Python.framework/Versions/3.6/lib/python3.6/site-packages/requests/hooks.py',
   'PYMODULE'),
  ('urllib3.exceptions',
   '/Library/Frameworks/Python.framework/Versions/3.6/lib/python3.6/site-packages/urllib3/exceptions.py',
   'PYMODULE'),
  ('urllib3.util.retry',
   '/Library/Frameworks/Python.framework/Versions/3.6/lib/python3.6/site-packages/urllib3/util/retry.py',
   'PYMODULE'),
  ('urllib3.util',
   '/Library/Frameworks/Python.framework/Versions/3.6/lib/python3.6/site-packages/urllib3/util/__init__.py',
   'PYMODULE'),
  ('urllib3.response',
   '/Library/Frameworks/Python.framework/Versions/3.6/lib/python3.6/site-packages/urllib3/response.py',
   'PYMODULE'),
  ('urllib3.poolmanager',
   '/Library/Frameworks/Python.framework/Versions/3.6/lib/python3.6/site-packages/urllib3/poolmanager.py',
   'PYMODULE'),
  ('requests',
   '/Library/Frameworks/Python.framework/Versions/3.6/lib/python3.6/site-packages/requests/__init__.py',
   'PYMODULE'),
  ('requests.api',
   '/Library/Frameworks/Python.framework/Versions/3.6/lib/python3.6/site-packages/requests/api.py',
   'PYMODULE'),
  ('requests.sessions',
   '/Library/Frameworks/Python.framework/Versions/3.6/lib/python3.6/site-packages/requests/sessions.py',
   'PYMODULE'),
  ('requests.packages',
   '/Library/Frameworks/Python.framework/Versions/3.6/lib/python3.6/site-packages/requests/packages.py',
   'PYMODULE'),
  ('idna',
   '/Library/Frameworks/Python.framework/Versions/3.6/lib/python3.6/site-packages/idna/__init__.py',
   'PYMODULE'),
  ('idna.intranges',
   '/Library/Frameworks/Python.framework/Versions/3.6/lib/python3.6/site-packages/idna/intranges.py',
   'PYMODULE'),
  ('idna.core',
   '/Library/Frameworks/Python.framework/Versions/3.6/lib/python3.6/site-packages/idna/core.py',
   'PYMODULE'),
  ('idna.uts46data',
   '/Library/Frameworks/Python.framework/Versions/3.6/lib/python3.6/site-packages/idna/uts46data.py',
   'PYMODULE'),
  ('idna.idnadata',
   '/Library/Frameworks/Python.framework/Versions/3.6/lib/python3.6/site-packages/idna/idnadata.py',
   'PYMODULE'),
  ('idna.package_data',
   '/Library/Frameworks/Python.framework/Versions/3.6/lib/python3.6/site-packages/idna/package_data.py',
   'PYMODULE'),
  ('pymongo',
   '/Library/Frameworks/Python.framework/Versions/3.6/lib/python3.6/site-packages/pymongo/__init__.py',
   'PYMODULE'),
  ('pymongo.write_concern',
   '/Library/Frameworks/Python.framework/Versions/3.6/lib/python3.6/site-packages/pymongo/write_concern.py',
   'PYMODULE'),
  ('pymongo.errors',
   '/Library/Frameworks/Python.framework/Versions/3.6/lib/python3.6/site-packages/pymongo/errors.py',
   'PYMODULE'),
  ('bson.errors',
   '/Library/Frameworks/Python.framework/Versions/3.6/lib/python3.6/site-packages/bson/errors.py',
   'PYMODULE'),
  ('bson',
   '/Library/Frameworks/Python.framework/Versions/3.6/lib/python3.6/site-packages/bson/__init__.py',
   'PYMODULE'),
  ('bson.raw_bson',
   '/Library/Frameworks/Python.framework/Versions/3.6/lib/python3.6/site-packages/bson/raw_bson.py',
   'PYMODULE'),
  ('bson.tz_util',
   '/Library/Frameworks/Python.framework/Versions/3.6/lib/python3.6/site-packages/bson/tz_util.py',
   'PYMODULE'),
  ('bson.timestamp',
   '/Library/Frameworks/Python.framework/Versions/3.6/lib/python3.6/site-packages/bson/timestamp.py',
   'PYMODULE'),
  ('bson._helpers',
   '/Library/Frameworks/Python.framework/Versions/3.6/lib/python3.6/site-packages/bson/_helpers.py',
   'PYMODULE'),
  ('bson.son',
   '/Library/Frameworks/Python.framework/Versions/3.6/lib/python3.6/site-packages/bson/son.py',
   'PYMODULE'),
  ('bson.regex',
   '/Library/Frameworks/Python.framework/Versions/3.6/lib/python3.6/site-packages/bson/regex.py',
   'PYMODULE'),
  ('bson.objectid',
   '/Library/Frameworks/Python.framework/Versions/3.6/lib/python3.6/site-packages/bson/objectid.py',
   'PYMODULE'),
  ('bson.min_key',
   '/Library/Frameworks/Python.framework/Versions/3.6/lib/python3.6/site-packages/bson/min_key.py',
   'PYMODULE'),
  ('bson.max_key',
   '/Library/Frameworks/Python.framework/Versions/3.6/lib/python3.6/site-packages/bson/max_key.py',
   'PYMODULE'),
  ('bson.int64',
   '/Library/Frameworks/Python.framework/Versions/3.6/lib/python3.6/site-packages/bson/int64.py',
   'PYMODULE'),
  ('bson.decimal128',
   '/Library/Frameworks/Python.framework/Versions/3.6/lib/python3.6/site-packages/bson/decimal128.py',
   'PYMODULE'),
  ('decimal',
   '/Library/Frameworks/Python.framework/Versions/3.6/lib/python3.6/decimal.py',
   'PYMODULE'),
  ('_pydecimal',
   '/Library/Frameworks/Python.framework/Versions/3.6/lib/python3.6/_pydecimal.py',
   'PYMODULE'),
  ('numbers',
   '/Library/Frameworks/Python.framework/Versions/3.6/lib/python3.6/numbers.py',
   'PYMODULE'),
  ('bson.dbref',
   '/Library/Frameworks/Python.framework/Versions/3.6/lib/python3.6/site-packages/bson/dbref.py',
   'PYMODULE'),
  ('bson.codec_options',
   '/Library/Frameworks/Python.framework/Versions/3.6/lib/python3.6/site-packages/bson/codec_options.py',
   'PYMODULE'),
  ('bson.code',
   '/Library/Frameworks/Python.framework/Versions/3.6/lib/python3.6/site-packages/bson/code.py',
   'PYMODULE'),
  ('bson.binary',
   '/Library/Frameworks/Python.framework/Versions/3.6/lib/python3.6/site-packages/bson/binary.py',
   'PYMODULE'),
  ('uuid',
   '/Library/Frameworks/Python.framework/Versions/3.6/lib/python3.6/uuid.py',
   'PYMODULE'),
  ('ctypes.util',
   '/Library/Frameworks/Python.framework/Versions/3.6/lib/python3.6/ctypes/util.py',
   'PYMODULE'),
  ('ctypes.macholib.dyld',
   '/Library/Frameworks/Python.framework/Versions/3.6/lib/python3.6/ctypes/macholib/dyld.py',
   'PYMODULE'),
  ('ctypes.macholib',
   '/Library/Frameworks/Python.framework/Versions/3.6/lib/python3.6/ctypes/macholib/__init__.py',
   'PYMODULE'),
  ('ctypes.macholib.dylib',
   '/Library/Frameworks/Python.framework/Versions/3.6/lib/python3.6/ctypes/macholib/dylib.py',
   'PYMODULE'),
  ('ctypes.macholib.framework',
   '/Library/Frameworks/Python.framework/Versions/3.6/lib/python3.6/ctypes/macholib/framework.py',
   'PYMODULE'),
  ('ctypes',
   '/Library/Frameworks/Python.framework/Versions/3.6/lib/python3.6/ctypes/__init__.py',
   'PYMODULE'),
  ('ctypes._endian',
   '/Library/Frameworks/Python.framework/Versions/3.6/lib/python3.6/ctypes/_endian.py',
   'PYMODULE'),
  ('pymongo.read_preferences',
   '/Library/Frameworks/Python.framework/Versions/3.6/lib/python3.6/site-packages/pymongo/read_preferences.py',
   'PYMODULE'),
  ('pymongo.server_selectors',
   '/Library/Frameworks/Python.framework/Versions/3.6/lib/python3.6/site-packages/pymongo/server_selectors.py',
   'PYMODULE'),
  ('pymongo.server_type',
   '/Library/Frameworks/Python.framework/Versions/3.6/lib/python3.6/site-packages/pymongo/server_type.py',
   'PYMODULE'),
  ('pymongo.operations',
   '/Library/Frameworks/Python.framework/Versions/3.6/lib/python3.6/site-packages/pymongo/operations.py',
   'PYMODULE'),
  ('pymongo.typings',
   '/Library/Frameworks/Python.framework/Versions/3.6/lib/python3.6/site-packages/pymongo/typings.py',
   'PYMODULE'),
  ('pymongo.collation',
   '/Library/Frameworks/Python.framework/Versions/3.6/lib/python3.6/site-packages/pymongo/collation.py',
   'PYMODULE'),
  ('pymongo.helpers',
   '/Library/Frameworks/Python.framework/Versions/3.6/lib/python3.6/site-packages/pymongo/helpers.py',
   'PYMODULE'),
  ('pymongo.hello',
   '/Library/Frameworks/Python.framework/Versions/3.6/lib/python3.6/site-packages/pymongo/hello.py',
   'PYMODULE'),
  ('pymongo.mongo_client',
   '/Library/Frameworks/Python.framework/Versions/3.6/lib/python3.6/site-packages/pymongo/mongo_client.py',
   'PYMODULE'),
  ('pymongo.encryption',
   '/Library/Frameworks/Python.framework/Versions/3.6/lib/python3.6/site-packages/pymongo/encryption.py',
   'PYMODULE'),
  ('pymongo.ssl_support',
   '/Library/Frameworks/Python.framework/Versions/3.6/lib/python3.6/site-packages/pymongo/ssl_support.py',
   'PYMODULE'),
  ('pymongo.ssl_context',
   '/Library/Frameworks/Python.framework/Versions/3.6/lib/python3.6/site-packages/pymongo/ssl_context.py',
   'PYMODULE'),
  ('pymongo.pyopenssl_context',
   '/Library/Frameworks/Python.framework/Versions/3.6/lib/python3.6/site-packages/pymongo/pyopenssl_context.py',
   'PYMODULE'),
  ('pymongo.socket_checker',
   '/Library/Frameworks/Python.framework/Versions/3.6/lib/python3.6/site-packages/pymongo/socket_checker.py',
   'PYMODULE'),
  ('pymongo.ocsp_support',
   '/Library/Frameworks/Python.framework/Versions/3.6/lib/python3.6/site-packages/pymongo/ocsp_support.py',
   'PYMODULE'),
  ('pymongo.ocsp_cache',
   '/Library/Frameworks/Python.framework/Versions/3.6/lib/python3.6/site-packages/pymongo/ocsp_cache.py',
   'PYMODULE'),
  ('pymongo.encryption_options',
   '/Library/Frameworks/Python.framework/Versions/3.6/lib/python3.6/site-packages/pymongo/encryption_options.py',
   'PYMODULE'),
  ('pymongo.daemon',
   '/Library/Frameworks/Python.framework/Versions/3.6/lib/python3.6/site-packages/pymongo/daemon.py',
   'PYMODULE'),
  ('pymongo.read_concern',
   '/Library/Frameworks/Python.framework/Versions/3.6/lib/python3.6/site-packages/pymongo/read_concern.py',
   'PYMODULE'),
  ('pymongo.topology_description',
   '/Library/Frameworks/Python.framework/Versions/3.6/lib/python3.6/site-packages/pymongo/topology_description.py',
   'PYMODULE'),
  ('pymongo.server_description',
   '/Library/Frameworks/Python.framework/Versions/3.6/lib/python3.6/site-packages/pymongo/server_description.py',
   'PYMODULE'),
  ('pymongo.topology',
   '/Library/Frameworks/Python.framework/Versions/3.6/lib/python3.6/site-packages/pymongo/topology.py',
   'PYMODULE'),
  ('pymongo.server',
   '/Library/Frameworks/Python.framework/Versions/3.6/lib/python3.6/site-packages/pymongo/server.py',
   'PYMODULE'),
  ('pymongo.response',
   '/Library/Frameworks/Python.framework/Versions/3.6/lib/python3.6/site-packages/pymongo/response.py',
   'PYMODULE'),
  ('pymongo.settings',
   '/Library/Frameworks/Python.framework/Versions/3.6/lib/python3.6/site-packages/pymongo/settings.py',
   'PYMODULE'),
  ('pymongo.pool',
   '/Library/Frameworks/Python.framework/Versions/3.6/lib/python3.6/site-packages/pymongo/pool.py',
   'PYMODULE'),
  ('pymongo.server_api',
   '/Library/Frameworks/Python.framework/Versions/3.6/lib/python3.6/site-packages/pymongo/server_api.py',
   'PYMODULE'),
  ('pymongo.network',
   '/Library/Frameworks/Python.framework/Versions/3.6/lib/python3.6/site-packages/pymongo/network.py',
   'PYMODULE'),
  ('pymongo.compression_support',
   '/Library/Frameworks/Python.framework/Versions/3.6/lib/python3.6/site-packages/pymongo/compression_support.py',
   'PYMODULE'),
  ('pymongo.monitoring',
   '/Library/Frameworks/Python.framework/Versions/3.6/lib/python3.6/site-packages/pymongo/monitoring.py',
   'PYMODULE'),
  ('pymongo.auth',
   '/Library/Frameworks/Python.framework/Versions/3.6/lib/python3.6/site-packages/pymongo/auth.py',
   'PYMODULE'),
  ('pymongo.saslprep',
   '/Library/Frameworks/Python.framework/Versions/3.6/lib/python3.6/site-packages/pymongo/saslprep.py',
   'PYMODULE'),
  ('pymongo.auth_aws',
   '/Library/Frameworks/Python.framework/Versions/3.6/lib/python3.6/site-packages/pymongo/auth_aws.py',
   'PYMODULE'),
  ('pymongo.command_cursor',
   '/Library/Frameworks/Python.framework/Versions/3.6/lib/python3.6/site-packages/pymongo/command_cursor.py',
   'PYMODULE'),
  ('pymongo.client_options',
   '/Library/Frameworks/Python.framework/Versions/3.6/lib/python3.6/site-packages/pymongo/client_options.py',
   'PYMODULE'),
  ('pymongo.change_stream',
   '/Library/Frameworks/Python.framework/Versions/3.6/lib/python3.6/site-packages/pymongo/change_stream.py',
   'PYMODULE'),
  ('pymongo.aggregation',
   '/Library/Frameworks/Python.framework/Versions/3.6/lib/python3.6/site-packages/pymongo/aggregation.py',
   'PYMODULE'),
  ('pymongo.message',
   '/Library/Frameworks/Python.framework/Versions/3.6/lib/python3.6/site-packages/pymongo/message.py',
   'PYMODULE'),
  ('pymongo.client_session',
   '/Library/Frameworks/Python.framework/Versions/3.6/lib/python3.6/site-packages/pymongo/client_session.py',
   'PYMODULE'),
  ('pymongo.cursor',
   '/Library/Frameworks/Python.framework/Versions/3.6/lib/python3.6/site-packages/pymongo/cursor.py',
   'PYMODULE'),
  ('pymongo.collection',
   '/Library/Frameworks/Python.framework/Versions/3.6/lib/python3.6/site-packages/pymongo/collection.py',
   'PYMODULE'),
  ('pymongo.results',
   '/Library/Frameworks/Python.framework/Versions/3.6/lib/python3.6/site-packages/pymongo/results.py',
   'PYMODULE'),
  ('pymongo.bulk',
   '/Library/Frameworks/Python.framework/Versions/3.6/lib/python3.6/site-packages/pymongo/bulk.py',
   'PYMODULE'),
  ('pymongo.monitor',
   '/Library/Frameworks/Python.framework/Versions/3.6/lib/python3.6/site-packages/pymongo/monitor.py',
   'PYMODULE'),
  ('pymongo.srv_resolver',
   '/Library/Frameworks/Python.framework/Versions/3.6/lib/python3.6/site-packages/pymongo/srv_resolver.py',
   'PYMODULE'),
  ('pymongo.uri_parser',
   '/Library/Frameworks/Python.framework/Versions/3.6/lib/python3.6/site-packages/pymongo/uri_parser.py',
   'PYMODULE'),
  ('pymongo.periodic_executor',
   '/Library/Frameworks/Python.framework/Versions/3.6/lib/python3.6/site-packages/pymongo/periodic_executor.py',
   'PYMODULE'),
  ('pymongo.database',
   '/Library/Frameworks/Python.framework/Versions/3.6/lib/python3.6/site-packages/pymongo/database.py',
   'PYMODULE'),
  ('pymongo.max_staleness_selectors',
   '/Library/Frameworks/Python.framework/Versions/3.6/lib/python3.6/site-packages/pymongo/max_staleness_selectors.py',
   'PYMODULE'),
  ('pymongo.common',
   '/Library/Frameworks/Python.framework/Versions/3.6/lib/python3.6/site-packages/pymongo/common.py',
   'PYMODULE'),
  ('pymongo.driver_info',
   '/Library/Frameworks/Python.framework/Versions/3.6/lib/python3.6/site-packages/pymongo/driver_info.py',
   'PYMODULE'),
  ('PIL.ImageEnhance',
   '/Library/Frameworks/Python.framework/Versions/3.6/lib/python3.6/site-packages/PIL/ImageEnhance.py',
   'PYMODULE'),
  ('PIL.ImageStat',
   '/Library/Frameworks/Python.framework/Versions/3.6/lib/python3.6/site-packages/PIL/ImageStat.py',
   'PYMODULE'),
  ('PIL.ImageFilter',
   '/Library/Frameworks/Python.framework/Versions/3.6/lib/python3.6/site-packages/PIL/ImageFilter.py',
   'PYMODULE'),
  ('PIL.Image',
   '/Library/Frameworks/Python.framework/Versions/3.6/lib/python3.6/site-packages/PIL/Image.py',
   'PYMODULE'),
  ('PIL.ImImagePlugin',
   '/Library/Frameworks/Python.framework/Versions/3.6/lib/python3.6/site-packages/PIL/ImImagePlugin.py',
   'PYMODULE'),
  ('PIL.ImageFile',
   '/Library/Frameworks/Python.framework/Versions/3.6/lib/python3.6/site-packages/PIL/ImageFile.py',
   'PYMODULE'),
  ('PIL.Jpeg2KImagePlugin',
   '/Library/Frameworks/Python.framework/Versions/3.6/lib/python3.6/site-packages/PIL/Jpeg2KImagePlugin.py',
   'PYMODULE'),
  ('PIL.XVThumbImagePlugin',
   '/Library/Frameworks/Python.framework/Versions/3.6/lib/python3.6/site-packages/PIL/XVThumbImagePlugin.py',
   'PYMODULE'),
  ('PIL.PcxImagePlugin',
   '/Library/Frameworks/Python.framework/Versions/3.6/lib/python3.6/site-packages/PIL/PcxImagePlugin.py',
   'PYMODULE'),
  ('PIL.TgaImagePlugin',
   '/Library/Frameworks/Python.framework/Versions/3.6/lib/python3.6/site-packages/PIL/TgaImagePlugin.py',
   'PYMODULE'),
  ('PIL.MpoImagePlugin',
   '/Library/Frameworks/Python.framework/Versions/3.6/lib/python3.6/site-packages/PIL/MpoImagePlugin.py',
   'PYMODULE'),
  ('PIL.GbrImagePlugin',
   '/Library/Frameworks/Python.framework/Versions/3.6/lib/python3.6/site-packages/PIL/GbrImagePlugin.py',
   'PYMODULE'),
  ('PIL.FliImagePlugin',
   '/Library/Frameworks/Python.framework/Versions/3.6/lib/python3.6/site-packages/PIL/FliImagePlugin.py',
   'PYMODULE'),
  ('PIL.WmfImagePlugin',
   '/Library/Frameworks/Python.framework/Versions/3.6/lib/python3.6/site-packages/PIL/WmfImagePlugin.py',
   'PYMODULE'),
  ('PIL.PalmImagePlugin',
   '/Library/Frameworks/Python.framework/Versions/3.6/lib/python3.6/site-packages/PIL/PalmImagePlugin.py',
   'PYMODULE'),
  ('PIL.MicImagePlugin',
   '/Library/Frameworks/Python.framework/Versions/3.6/lib/python3.6/site-packages/PIL/MicImagePlugin.py',
   'PYMODULE'),
  ('PIL.PdfImagePlugin',
   '/Library/Frameworks/Python.framework/Versions/3.6/lib/python3.6/site-packages/PIL/PdfImagePlugin.py',
   'PYMODULE'),
  ('PIL.PdfParser',
   '/Library/Frameworks/Python.framework/Versions/3.6/lib/python3.6/site-packages/PIL/PdfParser.py',
   'PYMODULE'),
  ('PIL.ImageSequence',
   '/Library/Frameworks/Python.framework/Versions/3.6/lib/python3.6/site-packages/PIL/ImageSequence.py',
   'PYMODULE'),
  ('PIL.XpmImagePlugin',
   '/Library/Frameworks/Python.framework/Versions/3.6/lib/python3.6/site-packages/PIL/XpmImagePlugin.py',
   'PYMODULE'),
  ('PIL.FtexImagePlugin',
   '/Library/Frameworks/Python.framework/Versions/3.6/lib/python3.6/site-packages/PIL/FtexImagePlugin.py',
   'PYMODULE'),
  ('PIL.WebPImagePlugin',
   '/Library/Frameworks/Python.framework/Versions/3.6/lib/python3.6/site-packages/PIL/WebPImagePlugin.py',
   'PYMODULE'),
  ('PIL.CurImagePlugin',
   '/Library/Frameworks/Python.framework/Versions/3.6/lib/python3.6/site-packages/PIL/CurImagePlugin.py',
   'PYMODULE'),
  ('PIL.PixarImagePlugin',
   '/Library/Frameworks/Python.framework/Versions/3.6/lib/python3.6/site-packages/PIL/PixarImagePlugin.py',
   'PYMODULE'),
  ('PIL.IptcImagePlugin',
   '/Library/Frameworks/Python.framework/Versions/3.6/lib/python3.6/site-packages/PIL/IptcImagePlugin.py',
   'PYMODULE'),
  ('PIL.ImtImagePlugin',
   '/Library/Frameworks/Python.framework/Versions/3.6/lib/python3.6/site-packages/PIL/ImtImagePlugin.py',
   'PYMODULE'),
  ('PIL.IcnsImagePlugin',
   '/Library/Frameworks/Python.framework/Versions/3.6/lib/python3.6/site-packages/PIL/IcnsImagePlugin.py',
   'PYMODULE'),
  ('PIL.features',
   '/Library/Frameworks/Python.framework/Versions/3.6/lib/python3.6/site-packages/PIL/features.py',
   'PYMODULE'),
  ('PIL.GribStubImagePlugin',
   '/Library/Frameworks/Python.framework/Versions/3.6/lib/python3.6/site-packages/PIL/GribStubImagePlugin.py',
   'PYMODULE'),
  ('PIL.PsdImagePlugin',
   '/Library/Frameworks/Python.framework/Versions/3.6/lib/python3.6/site-packages/PIL/PsdImagePlugin.py',
   'PYMODULE'),
  ('PIL.PcdImagePlugin',
   '/Library/Frameworks/Python.framework/Versions/3.6/lib/python3.6/site-packages/PIL/PcdImagePlugin.py',
   'PYMODULE'),
  ('PIL.DdsImagePlugin',
   '/Library/Frameworks/Python.framework/Versions/3.6/lib/python3.6/site-packages/PIL/DdsImagePlugin.py',
   'PYMODULE'),
  ('PIL.BufrStubImagePlugin',
   '/Library/Frameworks/Python.framework/Versions/3.6/lib/python3.6/site-packages/PIL/BufrStubImagePlugin.py',
   'PYMODULE'),
  ('PIL.DcxImagePlugin',
   '/Library/Frameworks/Python.framework/Versions/3.6/lib/python3.6/site-packages/PIL/DcxImagePlugin.py',
   'PYMODULE'),
  ('PIL.McIdasImagePlugin',
   '/Library/Frameworks/Python.framework/Versions/3.6/lib/python3.6/site-packages/PIL/McIdasImagePlugin.py',
   'PYMODULE'),
  ('PIL.Hdf5StubImagePlugin',
   '/Library/Frameworks/Python.framework/Versions/3.6/lib/python3.6/site-packages/PIL/Hdf5StubImagePlugin.py',
   'PYMODULE'),
  ('PIL.BlpImagePlugin',
   '/Library/Frameworks/Python.framework/Versions/3.6/lib/python3.6/site-packages/PIL/BlpImagePlugin.py',
   'PYMODULE'),
  ('PIL.EpsImagePlugin',
   '/Library/Frameworks/Python.framework/Versions/3.6/lib/python3.6/site-packages/PIL/EpsImagePlugin.py',
   'PYMODULE'),
  ('PIL.XbmImagePlugin',
   '/Library/Frameworks/Python.framework/Versions/3.6/lib/python3.6/site-packages/PIL/XbmImagePlugin.py',
   'PYMODULE'),
  ('PIL.SgiImagePlugin',
   '/Library/Frameworks/Python.framework/Versions/3.6/lib/python3.6/site-packages/PIL/SgiImagePlugin.py',
   'PYMODULE'),
  ('PIL.SpiderImagePlugin',
   '/Library/Frameworks/Python.framework/Versions/3.6/lib/python3.6/site-packages/PIL/SpiderImagePlugin.py',
   'PYMODULE'),
  ('PIL.ImageTk',
   '/Library/Frameworks/Python.framework/Versions/3.6/lib/python3.6/site-packages/PIL/ImageTk.py',
   'PYMODULE'),
  ('tkinter',
   '/Library/Frameworks/Python.framework/Versions/3.6/lib/python3.6/tkinter/__init__.py',
   'PYMODULE'),
  ('tkinter.constants',
   '/Library/Frameworks/Python.framework/Versions/3.6/lib/python3.6/tkinter/constants.py',
   'PYMODULE'),
  ('PIL.FitsStubImagePlugin',
   '/Library/Frameworks/Python.framework/Versions/3.6/lib/python3.6/site-packages/PIL/FitsStubImagePlugin.py',
   'PYMODULE'),
  ('PIL.MspImagePlugin',
   '/Library/Frameworks/Python.framework/Versions/3.6/lib/python3.6/site-packages/PIL/MspImagePlugin.py',
   'PYMODULE'),
  ('PIL.MpegImagePlugin',
   '/Library/Frameworks/Python.framework/Versions/3.6/lib/python3.6/site-packages/PIL/MpegImagePlugin.py',
   'PYMODULE'),
  ('PIL.IcoImagePlugin',
   '/Library/Frameworks/Python.framework/Versions/3.6/lib/python3.6/site-packages/PIL/IcoImagePlugin.py',
   'PYMODULE'),
  ('PIL.FpxImagePlugin',
   '/Library/Frameworks/Python.framework/Versions/3.6/lib/python3.6/site-packages/PIL/FpxImagePlugin.py',
   'PYMODULE'),
  ('PIL.SunImagePlugin',
   '/Library/Frameworks/Python.framework/Versions/3.6/lib/python3.6/site-packages/PIL/SunImagePlugin.py',
   'PYMODULE'),
  ('PIL.TiffImagePlugin',
   '/Library/Frameworks/Python.framework/Versions/3.6/lib/python3.6/site-packages/PIL/TiffImagePlugin.py',
   'PYMODULE'),
  ('PIL.ImageOps',
   '/Library/Frameworks/Python.framework/Versions/3.6/lib/python3.6/site-packages/PIL/ImageOps.py',
   'PYMODULE'),
  ('fractions',
   '/Library/Frameworks/Python.framework/Versions/3.6/lib/python3.6/fractions.py',
   'PYMODULE'),
  ('PIL.ImageShow',
   '/Library/Frameworks/Python.framework/Versions/3.6/lib/python3.6/site-packages/PIL/ImageShow.py',
   'PYMODULE'),
  ('PIL.ImageQt',
   '/Library/Frameworks/Python.framework/Versions/3.6/lib/python3.6/site-packages/PIL/ImageQt.py',
   'PYMODULE'),
  ('PIL.ImageColor',
   '/Library/Frameworks/Python.framework/Versions/3.6/lib/python3.6/site-packages/PIL/ImageColor.py',
   'PYMODULE'),
  ('colorsys',
   '/Library/Frameworks/Python.framework/Versions/3.6/lib/python3.6/colorsys.py',
   'PYMODULE'),
  ('PIL.PyAccess',
   '/Library/Frameworks/Python.framework/Versions/3.6/lib/python3.6/site-packages/PIL/PyAccess.py',
   'PYMODULE'),
  ('PIL.ImagePalette',
   '/Library/Frameworks/Python.framework/Versions/3.6/lib/python3.6/site-packages/PIL/ImagePalette.py',
   'PYMODULE'),
  ('PIL.PaletteFile',
   '/Library/Frameworks/Python.framework/Versions/3.6/lib/python3.6/site-packages/PIL/PaletteFile.py',
   'PYMODULE'),
  ('PIL.GimpPaletteFile',
   '/Library/Frameworks/Python.framework/Versions/3.6/lib/python3.6/site-packages/PIL/GimpPaletteFile.py',
   'PYMODULE'),
  ('PIL.GimpGradientFile',
   '/Library/Frameworks/Python.framework/Versions/3.6/lib/python3.6/site-packages/PIL/GimpGradientFile.py',
   'PYMODULE'),
  ('PIL.PngImagePlugin',
   '/Library/Frameworks/Python.framework/Versions/3.6/lib/python3.6/site-packages/PIL/PngImagePlugin.py',
   'PYMODULE'),
  ('PIL.ImageChops',
   '/Library/Frameworks/Python.framework/Versions/3.6/lib/python3.6/site-packages/PIL/ImageChops.py',
   'PYMODULE'),
  ('PIL.PpmImagePlugin',
   '/Library/Frameworks/Python.framework/Versions/3.6/lib/python3.6/site-packages/PIL/PpmImagePlugin.py',
   'PYMODULE'),
  ('PIL.JpegImagePlugin',
   '/Library/Frameworks/Python.framework/Versions/3.6/lib/python3.6/site-packages/PIL/JpegImagePlugin.py',
   'PYMODULE'),
  ('PIL.JpegPresets',
   '/Library/Frameworks/Python.framework/Versions/3.6/lib/python3.6/site-packages/PIL/JpegPresets.py',
   'PYMODULE'),
  ('PIL.GifImagePlugin',
   '/Library/Frameworks/Python.framework/Versions/3.6/lib/python3.6/site-packages/PIL/GifImagePlugin.py',
   'PYMODULE'),
  ('PIL.BmpImagePlugin',
   '/Library/Frameworks/Python.framework/Versions/3.6/lib/python3.6/site-packages/PIL/BmpImagePlugin.py',
   'PYMODULE'),
  ('PIL._util',
   '/Library/Frameworks/Python.framework/Versions/3.6/lib/python3.6/site-packages/PIL/_util.py',
   'PYMODULE'),
  ('PIL._binary',
   '/Library/Frameworks/Python.framework/Versions/3.6/lib/python3.6/site-packages/PIL/_binary.py',
   'PYMODULE'),
  ('PIL.TiffTags',
   '/Library/Frameworks/Python.framework/Versions/3.6/lib/python3.6/site-packages/PIL/TiffTags.py',
   'PYMODULE'),
  ('PIL.ImageMode',
   '/Library/Frameworks/Python.framework/Versions/3.6/lib/python3.6/site-packages/PIL/ImageMode.py',
   'PYMODULE'),
  ('pathlib',
   '/Library/Frameworks/Python.framework/Versions/3.6/lib/python3.6/pathlib.py',
   'PYMODULE'),
  ('PIL',
   '/Library/Frameworks/Python.framework/Versions/3.6/lib/python3.6/site-packages/PIL/__init__.py',
   'PYMODULE'),
  ('PIL._version',
   '/Library/Frameworks/Python.framework/Versions/3.6/lib/python3.6/site-packages/PIL/_version.py',
   'PYMODULE'),
  ('threading',
   '/Library/Frameworks/Python.framework/Versions/3.6/lib/python3.6/threading.py',
   'PYMODULE'),
  ('_threading_local',
   '/Library/Frameworks/Python.framework/Versions/3.6/lib/python3.6/_threading_local.py',
   'PYMODULE'),
  ('kafka',
   '/Library/Frameworks/Python.framework/Versions/3.6/lib/python3.6/site-packages/kafka/__init__.py',
   'PYMODULE'),
  ('kafka.structs',
   '/Library/Frameworks/Python.framework/Versions/3.6/lib/python3.6/site-packages/kafka/structs.py',
   'PYMODULE'),
  ('kafka.serializer',
   '/Library/Frameworks/Python.framework/Versions/3.6/lib/python3.6/site-packages/kafka/serializer/__init__.py',
   'PYMODULE'),
  ('kafka.serializer.abstract',
   '/Library/Frameworks/Python.framework/Versions/3.6/lib/python3.6/site-packages/kafka/serializer/abstract.py',
   'PYMODULE'),
  ('kafka.conn',
   '/Library/Frameworks/Python.framework/Versions/3.6/lib/python3.6/site-packages/kafka/conn.py',
   'PYMODULE'),
  ('kafka.scram',
   '/Library/Frameworks/Python.framework/Versions/3.6/lib/python3.6/site-packages/kafka/scram.py',
   'PYMODULE'),
  ('kafka.protocol.types',
   '/Library/Frameworks/Python.framework/Versions/3.6/lib/python3.6/site-packages/kafka/protocol/types.py',
   'PYMODULE'),
  ('kafka.protocol',
   '/Library/Frameworks/Python.framework/Versions/3.6/lib/python3.6/site-packages/kafka/protocol/__init__.py',
   'PYMODULE'),
  ('kafka.protocol.abstract',
   '/Library/Frameworks/Python.framework/Versions/3.6/lib/python3.6/site-packages/kafka/protocol/abstract.py',
   'PYMODULE'),
  ('kafka.protocol.parser',
   '/Library/Frameworks/Python.framework/Versions/3.6/lib/python3.6/site-packages/kafka/protocol/parser.py',
   'PYMODULE'),
  ('kafka.protocol.frame',
   '/Library/Frameworks/Python.framework/Versions/3.6/lib/python3.6/site-packages/kafka/protocol/frame.py',
   'PYMODULE'),
  ('kafka.protocol.api',
   '/Library/Frameworks/Python.framework/Versions/3.6/lib/python3.6/site-packages/kafka/protocol/api.py',
   'PYMODULE'),
  ('kafka.protocol.struct',
   '/Library/Frameworks/Python.framework/Versions/3.6/lib/python3.6/site-packages/kafka/protocol/struct.py',
   'PYMODULE'),
  ('kafka.util',
   '/Library/Frameworks/Python.framework/Versions/3.6/lib/python3.6/site-packages/kafka/util.py',
   'PYMODULE'),
  ('kafka.protocol.fetch',
   '/Library/Frameworks/Python.framework/Versions/3.6/lib/python3.6/site-packages/kafka/protocol/fetch.py',
   'PYMODULE'),
  ('kafka.protocol.metadata',
   '/Library/Frameworks/Python.framework/Versions/3.6/lib/python3.6/site-packages/kafka/protocol/metadata.py',
   'PYMODULE'),
  ('kafka.protocol.produce',
   '/Library/Frameworks/Python.framework/Versions/3.6/lib/python3.6/site-packages/kafka/protocol/produce.py',
   'PYMODULE'),
  ('kafka.protocol.offset',
   '/Library/Frameworks/Python.framework/Versions/3.6/lib/python3.6/site-packages/kafka/protocol/offset.py',
   'PYMODULE'),
  ('kafka.protocol.commit',
   '/Library/Frameworks/Python.framework/Versions/3.6/lib/python3.6/site-packages/kafka/protocol/commit.py',
   'PYMODULE'),
  ('kafka.protocol.admin',
   '/Library/Frameworks/Python.framework/Versions/3.6/lib/python3.6/site-packages/kafka/protocol/admin.py',
   'PYMODULE'),
  ('kafka.oauth.abstract',
   '/Library/Frameworks/Python.framework/Versions/3.6/lib/python3.6/site-packages/kafka/oauth/abstract.py',
   'PYMODULE'),
  ('kafka.oauth',
   '/Library/Frameworks/Python.framework/Versions/3.6/lib/python3.6/site-packages/kafka/oauth/__init__.py',
   'PYMODULE'),
  ('kafka.metrics.stats',
   '/Library/Frameworks/Python.framework/Versions/3.6/lib/python3.6/site-packages/kafka/metrics/stats/__init__.py',
   'PYMODULE'),
  ('kafka.metrics.stats.total',
   '/Library/Frameworks/Python.framework/Versions/3.6/lib/python3.6/site-packages/kafka/metrics/stats/total.py',
   'PYMODULE'),
  ('kafka.metrics.measurable_stat',
   '/Library/Frameworks/Python.framework/Versions/3.6/lib/python3.6/site-packages/kafka/metrics/measurable_stat.py',
   'PYMODULE'),
  ('kafka.metrics.stat',
   '/Library/Frameworks/Python.framework/Versions/3.6/lib/python3.6/site-packages/kafka/metrics/stat.py',
   'PYMODULE'),
  ('kafka.metrics.measurable',
   '/Library/Frameworks/Python.framework/Versions/3.6/lib/python3.6/site-packages/kafka/metrics/measurable.py',
   'PYMODULE'),
  ('kafka.metrics.stats.sensor',
   '/Library/Frameworks/Python.framework/Versions/3.6/lib/python3.6/site-packages/kafka/metrics/stats/sensor.py',
   'PYMODULE'),
  ('kafka.metrics.stats.rate',
   '/Library/Frameworks/Python.framework/Versions/3.6/lib/python3.6/site-packages/kafka/metrics/stats/rate.py',
   'PYMODULE'),
  ('kafka.metrics.stats.sampled_stat',
   '/Library/Frameworks/Python.framework/Versions/3.6/lib/python3.6/site-packages/kafka/metrics/stats/sampled_stat.py',
   'PYMODULE'),
  ('kafka.metrics.stats.percentiles',
   '/Library/Frameworks/Python.framework/Versions/3.6/lib/python3.6/site-packages/kafka/metrics/stats/percentiles.py',
   'PYMODULE'),
  ('kafka.metrics.compound_stat',
   '/Library/Frameworks/Python.framework/Versions/3.6/lib/python3.6/site-packages/kafka/metrics/compound_stat.py',
   'PYMODULE'),
  ('kafka.metrics.stats.percentile',
   '/Library/Frameworks/Python.framework/Versions/3.6/lib/python3.6/site-packages/kafka/metrics/stats/percentile.py',
   'PYMODULE'),
  ('kafka.metrics.stats.min_stat',
   '/Library/Frameworks/Python.framework/Versions/3.6/lib/python3.6/site-packages/kafka/metrics/stats/min_stat.py',
   'PYMODULE'),
  ('kafka.metrics.stats.max_stat',
   '/Library/Frameworks/Python.framework/Versions/3.6/lib/python3.6/site-packages/kafka/metrics/stats/max_stat.py',
   'PYMODULE'),
  ('kafka.metrics.stats.histogram',
   '/Library/Frameworks/Python.framework/Versions/3.6/lib/python3.6/site-packages/kafka/metrics/stats/histogram.py',
   'PYMODULE'),
  ('kafka.metrics.stats.count',
   '/Library/Frameworks/Python.framework/Versions/3.6/lib/python3.6/site-packages/kafka/metrics/stats/count.py',
   'PYMODULE'),
  ('kafka.metrics.stats.avg',
   '/Library/Frameworks/Python.framework/Versions/3.6/lib/python3.6/site-packages/kafka/metrics/stats/avg.py',
   'PYMODULE'),
  ('kafka.metrics',
   '/Library/Frameworks/Python.framework/Versions/3.6/lib/python3.6/site-packages/kafka/metrics/__init__.py',
   'PYMODULE'),
  ('kafka.metrics.quota',
   '/Library/Frameworks/Python.framework/Versions/3.6/lib/python3.6/site-packages/kafka/metrics/quota.py',
   'PYMODULE'),
  ('kafka.metrics.metrics',
   '/Library/Frameworks/Python.framework/Versions/3.6/lib/python3.6/site-packages/kafka/metrics/metrics.py',
   'PYMODULE'),
  ('kafka.metrics.metric_name',
   '/Library/Frameworks/Python.framework/Versions/3.6/lib/python3.6/site-packages/kafka/metrics/metric_name.py',
   'PYMODULE'),
  ('kafka.metrics.metric_config',
   '/Library/Frameworks/Python.framework/Versions/3.6/lib/python3.6/site-packages/kafka/metrics/metric_config.py',
   'PYMODULE'),
  ('kafka.metrics.kafka_metric',
   '/Library/Frameworks/Python.framework/Versions/3.6/lib/python3.6/site-packages/kafka/metrics/kafka_metric.py',
   'PYMODULE'),
  ('kafka.metrics.dict_reporter',
   '/Library/Frameworks/Python.framework/Versions/3.6/lib/python3.6/site-packages/kafka/metrics/dict_reporter.py',
   'PYMODULE'),
  ('kafka.metrics.metrics_reporter',
   '/Library/Frameworks/Python.framework/Versions/3.6/lib/python3.6/site-packages/kafka/metrics/metrics_reporter.py',
   'PYMODULE'),
  ('kafka.future',
   '/Library/Frameworks/Python.framework/Versions/3.6/lib/python3.6/site-packages/kafka/future.py',
   'PYMODULE'),
  ('kafka.errors',
   '/Library/Frameworks/Python.framework/Versions/3.6/lib/python3.6/site-packages/kafka/errors.py',
   'PYMODULE'),
  ('kafka.vendor.six',
   '/Library/Frameworks/Python.framework/Versions/3.6/lib/python3.6/site-packages/kafka/vendor/six.py',
   'PYMODULE'),
  ('kafka.vendor.selectors34',
   '/Library/Frameworks/Python.framework/Versions/3.6/lib/python3.6/site-packages/kafka/vendor/selectors34.py',
   'PYMODULE'),
  ('kafka.vendor',
   '/Library/Frameworks/Python.framework/Versions/3.6/lib/python3.6/site-packages/kafka/vendor/__init__.py',
   'PYMODULE'),
  ('kafka.vendor.socketpair',
   '/Library/Frameworks/Python.framework/Versions/3.6/lib/python3.6/site-packages/kafka/vendor/socketpair.py',
   'PYMODULE'),
  ('kafka.producer',
   '/Library/Frameworks/Python.framework/Versions/3.6/lib/python3.6/site-packages/kafka/producer/__init__.py',
   'PYMODULE'),
  ('kafka.producer.kafka',
   '/Library/Frameworks/Python.framework/Versions/3.6/lib/python3.6/site-packages/kafka/producer/kafka.py',
   'PYMODULE'),
  ('kafka.record.legacy_records',
   '/Library/Frameworks/Python.framework/Versions/3.6/lib/python3.6/site-packages/kafka/record/legacy_records.py',
   'PYMODULE'),
  ('kafka.record',
   '/Library/Frameworks/Python.framework/Versions/3.6/lib/python3.6/site-packages/kafka/record/__init__.py',
   'PYMODULE'),
  ('kafka.record.memory_records',
   '/Library/Frameworks/Python.framework/Versions/3.6/lib/python3.6/site-packages/kafka/record/memory_records.py',
   'PYMODULE'),
  ('kafka.record.util',
   '/Library/Frameworks/Python.framework/Versions/3.6/lib/python3.6/site-packages/kafka/record/util.py',
   'PYMODULE'),
  ('kafka.record._crc32c',
   '/Library/Frameworks/Python.framework/Versions/3.6/lib/python3.6/site-packages/kafka/record/_crc32c.py',
   'PYMODULE'),
  ('kafka.record.abc',
   '/Library/Frameworks/Python.framework/Versions/3.6/lib/python3.6/site-packages/kafka/record/abc.py',
   'PYMODULE'),
  ('kafka.record.default_records',
   '/Library/Frameworks/Python.framework/Versions/3.6/lib/python3.6/site-packages/kafka/record/default_records.py',
   'PYMODULE'),
  ('kafka.producer.sender',
   '/Library/Frameworks/Python.framework/Versions/3.6/lib/python3.6/site-packages/kafka/producer/sender.py',
   'PYMODULE'),
  ('kafka.producer.record_accumulator',
   '/Library/Frameworks/Python.framework/Versions/3.6/lib/python3.6/site-packages/kafka/producer/record_accumulator.py',
   'PYMODULE'),
  ('kafka.producer.buffer',
   '/Library/Frameworks/Python.framework/Versions/3.6/lib/python3.6/site-packages/kafka/producer/buffer.py',
   'PYMODULE'),
  ('kafka.producer.future',
   '/Library/Frameworks/Python.framework/Versions/3.6/lib/python3.6/site-packages/kafka/producer/future.py',
   'PYMODULE'),
  ('kafka.partitioner.default',
   '/Library/Frameworks/Python.framework/Versions/3.6/lib/python3.6/site-packages/kafka/partitioner/default.py',
   'PYMODULE'),
  ('kafka.partitioner',
   '/Library/Frameworks/Python.framework/Versions/3.6/lib/python3.6/site-packages/kafka/partitioner/__init__.py',
   'PYMODULE'),
  ('kafka.codec',
   '/Library/Frameworks/Python.framework/Versions/3.6/lib/python3.6/site-packages/kafka/codec.py',
   'PYMODULE'),
  ('kafka.consumer.subscription_state',
   '/Library/Frameworks/Python.framework/Versions/3.6/lib/python3.6/site-packages/kafka/consumer/subscription_state.py',
   'PYMODULE'),
  ('kafka.consumer',
   '/Library/Frameworks/Python.framework/Versions/3.6/lib/python3.6/site-packages/kafka/consumer/__init__.py',
   'PYMODULE'),
  ('kafka.consumer.group',
   '/Library/Frameworks/Python.framework/Versions/3.6/lib/python3.6/site-packages/kafka/consumer/group.py',
   'PYMODULE'),
  ('kafka.coordinator.assignors.roundrobin',
   '/Library/Frameworks/Python.framework/Versions/3.6/lib/python3.6/site-packages/kafka/coordinator/assignors/roundrobin.py',
   'PYMODULE'),
  ('kafka.coordinator.assignors',
   '/Library/Frameworks/Python.framework/Versions/3.6/lib/python3.6/site-packages/kafka/coordinator/assignors/__init__.py',
   'PYMODULE'),
  ('kafka.coordinator',
   '/Library/Frameworks/Python.framework/Versions/3.6/lib/python3.6/site-packages/kafka/coordinator/__init__.py',
   'PYMODULE'),
  ('kafka.coordinator.protocol',
   '/Library/Frameworks/Python.framework/Versions/3.6/lib/python3.6/site-packages/kafka/coordinator/protocol.py',
   'PYMODULE'),
  ('kafka.coordinator.assignors.abstract',
   '/Library/Frameworks/Python.framework/Versions/3.6/lib/python3.6/site-packages/kafka/coordinator/assignors/abstract.py',
   'PYMODULE'),
  ('kafka.coordinator.assignors.range',
   '/Library/Frameworks/Python.framework/Versions/3.6/lib/python3.6/site-packages/kafka/coordinator/assignors/range.py',
   'PYMODULE'),
  ('kafka.coordinator.consumer',
   '/Library/Frameworks/Python.framework/Versions/3.6/lib/python3.6/site-packages/kafka/coordinator/consumer.py',
   'PYMODULE'),
  ('kafka.coordinator.assignors.sticky.sticky_assignor',
   '/Library/Frameworks/Python.framework/Versions/3.6/lib/python3.6/site-packages/kafka/coordinator/assignors/sticky/sticky_assignor.py',
   'PYMODULE'),
  ('kafka.coordinator.assignors.sticky',
   '/Library/Frameworks/Python.framework/Versions/3.6/lib/python3.6/site-packages/kafka/coordinator/assignors/sticky/__init__.py',
   'PYMODULE'),
  ('kafka.coordinator.assignors.sticky.sorted_set',
   '/Library/Frameworks/Python.framework/Versions/3.6/lib/python3.6/site-packages/kafka/coordinator/assignors/sticky/sorted_set.py',
   'PYMODULE'),
  ('kafka.coordinator.assignors.sticky.partition_movements',
   '/Library/Frameworks/Python.framework/Versions/3.6/lib/python3.6/site-packages/kafka/coordinator/assignors/sticky/partition_movements.py',
   'PYMODULE'),
  ('kafka.cluster',
   '/Library/Frameworks/Python.framework/Versions/3.6/lib/python3.6/site-packages/kafka/cluster.py',
   'PYMODULE'),
  ('kafka.coordinator.base',
   '/Library/Frameworks/Python.framework/Versions/3.6/lib/python3.6/site-packages/kafka/coordinator/base.py',
   'PYMODULE'),
  ('kafka.protocol.group',
   '/Library/Frameworks/Python.framework/Versions/3.6/lib/python3.6/site-packages/kafka/protocol/group.py',
   'PYMODULE'),
  ('kafka.coordinator.heartbeat',
   '/Library/Frameworks/Python.framework/Versions/3.6/lib/python3.6/site-packages/kafka/coordinator/heartbeat.py',
   'PYMODULE'),
  ('kafka.consumer.fetcher',
   '/Library/Frameworks/Python.framework/Versions/3.6/lib/python3.6/site-packages/kafka/consumer/fetcher.py',
   'PYMODULE'),
  ('kafka.client_async',
   '/Library/Frameworks/Python.framework/Versions/3.6/lib/python3.6/site-packages/kafka/client_async.py',
   'PYMODULE'),
  ('kafka.admin',
   '/Library/Frameworks/Python.framework/Versions/3.6/lib/python3.6/site-packages/kafka/admin/__init__.py',
   'PYMODULE'),
  ('kafka.admin.new_partitions',
   '/Library/Frameworks/Python.framework/Versions/3.6/lib/python3.6/site-packages/kafka/admin/new_partitions.py',
   'PYMODULE'),
  ('kafka.admin.new_topic',
   '/Library/Frameworks/Python.framework/Versions/3.6/lib/python3.6/site-packages/kafka/admin/new_topic.py',
   'PYMODULE'),
  ('kafka.admin.acl_resource',
   '/Library/Frameworks/Python.framework/Versions/3.6/lib/python3.6/site-packages/kafka/admin/acl_resource.py',
   'PYMODULE'),
  ('kafka.vendor.enum34',
   '/Library/Frameworks/Python.framework/Versions/3.6/lib/python3.6/site-packages/kafka/vendor/enum34.py',
   'PYMODULE'),
  ('kafka.admin.client',
   '/Library/Frameworks/Python.framework/Versions/3.6/lib/python3.6/site-packages/kafka/admin/client.py',
   'PYMODULE'),
  ('kafka.admin.config_resource',
   '/Library/Frameworks/Python.framework/Versions/3.6/lib/python3.6/site-packages/kafka/admin/config_resource.py',
   'PYMODULE'),
  ('kafka.version',
   '/Library/Frameworks/Python.framework/Versions/3.6/lib/python3.6/site-packages/kafka/version.py',
   'PYMODULE'),
  ('json',
   '/Library/Frameworks/Python.framework/Versions/3.6/lib/python3.6/json/__init__.py',
   'PYMODULE'),
  ('json.encoder',
   '/Library/Frameworks/Python.framework/Versions/3.6/lib/python3.6/json/encoder.py',
   'PYMODULE'),
  ('json.decoder',
   '/Library/Frameworks/Python.framework/Versions/3.6/lib/python3.6/json/decoder.py',
   'PYMODULE'),
  ('json.scanner',
   '/Library/Frameworks/Python.framework/Versions/3.6/lib/python3.6/json/scanner.py',
   'PYMODULE'),
  ('base64',
   '/Library/Frameworks/Python.framework/Versions/3.6/lib/python3.6/base64.py',
   'PYMODULE'),
  ('urllib.request',
   '/Library/Frameworks/Python.framework/Versions/3.6/lib/python3.6/urllib/request.py',
   'PYMODULE'),
  ('getpass',
   '/Library/Frameworks/Python.framework/Versions/3.6/lib/python3.6/getpass.py',
   'PYMODULE'),
  ('nturl2path',
   '/Library/Frameworks/Python.framework/Versions/3.6/lib/python3.6/nturl2path.py',
   'PYMODULE'),
  ('ftplib',
   '/Library/Frameworks/Python.framework/Versions/3.6/lib/python3.6/ftplib.py',
   'PYMODULE'),
  ('urllib.response',
   '/Library/Frameworks/Python.framework/Versions/3.6/lib/python3.6/urllib/response.py',
   'PYMODULE'),
  ('urllib.error',
   '/Library/Frameworks/Python.framework/Versions/3.6/lib/python3.6/urllib/error.py',
   'PYMODULE'),
  ('numpy',
   '/Library/Frameworks/Python.framework/Versions/3.6/lib/python3.6/site-packages/numpy/__init__.py',
   'PYMODULE'),
  ('numpy.core._dtype_ctypes',
   '/Library/Frameworks/Python.framework/Versions/3.6/lib/python3.6/site-packages/numpy/core/_dtype_ctypes.py',
   'PYMODULE'),
  ('numpy._pytesttester',
   '/Library/Frameworks/Python.framework/Versions/3.6/lib/python3.6/site-packages/numpy/_pytesttester.py',
   'PYMODULE'),
  ('numpy.testing',
   '/Library/Frameworks/Python.framework/Versions/3.6/lib/python3.6/site-packages/numpy/testing/__init__.py',
   'PYMODULE'),
  ('numpy.testing._private.nosetester',
   '/Library/Frameworks/Python.framework/Versions/3.6/lib/python3.6/site-packages/numpy/testing/_private/nosetester.py',
   'PYMODULE'),
  ('numpy.testing._private.noseclasses',
   '/Library/Frameworks/Python.framework/Versions/3.6/lib/python3.6/site-packages/numpy/testing/_private/noseclasses.py',
   'PYMODULE'),
  ('numpy.testing._private.decorators',
   '/Library/Frameworks/Python.framework/Versions/3.6/lib/python3.6/site-packages/numpy/testing/_private/decorators.py',
   'PYMODULE'),
  ('numpy.testing._private.parameterized',
   '/Library/Frameworks/Python.framework/Versions/3.6/lib/python3.6/site-packages/numpy/testing/_private/parameterized.py',
   'PYMODULE'),
  ('numpy.testing._private',
   '/Library/Frameworks/Python.framework/Versions/3.6/lib/python3.6/site-packages/numpy/testing/_private/__init__.py',
   'PYMODULE'),
  ('numpy.testing._private.utils',
   '/Library/Frameworks/Python.framework/Versions/3.6/lib/python3.6/site-packages/numpy/testing/_private/utils.py',
   'PYMODULE'),
  ('numpy.core.fromnumeric',
   '/Library/Frameworks/Python.framework/Versions/3.6/lib/python3.6/site-packages/numpy/core/fromnumeric.py',
   'PYMODULE'),
  ('numpy.core._methods',
   '/Library/Frameworks/Python.framework/Versions/3.6/lib/python3.6/site-packages/numpy/core/_methods.py',
   'PYMODULE'),
  ('numpy.core._exceptions',
   '/Library/Frameworks/Python.framework/Versions/3.6/lib/python3.6/site-packages/numpy/core/_exceptions.py',
   'PYMODULE'),
  ('numpy.core._asarray',
   '/Library/Frameworks/Python.framework/Versions/3.6/lib/python3.6/site-packages/numpy/core/_asarray.py',
   'PYMODULE'),
  ('numpy.core.umath',
   '/Library/Frameworks/Python.framework/Versions/3.6/lib/python3.6/site-packages/numpy/core/umath.py',
   'PYMODULE'),
  ('numpy.core.overrides',
   '/Library/Frameworks/Python.framework/Versions/3.6/lib/python3.6/site-packages/numpy/core/overrides.py',
   'PYMODULE'),
  ('numpy.compat._inspect',
   '/Library/Frameworks/Python.framework/Versions/3.6/lib/python3.6/site-packages/numpy/compat/_inspect.py',
   'PYMODULE'),
  ('numpy.core.multiarray',
   '/Library/Frameworks/Python.framework/Versions/3.6/lib/python3.6/site-packages/numpy/core/multiarray.py',
   'PYMODULE'),
  ('numpy.core.numerictypes',
   '/Library/Frameworks/Python.framework/Versions/3.6/lib/python3.6/site-packages/numpy/core/numerictypes.py',
   'PYMODULE'),
  ('numpy.core._dtype',
   '/Library/Frameworks/Python.framework/Versions/3.6/lib/python3.6/site-packages/numpy/core/_dtype.py',
   'PYMODULE'),
  ('numpy.core._type_aliases',
   '/Library/Frameworks/Python.framework/Versions/3.6/lib/python3.6/site-packages/numpy/core/_type_aliases.py',
   'PYMODULE'),
  ('numpy.core._string_helpers',
   '/Library/Frameworks/Python.framework/Versions/3.6/lib/python3.6/site-packages/numpy/core/_string_helpers.py',
   'PYMODULE'),
  ('numpy.matrixlib',
   '/Library/Frameworks/Python.framework/Versions/3.6/lib/python3.6/site-packages/numpy/matrixlib/__init__.py',
   'PYMODULE'),
  ('numpy.matrixlib.defmatrix',
   '/Library/Frameworks/Python.framework/Versions/3.6/lib/python3.6/site-packages/numpy/matrixlib/defmatrix.py',
   'PYMODULE'),
  ('numpy.dual',
   '/Library/Frameworks/Python.framework/Versions/3.6/lib/python3.6/site-packages/numpy/dual.py',
   'PYMODULE'),
  ('numpy.core.numeric',
   '/Library/Frameworks/Python.framework/Versions/3.6/lib/python3.6/site-packages/numpy/core/numeric.py',
   'PYMODULE'),
  ('numpy.core.arrayprint',
   '/Library/Frameworks/Python.framework/Versions/3.6/lib/python3.6/site-packages/numpy/core/arrayprint.py',
   'PYMODULE'),
  ('numpy.core._ufunc_config',
   '/Library/Frameworks/Python.framework/Versions/3.6/lib/python3.6/site-packages/numpy/core/_ufunc_config.py',
   'PYMODULE'),
  ('numpy.core.shape_base',
   '/Library/Frameworks/Python.framework/Versions/3.6/lib/python3.6/site-packages/numpy/core/shape_base.py',
   'PYMODULE'),
  ('numpy.ma',
   '/Library/Frameworks/Python.framework/Versions/3.6/lib/python3.6/site-packages/numpy/ma/__init__.py',
   'PYMODULE'),
  ('numpy.ma.extras',
   '/Library/Frameworks/Python.framework/Versions/3.6/lib/python3.6/site-packages/numpy/ma/extras.py',
   'PYMODULE'),
  ('numpy.lib.index_tricks',
   '/Library/Frameworks/Python.framework/Versions/3.6/lib/python3.6/site-packages/numpy/lib/index_tricks.py',
   'PYMODULE'),
  ('numpy.lib.stride_tricks',
   '/Library/Frameworks/Python.framework/Versions/3.6/lib/python3.6/site-packages/numpy/lib/stride_tricks.py',
   'PYMODULE'),
  ('numpy.lib.function_base',
   '/Library/Frameworks/Python.framework/Versions/3.6/lib/python3.6/site-packages/numpy/lib/function_base.py',
   'PYMODULE'),
  ('numpy.lib.histograms',
   '/Library/Frameworks/Python.framework/Versions/3.6/lib/python3.6/site-packages/numpy/lib/histograms.py',
   'PYMODULE'),
  ('numpy.lib.twodim_base',
   '/Library/Frameworks/Python.framework/Versions/3.6/lib/python3.6/site-packages/numpy/lib/twodim_base.py',
   'PYMODULE'),
  ('numpy.core.function_base',
   '/Library/Frameworks/Python.framework/Versions/3.6/lib/python3.6/site-packages/numpy/core/function_base.py',
   'PYMODULE'),
  ('numpy.ma.core',
   '/Library/Frameworks/Python.framework/Versions/3.6/lib/python3.6/site-packages/numpy/ma/core.py',
   'PYMODULE'),
  ('numpy.core._internal',
   '/Library/Frameworks/Python.framework/Versions/3.6/lib/python3.6/site-packages/numpy/core/_internal.py',
   'PYMODULE'),
  ('numpy.ctypeslib',
   '/Library/Frameworks/Python.framework/Versions/3.6/lib/python3.6/site-packages/numpy/ctypeslib.py',
   'PYMODULE'),
  ('numpy.random',
   '/Library/Frameworks/Python.framework/Versions/3.6/lib/python3.6/site-packages/numpy/random/__init__.py',
   'PYMODULE'),
  ('numpy.random._pickle',
   '/Library/Frameworks/Python.framework/Versions/3.6/lib/python3.6/site-packages/numpy/random/_pickle.py',
   'PYMODULE'),
  ('numpy.polynomial',
   '/Library/Frameworks/Python.framework/Versions/3.6/lib/python3.6/site-packages/numpy/polynomial/__init__.py',
   'PYMODULE'),
  ('numpy.polynomial.laguerre',
   '/Library/Frameworks/Python.framework/Versions/3.6/lib/python3.6/site-packages/numpy/polynomial/laguerre.py',
   'PYMODULE'),
  ('numpy.polynomial._polybase',
   '/Library/Frameworks/Python.framework/Versions/3.6/lib/python3.6/site-packages/numpy/polynomial/_polybase.py',
   'PYMODULE'),
  ('numpy.polynomial.hermite_e',
   '/Library/Frameworks/Python.framework/Versions/3.6/lib/python3.6/site-packages/numpy/polynomial/hermite_e.py',
   'PYMODULE'),
  ('numpy.polynomial.hermite',
   '/Library/Frameworks/Python.framework/Versions/3.6/lib/python3.6/site-packages/numpy/polynomial/hermite.py',
   'PYMODULE'),
  ('numpy.polynomial.legendre',
   '/Library/Frameworks/Python.framework/Versions/3.6/lib/python3.6/site-packages/numpy/polynomial/legendre.py',
   'PYMODULE'),
  ('numpy.polynomial.chebyshev',
   '/Library/Frameworks/Python.framework/Versions/3.6/lib/python3.6/site-packages/numpy/polynomial/chebyshev.py',
   'PYMODULE'),
  ('numpy.polynomial.polynomial',
   '/Library/Frameworks/Python.framework/Versions/3.6/lib/python3.6/site-packages/numpy/polynomial/polynomial.py',
   'PYMODULE'),
  ('numpy.polynomial.polyutils',
   '/Library/Frameworks/Python.framework/Versions/3.6/lib/python3.6/site-packages/numpy/polynomial/polyutils.py',
   'PYMODULE'),
  ('numpy.fft',
   '/Library/Frameworks/Python.framework/Versions/3.6/lib/python3.6/site-packages/numpy/fft/__init__.py',
   'PYMODULE'),
  ('numpy.fft.helper',
   '/Library/Frameworks/Python.framework/Versions/3.6/lib/python3.6/site-packages/numpy/fft/helper.py',
   'PYMODULE'),
  ('numpy.fft._pocketfft',
   '/Library/Frameworks/Python.framework/Versions/3.6/lib/python3.6/site-packages/numpy/fft/_pocketfft.py',
   'PYMODULE'),
  ('numpy.linalg',
   '/Library/Frameworks/Python.framework/Versions/3.6/lib/python3.6/site-packages/numpy/linalg/__init__.py',
   'PYMODULE'),
  ('numpy.linalg.linalg',
   '/Library/Frameworks/Python.framework/Versions/3.6/lib/python3.6/site-packages/numpy/linalg/linalg.py',
   'PYMODULE'),
  ('numpy.lib',
   '/Library/Frameworks/Python.framework/Versions/3.6/lib/python3.6/site-packages/numpy/lib/__init__.py',
   'PYMODULE'),
  ('numpy.lib._version',
   '/Library/Frameworks/Python.framework/Versions/3.6/lib/python3.6/site-packages/numpy/lib/_version.py',
   'PYMODULE'),
  ('numpy.lib.arraypad',
   '/Library/Frameworks/Python.framework/Versions/3.6/lib/python3.6/site-packages/numpy/lib/arraypad.py',
   'PYMODULE'),
  ('numpy.lib.arrayterator',
   '/Library/Frameworks/Python.framework/Versions/3.6/lib/python3.6/site-packages/numpy/lib/arrayterator.py',
   'PYMODULE'),
  ('numpy.lib.financial',
   '/Library/Frameworks/Python.framework/Versions/3.6/lib/python3.6/site-packages/numpy/lib/financial.py',
   'PYMODULE'),
  ('numpy.lib.npyio',
   '/Library/Frameworks/Python.framework/Versions/3.6/lib/python3.6/site-packages/numpy/lib/npyio.py',
   'PYMODULE'),
  ('numpy.ma.mrecords',
   '/Library/Frameworks/Python.framework/Versions/3.6/lib/python3.6/site-packages/numpy/ma/mrecords.py',
   'PYMODULE'),
  ('numpy.core.records',
   '/Library/Frameworks/Python.framework/Versions/3.6/lib/python3.6/site-packages/numpy/core/records.py',
   'PYMODULE'),
  ('numpy.lib._iotools',
   '/Library/Frameworks/Python.framework/Versions/3.6/lib/python3.6/site-packages/numpy/lib/_iotools.py',
   'PYMODULE'),
  ('numpy.lib._datasource',
   '/Library/Frameworks/Python.framework/Versions/3.6/lib/python3.6/site-packages/numpy/lib/_datasource.py',
   'PYMODULE'),
  ('numpy.lib.format',
   '/Library/Frameworks/Python.framework/Versions/3.6/lib/python3.6/site-packages/numpy/lib/format.py',
   'PYMODULE'),
  ('numpy.lib.arraysetops',
   '/Library/Frameworks/Python.framework/Versions/3.6/lib/python3.6/site-packages/numpy/lib/arraysetops.py',
   'PYMODULE'),
  ('numpy.lib.utils',
   '/Library/Frameworks/Python.framework/Versions/3.6/lib/python3.6/site-packages/numpy/lib/utils.py',
   'PYMODULE'),
  ('numpy.lib.polynomial',
   '/Library/Frameworks/Python.framework/Versions/3.6/lib/python3.6/site-packages/numpy/lib/polynomial.py',
   'PYMODULE'),
  ('numpy.lib.ufunclike',
   '/Library/Frameworks/Python.framework/Versions/3.6/lib/python3.6/site-packages/numpy/lib/ufunclike.py',
   'PYMODULE'),
  ('numpy.lib.shape_base',
   '/Library/Frameworks/Python.framework/Versions/3.6/lib/python3.6/site-packages/numpy/lib/shape_base.py',
   'PYMODULE'),
  ('numpy.lib.nanfunctions',
   '/Library/Frameworks/Python.framework/Versions/3.6/lib/python3.6/site-packages/numpy/lib/nanfunctions.py',
   'PYMODULE'),
  ('numpy.lib.type_check',
   '/Library/Frameworks/Python.framework/Versions/3.6/lib/python3.6/site-packages/numpy/lib/type_check.py',
   'PYMODULE'),
  ('numpy.core.getlimits',
   '/Library/Frameworks/Python.framework/Versions/3.6/lib/python3.6/site-packages/numpy/core/getlimits.py',
   'PYMODULE'),
  ('numpy.core.machar',
   '/Library/Frameworks/Python.framework/Versions/3.6/lib/python3.6/site-packages/numpy/core/machar.py',
   'PYMODULE'),
  ('numpy.lib.scimath',
   '/Library/Frameworks/Python.framework/Versions/3.6/lib/python3.6/site-packages/numpy/lib/scimath.py',
   'PYMODULE'),
  ('numpy.lib.mixins',
   '/Library/Frameworks/Python.framework/Versions/3.6/lib/python3.6/site-packages/numpy/lib/mixins.py',
   'PYMODULE'),
  ('numpy.compat',
   '/Library/Frameworks/Python.framework/Versions/3.6/lib/python3.6/site-packages/numpy/compat/__init__.py',
   'PYMODULE'),
  ('numpy.compat.py3k',
   '/Library/Frameworks/Python.framework/Versions/3.6/lib/python3.6/site-packages/numpy/compat/py3k.py',
   'PYMODULE'),
  ('numpy.core',
   '/Library/Frameworks/Python.framework/Versions/3.6/lib/python3.6/site-packages/numpy/core/__init__.py',
   'PYMODULE'),
  ('numpy.core._add_newdocs',
   '/Library/Frameworks/Python.framework/Versions/3.6/lib/python3.6/site-packages/numpy/core/_add_newdocs.py',
   'PYMODULE'),
  ('numpy.core.einsumfunc',
   '/Library/Frameworks/Python.framework/Versions/3.6/lib/python3.6/site-packages/numpy/core/einsumfunc.py',
   'PYMODULE'),
  ('numpy.core.memmap',
   '/Library/Frameworks/Python.framework/Versions/3.6/lib/python3.6/site-packages/numpy/core/memmap.py',
   'PYMODULE'),
  ('numpy.core.defchararray',
   '/Library/Frameworks/Python.framework/Versions/3.6/lib/python3.6/site-packages/numpy/core/defchararray.py',
   'PYMODULE'),
  ('numpy._distributor_init',
   '/Library/Frameworks/Python.framework/Versions/3.6/lib/python3.6/site-packages/numpy/_distributor_init.py',
   'PYMODULE'),
  ('numpy.version',
   '/Library/Frameworks/Python.framework/Versions/3.6/lib/python3.6/site-packages/numpy/version.py',
   'PYMODULE'),
  ('numpy.__config__',
   '/Library/Frameworks/Python.framework/Versions/3.6/lib/python3.6/site-packages/numpy/__config__.py',
   'PYMODULE'),
  ('numpy._globals',
   '/Library/Frameworks/Python.framework/Versions/3.6/lib/python3.6/site-packages/numpy/_globals.py',
   'PYMODULE'),
  ('cv2',
   '/Library/Frameworks/Python.framework/Versions/3.6/lib/python3.6/site-packages/cv2/__init__.py',
   'PYMODULE'),
  ('cv2.load_config_py3',
   '/Library/Frameworks/Python.framework/Versions/3.6/lib/python3.6/site-packages/cv2/load_config_py3.py',
   'PYMODULE'),
  ('cv2.load_config_py2',
   '/Library/Frameworks/Python.framework/Versions/3.6/lib/python3.6/site-packages/cv2/load_config_py2.py',
   'PYMODULE'),
  ('cv2.version',
   '/Library/Frameworks/Python.framework/Versions/3.6/lib/python3.6/site-packages/cv2/version.py',
   'PYMODULE'),
  ('cv2.data',
   '/Library/Frameworks/Python.framework/Versions/3.6/lib/python3.6/site-packages/cv2/data/__init__.py',
   'PYMODULE'),
  ('cv2.utils',
   '/Library/Frameworks/Python.framework/Versions/3.6/lib/python3.6/site-packages/cv2/utils/__init__.py',
   'PYMODULE'),
  ('cv2.misc',
   '/Library/Frameworks/Python.framework/Versions/3.6/lib/python3.6/site-packages/cv2/misc/__init__.py',
   'PYMODULE'),
  ('cv2.misc.version',
   '/Library/Frameworks/Python.framework/Versions/3.6/lib/python3.6/site-packages/cv2/misc/version.py',
   'PYMODULE'),
  ('cv2.gapi',
   '/Library/Frameworks/Python.framework/Versions/3.6/lib/python3.6/site-packages/cv2/gapi/__init__.py',
   'PYMODULE'),
  ('cv2.mat_wrapper',
   '/Library/Frameworks/Python.framework/Versions/3.6/lib/python3.6/site-packages/cv2/mat_wrapper/__init__.py',
   'PYMODULE'),
  ('urllib',
   '/Library/Frameworks/Python.framework/Versions/3.6/lib/python3.6/urllib/__init__.py',
   'PYMODULE')])
