('/Users/deepanshuvishwakarma/Downloads/cam_ser_macos/cam_service/build/app/app.pkg',
 {'BINARY': 1,
  'DATA': 1,
  'EXECUTABLE': 1,
  'EXTENSION': 1,
  'PYMODULE': 1,
  'PYSOURCE': 1,
  'PYZ': 0,
  'SPLASH': 1},
 [('PYZ-00.pyz',
   '/Users/deepanshuvishwakarma/Downloads/cam_ser_macos/cam_service/build/app/PYZ-00.pyz',
   'PYZ'),
  ('lib-dynload/_struct',
   '/Library/Frameworks/Python.framework/Versions/3.6/lib/python3.6/lib-dynload/_struct.cpython-36m-darwin.so',
   'EXTENSION'),
  ('lib-dynload/zlib',
   '/Library/Frameworks/Python.framework/Versions/3.6/lib/python3.6/lib-dynload/zlib.cpython-36m-darwin.so',
   'EXTENSION'),
  ('struct',
   '/Library/Frameworks/Python.framework/Versions/3.6/lib/python3.6/struct.pyo',
   'PYMODULE'),
  ('pyimod01_os_path',
   '/Library/Frameworks/Python.framework/Versions/3.6/lib/python3.6/site-packages/PyInstaller/loader/pyimod01_os_path.pyc',
   'PYMODULE'),
  ('pyimod02_archive',
   '/Library/Frameworks/Python.framework/Versions/3.6/lib/python3.6/site-packages/PyInstaller/loader/pyimod02_archive.pyc',
   'PYMODULE'),
  ('pyimod03_importers',
   '/Library/Frameworks/Python.framework/Versions/3.6/lib/python3.6/site-packages/PyInstaller/loader/pyimod03_importers.pyc',
   'PYMODULE'),
  ('pyimod04_ctypes',
   '/Library/Frameworks/Python.framework/Versions/3.6/lib/python3.6/site-packages/PyInstaller/loader/pyimod04_ctypes.pyc',
   'PYMODULE'),
  ('pyiboot01_bootstrap',
   '/Library/Frameworks/Python.framework/Versions/3.6/lib/python3.6/site-packages/PyInstaller/loader/pyiboot01_bootstrap.py',
   'PYSOURCE'),
  ('pyi_rth_subprocess',
   '/Library/Frameworks/Python.framework/Versions/3.6/lib/python3.6/site-packages/PyInstaller/hooks/rthooks/pyi_rth_subprocess.py',
   'PYSOURCE'),
  ('pyi_rth_pkgutil',
   '/Library/Frameworks/Python.framework/Versions/3.6/lib/python3.6/site-packages/PyInstaller/hooks/rthooks/pyi_rth_pkgutil.py',
   'PYSOURCE'),
  ('pyi_rth_inspect',
   '/Library/Frameworks/Python.framework/Versions/3.6/lib/python3.6/site-packages/PyInstaller/hooks/rthooks/pyi_rth_inspect.py',
   'PYSOURCE'),
  ('pyi_rth__tkinter',
   '/Library/Frameworks/Python.framework/Versions/3.6/lib/python3.6/site-packages/PyInstaller/hooks/rthooks/pyi_rth__tkinter.py',
   'PYSOURCE'),
  ('app',
   '/Users/deepanshuvishwakarma/Downloads/cam_ser_macos/cam_service/app.py',
   'PYSOURCE'),
  ('Python',
   '/Library/Frameworks/Python.framework/Versions/3.6/Python',
   'BINARY'),
  ('libgcc_s.1.dylib',
   '/Library/Frameworks/Python.framework/Versions/3.6/lib/python3.6/site-packages/numpy/.dylibs/libgcc_s.1.dylib',
   'BINARY'),
  ('libopenblas.0.dylib',
   '/Library/Frameworks/Python.framework/Versions/3.6/lib/python3.6/site-packages/numpy/.dylibs/libopenblas.0.dylib',
   'BINARY'),
  ('libgfortran.3.dylib',
   '/Library/Frameworks/Python.framework/Versions/3.6/lib/python3.6/site-packages/numpy/.dylibs/libgfortran.3.dylib',
   'BINARY'),
  ('libquadmath.0.dylib',
   '/Library/Frameworks/Python.framework/Versions/3.6/lib/python3.6/site-packages/numpy/.dylibs/libquadmath.0.dylib',
   'BINARY'),
  ('lib-dynload/math',
   '/Library/Frameworks/Python.framework/Versions/3.6/lib/python3.6/lib-dynload/math.cpython-36m-darwin.so',
   'EXTENSION'),
  ('lib-dynload/select',
   '/Library/Frameworks/Python.framework/Versions/3.6/lib/python3.6/lib-dynload/select.cpython-36m-darwin.so',
   'EXTENSION'),
  ('lib-dynload/_posixsubprocess',
   '/Library/Frameworks/Python.framework/Versions/3.6/lib/python3.6/lib-dynload/_posixsubprocess.cpython-36m-darwin.so',
   'EXTENSION'),
  ('lib-dynload/_datetime',
   '/Library/Frameworks/Python.framework/Versions/3.6/lib/python3.6/lib-dynload/_datetime.cpython-36m-darwin.so',
   'EXTENSION'),
  ('lib-dynload/resource',
   '/Library/Frameworks/Python.framework/Versions/3.6/lib/python3.6/lib-dynload/resource.cpython-36m-darwin.so',
   'EXTENSION'),
  ('lib-dynload/_opcode',
   '/Library/Frameworks/Python.framework/Versions/3.6/lib/python3.6/lib-dynload/_opcode.cpython-36m-darwin.so',
   'EXTENSION'),
  ('lib-dynload/_heapq',
   '/Library/Frameworks/Python.framework/Versions/3.6/lib/python3.6/lib-dynload/_heapq.cpython-36m-darwin.so',
   'EXTENSION'),
  ('lib-dynload/binascii',
   '/Library/Frameworks/Python.framework/Versions/3.6/lib/python3.6/lib-dynload/binascii.cpython-36m-darwin.so',
   'EXTENSION'),
  ('lib-dynload/_multibytecodec',
   '/Library/Frameworks/Python.framework/Versions/3.6/lib/python3.6/lib-dynload/_multibytecodec.cpython-36m-darwin.so',
   'EXTENSION'),
  ('lib-dynload/_codecs_iso2022',
   '/Library/Frameworks/Python.framework/Versions/3.6/lib/python3.6/lib-dynload/_codecs_iso2022.cpython-36m-darwin.so',
   'EXTENSION'),
  ('lib-dynload/_bz2',
   '/Library/Frameworks/Python.framework/Versions/3.6/lib/python3.6/lib-dynload/_bz2.cpython-36m-darwin.so',
   'EXTENSION'),
  ('lib-dynload/unicodedata',
   '/Library/Frameworks/Python.framework/Versions/3.6/lib/python3.6/lib-dynload/unicodedata.cpython-36m-darwin.so',
   'EXTENSION'),
  ('lib-dynload/_codecs_cn',
   '/Library/Frameworks/Python.framework/Versions/3.6/lib/python3.6/lib-dynload/_codecs_cn.cpython-36m-darwin.so',
   'EXTENSION'),
  ('lib-dynload/_codecs_jp',
   '/Library/Frameworks/Python.framework/Versions/3.6/lib/python3.6/lib-dynload/_codecs_jp.cpython-36m-darwin.so',
   'EXTENSION'),
  ('lib-dynload/_codecs_kr',
   '/Library/Frameworks/Python.framework/Versions/3.6/lib/python3.6/lib-dynload/_codecs_kr.cpython-36m-darwin.so',
   'EXTENSION'),
  ('lib-dynload/_codecs_tw',
   '/Library/Frameworks/Python.framework/Versions/3.6/lib/python3.6/lib-dynload/_codecs_tw.cpython-36m-darwin.so',
   'EXTENSION'),
  ('lib-dynload/_codecs_hk',
   '/Library/Frameworks/Python.framework/Versions/3.6/lib/python3.6/lib-dynload/_codecs_hk.cpython-36m-darwin.so',
   'EXTENSION'),
  ('lib-dynload/_socket',
   '/Library/Frameworks/Python.framework/Versions/3.6/lib/python3.6/lib-dynload/_socket.cpython-36m-darwin.so',
   'EXTENSION'),
  ('lib-dynload/grp',
   '/Library/Frameworks/Python.framework/Versions/3.6/lib/python3.6/lib-dynload/grp.cpython-36m-darwin.so',
   'EXTENSION'),
  ('lib-dynload/_lzma',
   '/Library/Frameworks/Python.framework/Versions/3.6/lib/python3.6/lib-dynload/_lzma.cpython-36m-darwin.so',
   'EXTENSION'),
  ('lib-dynload/_random',
   '/Library/Frameworks/Python.framework/Versions/3.6/lib/python3.6/lib-dynload/_random.cpython-36m-darwin.so',
   'EXTENSION'),
  ('lib-dynload/_bisect',
   '/Library/Frameworks/Python.framework/Versions/3.6/lib/python3.6/lib-dynload/_bisect.cpython-36m-darwin.so',
   'EXTENSION'),
  ('lib-dynload/_hashlib',
   '/Library/Frameworks/Python.framework/Versions/3.6/lib/python3.6/lib-dynload/_hashlib.cpython-36m-darwin.so',
   'EXTENSION'),
  ('lib-dynload/_sha3',
   '/Library/Frameworks/Python.framework/Versions/3.6/lib/python3.6/lib-dynload/_sha3.cpython-36m-darwin.so',
   'EXTENSION'),
  ('lib-dynload/_blake2',
   '/Library/Frameworks/Python.framework/Versions/3.6/lib/python3.6/lib-dynload/_blake2.cpython-36m-darwin.so',
   'EXTENSION'),
  ('lib-dynload/_sha512',
   '/Library/Frameworks/Python.framework/Versions/3.6/lib/python3.6/lib-dynload/_sha512.cpython-36m-darwin.so',
   'EXTENSION'),
  ('lib-dynload/_sha256',
   '/Library/Frameworks/Python.framework/Versions/3.6/lib/python3.6/lib-dynload/_sha256.cpython-36m-darwin.so',
   'EXTENSION'),
  ('lib-dynload/_md5',
   '/Library/Frameworks/Python.framework/Versions/3.6/lib/python3.6/lib-dynload/_md5.cpython-36m-darwin.so',
   'EXTENSION'),
  ('lib-dynload/_sha1',
   '/Library/Frameworks/Python.framework/Versions/3.6/lib/python3.6/lib-dynload/_sha1.cpython-36m-darwin.so',
   'EXTENSION'),
  ('lib-dynload/_ssl',
   '/Library/Frameworks/Python.framework/Versions/3.6/lib/python3.6/lib-dynload/_ssl.cpython-36m-darwin.so',
   'EXTENSION'),
  ('lib-dynload/termios',
   '/Library/Frameworks/Python.framework/Versions/3.6/lib/python3.6/lib-dynload/termios.cpython-36m-darwin.so',
   'EXTENSION'),
  ('lib-dynload/_scproxy',
   '/Library/Frameworks/Python.framework/Versions/3.6/lib/python3.6/lib-dynload/_scproxy.cpython-36m-darwin.so',
   'EXTENSION'),
  ('lib-dynload/pyexpat',
   '/Library/Frameworks/Python.framework/Versions/3.6/lib/python3.6/lib-dynload/pyexpat.cpython-36m-darwin.so',
   'EXTENSION'),
  ('lib-dynload/readline',
   '/Library/Frameworks/Python.framework/Versions/3.6/lib/python3.6/lib-dynload/readline.cpython-36m-darwin.so',
   'EXTENSION'),
  ('lib-dynload/_pickle',
   '/Library/Frameworks/Python.framework/Versions/3.6/lib/python3.6/lib-dynload/_pickle.cpython-36m-darwin.so',
   'EXTENSION'),
  ('bson._cbson',
   '/Library/Frameworks/Python.framework/Versions/3.6/lib/python3.6/site-packages/bson/_cbson.cpython-36m-darwin.so',
   'EXTENSION'),
  ('lib-dynload/mmap',
   '/Library/Frameworks/Python.framework/Versions/3.6/lib/python3.6/lib-dynload/mmap.cpython-36m-darwin.so',
   'EXTENSION'),
  ('lib-dynload/array',
   '/Library/Frameworks/Python.framework/Versions/3.6/lib/python3.6/lib-dynload/array.cpython-36m-darwin.so',
   'EXTENSION'),
  ('lib-dynload/_decimal',
   '/Library/Frameworks/Python.framework/Versions/3.6/lib/python3.6/lib-dynload/_decimal.cpython-36m-darwin.so',
   'EXTENSION'),
  ('lib-dynload/_ctypes',
   '/Library/Frameworks/Python.framework/Versions/3.6/lib/python3.6/lib-dynload/_ctypes.cpython-36m-darwin.so',
   'EXTENSION'),
  ('lib-dynload/fcntl',
   '/Library/Frameworks/Python.framework/Versions/3.6/lib/python3.6/lib-dynload/fcntl.cpython-36m-darwin.so',
   'EXTENSION'),
  ('pymongo._cmessage',
   '/Library/Frameworks/Python.framework/Versions/3.6/lib/python3.6/site-packages/pymongo/_cmessage.cpython-36m-darwin.so',
   'EXTENSION'),
  ('PIL._webp',
   '/Library/Frameworks/Python.framework/Versions/3.6/lib/python3.6/site-packages/PIL/_webp.cpython-36m-darwin.so',
   'EXTENSION'),
  ('PIL._imagingtk',
   '/Library/Frameworks/Python.framework/Versions/3.6/lib/python3.6/site-packages/PIL/_imagingtk.cpython-36m-darwin.so',
   'EXTENSION'),
  ('PIL._imaging',
   '/Library/Frameworks/Python.framework/Versions/3.6/lib/python3.6/site-packages/PIL/_imaging.cpython-36m-darwin.so',
   'EXTENSION'),
  ('PIL._imagingft',
   '/Library/Frameworks/Python.framework/Versions/3.6/lib/python3.6/site-packages/PIL/_imagingft.cpython-36m-darwin.so',
   'EXTENSION'),
  ('lib-dynload/_json',
   '/Library/Frameworks/Python.framework/Versions/3.6/lib/python3.6/lib-dynload/_json.cpython-36m-darwin.so',
   'EXTENSION'),
  ('numpy.core._multiarray_tests',
   '/Library/Frameworks/Python.framework/Versions/3.6/lib/python3.6/site-packages/numpy/core/_multiarray_tests.cpython-36m-darwin.so',
   'EXTENSION'),
  ('numpy.core._multiarray_umath',
   '/Library/Frameworks/Python.framework/Versions/3.6/lib/python3.6/site-packages/numpy/core/_multiarray_umath.cpython-36m-darwin.so',
   'EXTENSION'),
  ('numpy.linalg.lapack_lite',
   '/Library/Frameworks/Python.framework/Versions/3.6/lib/python3.6/site-packages/numpy/linalg/lapack_lite.cpython-36m-darwin.so',
   'EXTENSION'),
  ('numpy.random.mtrand',
   '/Library/Frameworks/Python.framework/Versions/3.6/lib/python3.6/site-packages/numpy/random/mtrand.cpython-36m-darwin.so',
   'EXTENSION'),
  ('numpy.random._sfc64',
   '/Library/Frameworks/Python.framework/Versions/3.6/lib/python3.6/site-packages/numpy/random/_sfc64.cpython-36m-darwin.so',
   'EXTENSION'),
  ('numpy.random._philox',
   '/Library/Frameworks/Python.framework/Versions/3.6/lib/python3.6/site-packages/numpy/random/_philox.cpython-36m-darwin.so',
   'EXTENSION'),
  ('numpy.random._pcg64',
   '/Library/Frameworks/Python.framework/Versions/3.6/lib/python3.6/site-packages/numpy/random/_pcg64.cpython-36m-darwin.so',
   'EXTENSION'),
  ('numpy.random._mt19937',
   '/Library/Frameworks/Python.framework/Versions/3.6/lib/python3.6/site-packages/numpy/random/_mt19937.cpython-36m-darwin.so',
   'EXTENSION'),
  ('numpy.random.bit_generator',
   '/Library/Frameworks/Python.framework/Versions/3.6/lib/python3.6/site-packages/numpy/random/bit_generator.cpython-36m-darwin.so',
   'EXTENSION'),
  ('numpy.random._generator',
   '/Library/Frameworks/Python.framework/Versions/3.6/lib/python3.6/site-packages/numpy/random/_generator.cpython-36m-darwin.so',
   'EXTENSION'),
  ('numpy.random._bounded_integers',
   '/Library/Frameworks/Python.framework/Versions/3.6/lib/python3.6/site-packages/numpy/random/_bounded_integers.cpython-36m-darwin.so',
   'EXTENSION'),
  ('numpy.random._common',
   '/Library/Frameworks/Python.framework/Versions/3.6/lib/python3.6/site-packages/numpy/random/_common.cpython-36m-darwin.so',
   'EXTENSION'),
  ('numpy.fft._pocketfft_internal',
   '/Library/Frameworks/Python.framework/Versions/3.6/lib/python3.6/site-packages/numpy/fft/_pocketfft_internal.cpython-36m-darwin.so',
   'EXTENSION'),
  ('numpy.linalg._umath_linalg',
   '/Library/Frameworks/Python.framework/Versions/3.6/lib/python3.6/site-packages/numpy/linalg/_umath_linalg.cpython-36m-darwin.so',
   'EXTENSION'),
  ('cv2.cv2',
   '/Library/Frameworks/Python.framework/Versions/3.6/lib/python3.6/site-packages/cv2/cv2.abi3.so',
   'EXTENSION'),
  ('lib-dynload/_tkinter',
   '/Library/Frameworks/Python.framework/Versions/3.6/lib/python3.6/lib-dynload/_tkinter.cpython-36m-darwin.so',
   'EXTENSION'),
  ('libcrypto.1.0.0.dylib',
   '/Library/Frameworks/Python.framework/Versions/3.6/lib/libcrypto.1.0.0.dylib',
   'BINARY'),
  ('libssl.1.0.0.dylib',
   '/Library/Frameworks/Python.framework/Versions/3.6/lib/libssl.1.0.0.dylib',
   'BINARY'),
  ('libncursesw.5.dylib',
   '/Library/Frameworks/Python.framework/Versions/3.6/lib/libncursesw.5.dylib',
   'BINARY'),
  ('libwebpmux.3.dylib',
   '/Library/Frameworks/Python.framework/Versions/3.6/lib/python3.6/site-packages/PIL/.dylibs/libwebpmux.3.dylib',
   'BINARY'),
  ('libwebp.7.dylib',
   '/Library/Frameworks/Python.framework/Versions/3.6/lib/python3.6/site-packages/PIL/.dylibs/libwebp.7.dylib',
   'BINARY'),
  ('libwebpdemux.2.dylib',
   '/Library/Frameworks/Python.framework/Versions/3.6/lib/python3.6/site-packages/PIL/.dylibs/libwebpdemux.2.dylib',
   'BINARY'),
  ('libjpeg.9.dylib',
   '/Library/Frameworks/Python.framework/Versions/3.6/lib/python3.6/site-packages/PIL/.dylibs/libjpeg.9.dylib',
   'BINARY'),
  ('libxcb.1.1.0.dylib',
   '/Library/Frameworks/Python.framework/Versions/3.6/lib/python3.6/site-packages/PIL/.dylibs/libxcb.1.1.0.dylib',
   'BINARY'),
  ('libtiff.5.dylib',
   '/Library/Frameworks/Python.framework/Versions/3.6/lib/python3.6/site-packages/PIL/.dylibs/libtiff.5.dylib',
   'BINARY'),
  ('libopenjp2.2.4.0.dylib',
   '/Library/Frameworks/Python.framework/Versions/3.6/lib/python3.6/site-packages/PIL/.dylibs/libopenjp2.2.4.0.dylib',
   'BINARY'),
  ('libz.1.2.11.dylib',
   '/Library/Frameworks/Python.framework/Versions/3.6/lib/python3.6/site-packages/PIL/.dylibs/libz.1.2.11.dylib',
   'BINARY'),
  ('libfreetype.6.dylib',
   '/Library/Frameworks/Python.framework/Versions/3.6/lib/python3.6/site-packages/PIL/.dylibs/libfreetype.6.dylib',
   'BINARY'),
  ('libharfbuzz.0.dylib',
   '/Library/Frameworks/Python.framework/Versions/3.6/lib/python3.6/site-packages/PIL/.dylibs/libharfbuzz.0.dylib',
   'BINARY'),
  ('libavformat.58.76.100.dylib',
   '/Library/Frameworks/Python.framework/Versions/3.6/lib/python3.6/site-packages/cv2/.dylibs/libavformat.58.76.100.dylib',
   'BINARY'),
  ('libavresample.4.0.0.dylib',
   '/Library/Frameworks/Python.framework/Versions/3.6/lib/python3.6/site-packages/cv2/.dylibs/libavresample.4.0.0.dylib',
   'BINARY'),
  ('libswscale.5.9.100.dylib',
   '/Library/Frameworks/Python.framework/Versions/3.6/lib/python3.6/site-packages/cv2/.dylibs/libswscale.5.9.100.dylib',
   'BINARY'),
  ('libavcodec.58.134.100.dylib',
   '/Library/Frameworks/Python.framework/Versions/3.6/lib/python3.6/site-packages/cv2/.dylibs/libavcodec.58.134.100.dylib',
   'BINARY'),
  ('libavutil.56.70.100.dylib',
   '/Library/Frameworks/Python.framework/Versions/3.6/lib/python3.6/site-packages/cv2/.dylibs/libavutil.56.70.100.dylib',
   'BINARY'),
  ('libtcl8.6.dylib',
   '/Library/Frameworks/Python.framework/Versions/3.6/lib/libtcl8.6.dylib',
   'BINARY'),
  ('libtk8.6.dylib',
   '/Library/Frameworks/Python.framework/Versions/3.6/lib/libtk8.6.dylib',
   'BINARY'),
  ('libXau.6.dylib',
   '/Library/Frameworks/Python.framework/Versions/3.6/lib/python3.6/site-packages/PIL/.dylibs/libXau.6.dylib',
   'BINARY'),
  ('liblzma.5.dylib',
   '/Library/Frameworks/Python.framework/Versions/3.6/lib/python3.6/site-packages/PIL/.dylibs/liblzma.5.dylib',
   'BINARY'),
  ('libpng16.16.dylib',
   '/Library/Frameworks/Python.framework/Versions/3.6/lib/python3.6/site-packages/PIL/.dylibs/libpng16.16.dylib',
   'BINARY'),
  ('libvorbisenc.2.dylib',
   '/Library/Frameworks/Python.framework/Versions/3.6/lib/python3.6/site-packages/cv2/.dylibs/libvorbisenc.2.dylib',
   'BINARY'),
  ('libogg.0.dylib',
   '/Library/Frameworks/Python.framework/Versions/3.6/lib/python3.6/site-packages/cv2/.dylibs/libogg.0.dylib',
   'BINARY'),
  ('libopencore-amrwb.0.dylib',
   '/Library/Frameworks/Python.framework/Versions/3.6/lib/python3.6/site-packages/cv2/.dylibs/libopencore-amrwb.0.dylib',
   'BINARY'),
  ('libjxl.0.6.1.dylib',
   '/Library/Frameworks/Python.framework/Versions/3.6/lib/python3.6/site-packages/cv2/.dylibs/libjxl.0.6.1.dylib',
   'BINARY'),
  ('libaom.3.2.0.dylib',
   '/Library/Frameworks/Python.framework/Versions/3.6/lib/python3.6/site-packages/cv2/.dylibs/libaom.3.2.0.dylib',
   'BINARY'),
  ('libvpx.7.dylib',
   '/Library/Frameworks/Python.framework/Versions/3.6/lib/python3.6/site-packages/cv2/.dylibs/libvpx.7.dylib',
   'BINARY'),
  ('libtheoradec.1.dylib',
   '/Library/Frameworks/Python.framework/Versions/3.6/lib/python3.6/site-packages/cv2/.dylibs/libtheoradec.1.dylib',
   'BINARY'),
  ('librav1e.0.5.1.dylib',
   '/Library/Frameworks/Python.framework/Versions/3.6/lib/python3.6/site-packages/cv2/.dylibs/librav1e.0.5.1.dylib',
   'BINARY'),
  ('libmp3lame.0.dylib',
   '/Library/Frameworks/Python.framework/Versions/3.6/lib/python3.6/site-packages/cv2/.dylibs/libmp3lame.0.dylib',
   'BINARY'),
  ('libopencore-amrnb.0.dylib',
   '/Library/Frameworks/Python.framework/Versions/3.6/lib/python3.6/site-packages/cv2/.dylibs/libopencore-amrnb.0.dylib',
   'BINARY'),
  ('libtheoraenc.1.dylib',
   '/Library/Frameworks/Python.framework/Versions/3.6/lib/python3.6/site-packages/cv2/.dylibs/libtheoraenc.1.dylib',
   'BINARY'),
  ('libswresample.3.9.100.dylib',
   '/Library/Frameworks/Python.framework/Versions/3.6/lib/python3.6/site-packages/cv2/.dylibs/libswresample.3.9.100.dylib',
   'BINARY'),
  ('libzmq.5.dylib',
   '/Library/Frameworks/Python.framework/Versions/3.6/lib/python3.6/site-packages/cv2/.dylibs/libzmq.5.dylib',
   'BINARY'),
  ('libvorbis.0.dylib',
   '/Library/Frameworks/Python.framework/Versions/3.6/lib/python3.6/site-packages/cv2/.dylibs/libvorbis.0.dylib',
   'BINARY'),
  ('libdav1d.5.dylib',
   '/Library/Frameworks/Python.framework/Versions/3.6/lib/python3.6/site-packages/cv2/.dylibs/libdav1d.5.dylib',
   'BINARY'),
  ('libsoxr.0.1.2.dylib',
   '/Library/Frameworks/Python.framework/Versions/3.6/lib/python3.6/site-packages/cv2/.dylibs/libsoxr.0.1.2.dylib',
   'BINARY'),
  ('libsrt.1.4.4.dylib',
   '/Library/Frameworks/Python.framework/Versions/3.6/lib/python3.6/site-packages/cv2/.dylibs/libsrt.1.4.4.dylib',
   'BINARY'),
  ('librist.4.dylib',
   '/Library/Frameworks/Python.framework/Versions/3.6/lib/python3.6/site-packages/cv2/.dylibs/librist.4.dylib',
   'BINARY'),
  ('libsnappy.1.1.9.dylib',
   '/Library/Frameworks/Python.framework/Versions/3.6/lib/python3.6/site-packages/cv2/.dylibs/libsnappy.1.1.9.dylib',
   'BINARY'),
  ('libgnutls.30.dylib',
   '/Library/Frameworks/Python.framework/Versions/3.6/lib/python3.6/site-packages/cv2/.dylibs/libgnutls.30.dylib',
   'BINARY'),
  ('libopus.0.dylib',
   '/Library/Frameworks/Python.framework/Versions/3.6/lib/python3.6/site-packages/cv2/.dylibs/libopus.0.dylib',
   'BINARY'),
  ('libspeex.1.dylib',
   '/Library/Frameworks/Python.framework/Versions/3.6/lib/python3.6/site-packages/cv2/.dylibs/libspeex.1.dylib',
   'BINARY'),
  ('libvmaf.1.dylib',
   '/Library/Frameworks/Python.framework/Versions/3.6/lib/python3.6/site-packages/cv2/.dylibs/libvmaf.1.dylib',
   'BINARY'),
  ('libbluray.2.dylib',
   '/Library/Frameworks/Python.framework/Versions/3.6/lib/python3.6/site-packages/cv2/.dylibs/libbluray.2.dylib',
   'BINARY'),
  ('libbrotlicommon.1.0.9.dylib',
   '/Library/Frameworks/Python.framework/Versions/3.6/lib/python3.6/site-packages/cv2/.dylibs/libbrotlicommon.1.0.9.dylib',
   'BINARY'),
  ('libbrotlidec.1.0.9.dylib',
   '/Library/Frameworks/Python.framework/Versions/3.6/lib/python3.6/site-packages/cv2/.dylibs/libbrotlidec.1.0.9.dylib',
   'BINARY'),
  ('libbrotlienc.1.0.9.dylib',
   '/Library/Frameworks/Python.framework/Versions/3.6/lib/python3.6/site-packages/cv2/.dylibs/libbrotlienc.1.0.9.dylib',
   'BINARY'),
  ('libsodium.23.dylib',
   '/Library/Frameworks/Python.framework/Versions/3.6/lib/python3.6/site-packages/cv2/.dylibs/libsodium.23.dylib',
   'BINARY'),
  ('libcrypto.1.1.dylib',
   '/Library/Frameworks/Python.framework/Versions/3.6/lib/python3.6/site-packages/cv2/.dylibs/libcrypto.1.1.dylib',
   'BINARY'),
  ('libssl.1.1.dylib',
   '/Library/Frameworks/Python.framework/Versions/3.6/lib/python3.6/site-packages/cv2/.dylibs/libssl.1.1.dylib',
   'BINARY'),
  ('libcjson.1.7.15.dylib',
   '/Library/Frameworks/Python.framework/Versions/3.6/lib/python3.6/site-packages/cv2/.dylibs/libcjson.1.7.15.dylib',
   'BINARY'),
  ('libmbedcrypto.3.1.0.dylib',
   '/Library/Frameworks/Python.framework/Versions/3.6/lib/python3.6/site-packages/cv2/.dylibs/libmbedcrypto.3.1.0.dylib',
   'BINARY'),
  ('libp11-kit.0.dylib',
   '/Library/Frameworks/Python.framework/Versions/3.6/lib/python3.6/site-packages/cv2/.dylibs/libp11-kit.0.dylib',
   'BINARY'),
  ('libhogweed.6.4.dylib',
   '/Library/Frameworks/Python.framework/Versions/3.6/lib/python3.6/site-packages/cv2/.dylibs/libhogweed.6.4.dylib',
   'BINARY'),
  ('libidn2.0.dylib',
   '/Library/Frameworks/Python.framework/Versions/3.6/lib/python3.6/site-packages/cv2/.dylibs/libidn2.0.dylib',
   'BINARY'),
  ('libintl.8.dylib',
   '/Library/Frameworks/Python.framework/Versions/3.6/lib/python3.6/site-packages/cv2/.dylibs/libintl.8.dylib',
   'BINARY'),
  ('libnettle.8.4.dylib',
   '/Library/Frameworks/Python.framework/Versions/3.6/lib/python3.6/site-packages/cv2/.dylibs/libnettle.8.4.dylib',
   'BINARY'),
  ('libgmp.10.dylib',
   '/Library/Frameworks/Python.framework/Versions/3.6/lib/python3.6/site-packages/cv2/.dylibs/libgmp.10.dylib',
   'BINARY'),
  ('libtasn1.6.dylib',
   '/Library/Frameworks/Python.framework/Versions/3.6/lib/python3.6/site-packages/cv2/.dylibs/libtasn1.6.dylib',
   'BINARY'),
  ('libunistring.2.dylib',
   '/Library/Frameworks/Python.framework/Versions/3.6/lib/python3.6/site-packages/cv2/.dylibs/libunistring.2.dylib',
   'BINARY'),
  ('libfontconfig.1.dylib',
   '/Library/Frameworks/Python.framework/Versions/3.6/lib/python3.6/site-packages/cv2/.dylibs/libfontconfig.1.dylib',
   'BINARY'),
  ('libffi.8.dylib',
   '/Library/Frameworks/Python.framework/Versions/3.6/lib/python3.6/site-packages/cv2/.dylibs/libffi.8.dylib',
   'BINARY'),
  ('base_library.zip',
   '/Users/deepanshuvishwakarma/Downloads/cam_ser_macos/cam_service/build/app/base_library.zip',
   'DATA'),
  ('tcl/encoding/cp855.enc',
   '/Library/Frameworks/Python.framework/Versions/3.6/lib/tcl8.6/encoding/cp855.enc',
   'DATA'),
  ('tcl/msgs/fr_be.msg',
   '/Library/Frameworks/Python.framework/Versions/3.6/lib/tcl8.6/msgs/fr_be.msg',
   'DATA'),
  ('tcl/encoding/iso8859-3.enc',
   '/Library/Frameworks/Python.framework/Versions/3.6/lib/tcl8.6/encoding/iso8859-3.enc',
   'DATA'),
  ('tcl/msgs/en_au.msg',
   '/Library/Frameworks/Python.framework/Versions/3.6/lib/tcl8.6/msgs/en_au.msg',
   'DATA'),
  ('tcl/msgs/es_gt.msg',
   '/Library/Frameworks/Python.framework/Versions/3.6/lib/tcl8.6/msgs/es_gt.msg',
   'DATA'),
  ('tcl/msgs/hi_in.msg',
   '/Library/Frameworks/Python.framework/Versions/3.6/lib/tcl8.6/msgs/hi_in.msg',
   'DATA'),
  ('tcl/msgs/nl_be.msg',
   '/Library/Frameworks/Python.framework/Versions/3.6/lib/tcl8.6/msgs/nl_be.msg',
   'DATA'),
  ('tcl/encoding/macTurkish.enc',
   '/Library/Frameworks/Python.framework/Versions/3.6/lib/tcl8.6/encoding/macTurkish.enc',
   'DATA'),
  ('tk/pkgIndex.tcl',
   '/Library/Frameworks/Python.framework/Versions/3.6/lib/tk8.6/pkgIndex.tcl',
   'DATA'),
  ('tcl/msgs/hr.msg',
   '/Library/Frameworks/Python.framework/Versions/3.6/lib/tcl8.6/msgs/hr.msg',
   'DATA'),
  ('tcl/msgs/gl_es.msg',
   '/Library/Frameworks/Python.framework/Versions/3.6/lib/tcl8.6/msgs/gl_es.msg',
   'DATA'),
  ('tcl/msgs/ta_in.msg',
   '/Library/Frameworks/Python.framework/Versions/3.6/lib/tcl8.6/msgs/ta_in.msg',
   'DATA'),
  ('tk/ttk/scrollbar.tcl',
   '/Library/Frameworks/Python.framework/Versions/3.6/lib/tk8.6/ttk/scrollbar.tcl',
   'DATA'),
  ('tcl/msgs/th.msg',
   '/Library/Frameworks/Python.framework/Versions/3.6/lib/tcl8.6/msgs/th.msg',
   'DATA'),
  ('tcl/msgs/fi.msg',
   '/Library/Frameworks/Python.framework/Versions/3.6/lib/tcl8.6/msgs/fi.msg',
   'DATA'),
  ('tcl/encoding/macIceland.enc',
   '/Library/Frameworks/Python.framework/Versions/3.6/lib/tcl8.6/encoding/macIceland.enc',
   'DATA'),
  ('tcl/msgs/id_id.msg',
   '/Library/Frameworks/Python.framework/Versions/3.6/lib/tcl8.6/msgs/id_id.msg',
   'DATA'),
  ('cv2/config.py',
   '/Library/Frameworks/Python.framework/Versions/3.6/lib/python3.6/site-packages/cv2/config.py',
   'DATA'),
  ('tk/tkAppInit.c',
   '/Library/Frameworks/Python.framework/Versions/3.6/lib/tk8.6/tkAppInit.c',
   'DATA'),
  ('tk/msgs/it.msg',
   '/Library/Frameworks/Python.framework/Versions/3.6/lib/tk8.6/msgs/it.msg',
   'DATA'),
  ('tcl/encoding/macDingbats.enc',
   '/Library/Frameworks/Python.framework/Versions/3.6/lib/tcl8.6/encoding/macDingbats.enc',
   'DATA'),
  ('tcl/encoding/dingbats.enc',
   '/Library/Frameworks/Python.framework/Versions/3.6/lib/tcl8.6/encoding/dingbats.enc',
   'DATA'),
  ('tcl/msgs/sr.msg',
   '/Library/Frameworks/Python.framework/Versions/3.6/lib/tcl8.6/msgs/sr.msg',
   'DATA'),
  ('tk/fontchooser.tcl',
   '/Library/Frameworks/Python.framework/Versions/3.6/lib/tk8.6/fontchooser.tcl',
   'DATA'),
  ('tcl/msgs/de.msg',
   '/Library/Frameworks/Python.framework/Versions/3.6/lib/tcl8.6/msgs/de.msg',
   'DATA'),
  ('tcl/history.tcl',
   '/Library/Frameworks/Python.framework/Versions/3.6/lib/tcl8.6/history.tcl',
   'DATA'),
  ('tk/images/tai-ku.gif',
   '/Library/Frameworks/Python.framework/Versions/3.6/lib/tk8.6/images/tai-ku.gif',
   'DATA'),
  ('tcl/encoding/cp1251.enc',
   '/Library/Frameworks/Python.framework/Versions/3.6/lib/tcl8.6/encoding/cp1251.enc',
   'DATA'),
  ('tk/ttk/button.tcl',
   '/Library/Frameworks/Python.framework/Versions/3.6/lib/tk8.6/ttk/button.tcl',
   'DATA'),
  ('tcl/encoding/iso2022-kr.enc',
   '/Library/Frameworks/Python.framework/Versions/3.6/lib/tcl8.6/encoding/iso2022-kr.enc',
   'DATA'),
  ('tcl8/8.6/http-2.8.12.tm',
   '/Library/Frameworks/Python.framework/Versions/3.6/lib/tcl8.6/../tcl8/8.6/http-2.8.12.tm',
   'DATA'),
  ('tcl/encoding/cp950.enc',
   '/Library/Frameworks/Python.framework/Versions/3.6/lib/tcl8.6/encoding/cp950.enc',
   'DATA'),
  ('tcl/msgs/en_za.msg',
   '/Library/Frameworks/Python.framework/Versions/3.6/lib/tcl8.6/msgs/en_za.msg',
   'DATA'),
  ('tcl/msgs/es_py.msg',
   '/Library/Frameworks/Python.framework/Versions/3.6/lib/tcl8.6/msgs/es_py.msg',
   'DATA'),
  ('tcl/encoding/iso8859-13.enc',
   '/Library/Frameworks/Python.framework/Versions/3.6/lib/tcl8.6/encoding/iso8859-13.enc',
   'DATA'),
  ('tcl/encoding/cp1258.enc',
   '/Library/Frameworks/Python.framework/Versions/3.6/lib/tcl8.6/encoding/cp1258.enc',
   'DATA'),
  ('tcl/encoding/gb12345.enc',
   '/Library/Frameworks/Python.framework/Versions/3.6/lib/tcl8.6/encoding/gb12345.enc',
   'DATA'),
  ('tk/images/logo.eps',
   '/Library/Frameworks/Python.framework/Versions/3.6/lib/tk8.6/images/logo.eps',
   'DATA'),
  ('tcl/encoding/cp1257.enc',
   '/Library/Frameworks/Python.framework/Versions/3.6/lib/tcl8.6/encoding/cp1257.enc',
   'DATA'),
  ('tk/images/pwrdLogo.eps',
   '/Library/Frameworks/Python.framework/Versions/3.6/lib/tk8.6/images/pwrdLogo.eps',
   'DATA'),
  ('tcl/msgs/ko_kr.msg',
   '/Library/Frameworks/Python.framework/Versions/3.6/lib/tcl8.6/msgs/ko_kr.msg',
   'DATA'),
  ('tk/ttk/aquaTheme.tcl',
   '/Library/Frameworks/Python.framework/Versions/3.6/lib/tk8.6/ttk/aquaTheme.tcl',
   'DATA'),
  ('tcl/msgs/he.msg',
   '/Library/Frameworks/Python.framework/Versions/3.6/lib/tcl8.6/msgs/he.msg',
   'DATA'),
  ('tcl/msgs/eo.msg',
   '/Library/Frameworks/Python.framework/Versions/3.6/lib/tcl8.6/msgs/eo.msg',
   'DATA'),
  ('cv2/__init__.py',
   '/Library/Frameworks/Python.framework/Versions/3.6/lib/python3.6/site-packages/cv2/__init__.py',
   'DATA'),
  ('tk/ttk/sizegrip.tcl',
   '/Library/Frameworks/Python.framework/Versions/3.6/lib/tk8.6/ttk/sizegrip.tcl',
   'DATA'),
  ('tcl/encoding/cp850.enc',
   '/Library/Frameworks/Python.framework/Versions/3.6/lib/tcl8.6/encoding/cp850.enc',
   'DATA'),
  ('tcl/encoding/cp737.enc',
   '/Library/Frameworks/Python.framework/Versions/3.6/lib/tcl8.6/encoding/cp737.enc',
   'DATA'),
  ('tcl/msgs/es_do.msg',
   '/Library/Frameworks/Python.framework/Versions/3.6/lib/tcl8.6/msgs/es_do.msg',
   'DATA'),
  ('tcl/msgs/fr_ca.msg',
   '/Library/Frameworks/Python.framework/Versions/3.6/lib/tcl8.6/msgs/fr_ca.msg',
   'DATA'),
  ('tk/images/logoLarge.gif',
   '/Library/Frameworks/Python.framework/Versions/3.6/lib/tk8.6/images/logoLarge.gif',
   'DATA'),
  ('tcl/encoding/gb2312.enc',
   '/Library/Frameworks/Python.framework/Versions/3.6/lib/tcl8.6/encoding/gb2312.enc',
   'DATA'),
  ('tk/msgs/pt.msg',
   '/Library/Frameworks/Python.framework/Versions/3.6/lib/tk8.6/msgs/pt.msg',
   'DATA'),
  ('tk/megawidget.tcl',
   '/Library/Frameworks/Python.framework/Versions/3.6/lib/tk8.6/megawidget.tcl',
   'DATA'),
  ('tcl/encoding/cp865.enc',
   '/Library/Frameworks/Python.framework/Versions/3.6/lib/tcl8.6/encoding/cp865.enc',
   'DATA'),
  ('tk/ttk/classicTheme.tcl',
   '/Library/Frameworks/Python.framework/Versions/3.6/lib/tk8.6/ttk/classicTheme.tcl',
   'DATA'),
  ('tk/comdlg.tcl',
   '/Library/Frameworks/Python.framework/Versions/3.6/lib/tk8.6/comdlg.tcl',
   'DATA'),
  ('tcl/msgs/ja.msg',
   '/Library/Frameworks/Python.framework/Versions/3.6/lib/tcl8.6/msgs/ja.msg',
   'DATA'),
  ('tcl/msgs/pl.msg',
   '/Library/Frameworks/Python.framework/Versions/3.6/lib/tcl8.6/msgs/pl.msg',
   'DATA'),
  ('tk/msgs/el.msg',
   '/Library/Frameworks/Python.framework/Versions/3.6/lib/tk8.6/msgs/el.msg',
   'DATA'),
  ('tcl/msgs/zh_cn.msg',
   '/Library/Frameworks/Python.framework/Versions/3.6/lib/tcl8.6/msgs/zh_cn.msg',
   'DATA'),
  ('tcl/msgs/es_ec.msg',
   '/Library/Frameworks/Python.framework/Versions/3.6/lib/tcl8.6/msgs/es_ec.msg',
   'DATA'),
  ('cv2/misc/__init__.py',
   '/Library/Frameworks/Python.framework/Versions/3.6/lib/python3.6/site-packages/cv2/misc/__init__.py',
   'DATA'),
  ('tcl/msgs/te_in.msg',
   '/Library/Frameworks/Python.framework/Versions/3.6/lib/tcl8.6/msgs/te_in.msg',
   'DATA'),
  ('tcl/safe.tcl',
   '/Library/Frameworks/Python.framework/Versions/3.6/lib/tcl8.6/safe.tcl',
   'DATA'),
  ('tcl/encoding/ebcdic.enc',
   '/Library/Frameworks/Python.framework/Versions/3.6/lib/tcl8.6/encoding/ebcdic.enc',
   'DATA'),
  ('tcl/encoding/iso2022-jp.enc',
   '/Library/Frameworks/Python.framework/Versions/3.6/lib/tcl8.6/encoding/iso2022-jp.enc',
   'DATA'),
  ('tcl/msgs/ar.msg',
   '/Library/Frameworks/Python.framework/Versions/3.6/lib/tcl8.6/msgs/ar.msg',
   'DATA'),
  ('tcl/msgs/te.msg',
   '/Library/Frameworks/Python.framework/Versions/3.6/lib/tcl8.6/msgs/te.msg',
   'DATA'),
  ('tk/listbox.tcl',
   '/Library/Frameworks/Python.framework/Versions/3.6/lib/tk8.6/listbox.tcl',
   'DATA'),
  ('tcl/encoding/cp857.enc',
   '/Library/Frameworks/Python.framework/Versions/3.6/lib/tcl8.6/encoding/cp857.enc',
   'DATA'),
  ('tk/unsupported.tcl',
   '/Library/Frameworks/Python.framework/Versions/3.6/lib/tk8.6/unsupported.tcl',
   'DATA'),
  ('tk/msgs/da.msg',
   '/Library/Frameworks/Python.framework/Versions/3.6/lib/tk8.6/msgs/da.msg',
   'DATA'),
  ('tcl/encoding/cp852.enc',
   '/Library/Frameworks/Python.framework/Versions/3.6/lib/tcl8.6/encoding/cp852.enc',
   'DATA'),
  ('tcl/encoding/iso8859-5.enc',
   '/Library/Frameworks/Python.framework/Versions/3.6/lib/tcl8.6/encoding/iso8859-5.enc',
   'DATA'),
  ('tcl/encoding/cp1250.enc',
   '/Library/Frameworks/Python.framework/Versions/3.6/lib/tcl8.6/encoding/cp1250.enc',
   'DATA'),
  ('tk/ttk/clamTheme.tcl',
   '/Library/Frameworks/Python.framework/Versions/3.6/lib/tk8.6/ttk/clamTheme.tcl',
   'DATA'),
  ('tcl/msgs/zh_sg.msg',
   '/Library/Frameworks/Python.framework/Versions/3.6/lib/tcl8.6/msgs/zh_sg.msg',
   'DATA'),
  ('tcl/msgs/uk.msg',
   '/Library/Frameworks/Python.framework/Versions/3.6/lib/tcl8.6/msgs/uk.msg',
   'DATA'),
  ('tcl/msgs/et.msg',
   '/Library/Frameworks/Python.framework/Versions/3.6/lib/tcl8.6/msgs/et.msg',
   'DATA'),
  ('tcl/encoding/iso8859-9.enc',
   '/Library/Frameworks/Python.framework/Versions/3.6/lib/tcl8.6/encoding/iso8859-9.enc',
   'DATA'),
  ('tcl/encoding/jis0208.enc',
   '/Library/Frameworks/Python.framework/Versions/3.6/lib/tcl8.6/encoding/jis0208.enc',
   'DATA'),
  ('tcl/msgs/mr.msg',
   '/Library/Frameworks/Python.framework/Versions/3.6/lib/tcl8.6/msgs/mr.msg',
   'DATA'),
  ('tcl/msgs/de_be.msg',
   '/Library/Frameworks/Python.framework/Versions/3.6/lib/tcl8.6/msgs/de_be.msg',
   'DATA'),
  ('tcl/msgs/ko.msg',
   '/Library/Frameworks/Python.framework/Versions/3.6/lib/tcl8.6/msgs/ko.msg',
   'DATA'),
  ('tcl/encoding/iso8859-15.enc',
   '/Library/Frameworks/Python.framework/Versions/3.6/lib/tcl8.6/encoding/iso8859-15.enc',
   'DATA'),
  ('tcl/msgs/ro.msg',
   '/Library/Frameworks/Python.framework/Versions/3.6/lib/tcl8.6/msgs/ro.msg',
   'DATA'),
  ('tcl/word.tcl',
   '/Library/Frameworks/Python.framework/Versions/3.6/lib/tcl8.6/word.tcl',
   'DATA'),
  ('tcl/msgs/tr.msg',
   '/Library/Frameworks/Python.framework/Versions/3.6/lib/tcl8.6/msgs/tr.msg',
   'DATA'),
  ('tcl/msgs/es_co.msg',
   '/Library/Frameworks/Python.framework/Versions/3.6/lib/tcl8.6/msgs/es_co.msg',
   'DATA'),
  ('tcl/msgs/el.msg',
   '/Library/Frameworks/Python.framework/Versions/3.6/lib/tcl8.6/msgs/el.msg',
   'DATA'),
  ('cv2/version.py',
   '/Library/Frameworks/Python.framework/Versions/3.6/lib/python3.6/site-packages/cv2/version.py',
   'DATA'),
  ('tcl/msgs/ms_my.msg',
   '/Library/Frameworks/Python.framework/Versions/3.6/lib/tcl8.6/msgs/ms_my.msg',
   'DATA'),
  ('tk/ttk/defaults.tcl',
   '/Library/Frameworks/Python.framework/Versions/3.6/lib/tk8.6/ttk/defaults.tcl',
   'DATA'),
  ('tk/bgerror.tcl',
   '/Library/Frameworks/Python.framework/Versions/3.6/lib/tk8.6/bgerror.tcl',
   'DATA'),
  ('tcl/opt0.4/pkgIndex.tcl',
   '/Library/Frameworks/Python.framework/Versions/3.6/lib/tcl8.6/opt0.4/pkgIndex.tcl',
   'DATA'),
  ('tk/text.tcl',
   '/Library/Frameworks/Python.framework/Versions/3.6/lib/tk8.6/text.tcl',
   'DATA'),
  ('tcl/msgs/hu.msg',
   '/Library/Frameworks/Python.framework/Versions/3.6/lib/tcl8.6/msgs/hu.msg',
   'DATA'),
  ('tcl/encoding/iso8859-10.enc',
   '/Library/Frameworks/Python.framework/Versions/3.6/lib/tcl8.6/encoding/iso8859-10.enc',
   'DATA'),
  ('cv2/mat_wrapper/__init__.py',
   '/Library/Frameworks/Python.framework/Versions/3.6/lib/python3.6/site-packages/cv2/mat_wrapper/__init__.py',
   'DATA'),
  ('cv2/gapi/__init__.py',
   '/Library/Frameworks/Python.framework/Versions/3.6/lib/python3.6/site-packages/cv2/gapi/__init__.py',
   'DATA'),
  ('tk/entry.tcl',
   '/Library/Frameworks/Python.framework/Versions/3.6/lib/tk8.6/entry.tcl',
   'DATA'),
  ('tcl/msgs/lv.msg',
   '/Library/Frameworks/Python.framework/Versions/3.6/lib/tcl8.6/msgs/lv.msg',
   'DATA'),
  ('tcl/msgs/it_ch.msg',
   '/Library/Frameworks/Python.framework/Versions/3.6/lib/tcl8.6/msgs/it_ch.msg',
   'DATA'),
  ('tcl/msgs/zh_hk.msg',
   '/Library/Frameworks/Python.framework/Versions/3.6/lib/tcl8.6/msgs/zh_hk.msg',
   'DATA'),
  ('tcl/msgs/kok_in.msg',
   '/Library/Frameworks/Python.framework/Versions/3.6/lib/tcl8.6/msgs/kok_in.msg',
   'DATA'),
  ('tk/ttk/panedwindow.tcl',
   '/Library/Frameworks/Python.framework/Versions/3.6/lib/tk8.6/ttk/panedwindow.tcl',
   'DATA'),
  ('tcl/http1.0/http.tcl',
   '/Library/Frameworks/Python.framework/Versions/3.6/lib/tcl8.6/http1.0/http.tcl',
   'DATA'),
  ('tk/ttk/menubutton.tcl',
   '/Library/Frameworks/Python.framework/Versions/3.6/lib/tk8.6/ttk/menubutton.tcl',
   'DATA'),
  ('tcl/clock.tcl',
   '/Library/Frameworks/Python.framework/Versions/3.6/lib/tcl8.6/clock.tcl',
   'DATA'),
  ('tcl/msgs/sw.msg',
   '/Library/Frameworks/Python.framework/Versions/3.6/lib/tcl8.6/msgs/sw.msg',
   'DATA'),
  ('tcl/encoding/iso8859-1.enc',
   '/Library/Frameworks/Python.framework/Versions/3.6/lib/tcl8.6/encoding/iso8859-1.enc',
   'DATA'),
  ('tcl/msgs/es_pr.msg',
   '/Library/Frameworks/Python.framework/Versions/3.6/lib/tcl8.6/msgs/es_pr.msg',
   'DATA'),
  ('tcl/encoding/cp869.enc',
   '/Library/Frameworks/Python.framework/Versions/3.6/lib/tcl8.6/encoding/cp869.enc',
   'DATA'),
  ('tcl/msgs/ta.msg',
   '/Library/Frameworks/Python.framework/Versions/3.6/lib/tcl8.6/msgs/ta.msg',
   'DATA'),
  ('tk/scrlbar.tcl',
   '/Library/Frameworks/Python.framework/Versions/3.6/lib/tk8.6/scrlbar.tcl',
   'DATA'),
  ('tk/msgs/en.msg',
   '/Library/Frameworks/Python.framework/Versions/3.6/lib/tk8.6/msgs/en.msg',
   'DATA'),
  ('tcl/msgs/it.msg',
   '/Library/Frameworks/Python.framework/Versions/3.6/lib/tcl8.6/msgs/it.msg',
   'DATA'),
  ('tcl/msgs/ga.msg',
   '/Library/Frameworks/Python.framework/Versions/3.6/lib/tcl8.6/msgs/ga.msg',
   'DATA'),
  ('tcl/msgs/sl.msg',
   '/Library/Frameworks/Python.framework/Versions/3.6/lib/tcl8.6/msgs/sl.msg',
   'DATA'),
  ('cv2/load_config_py2.py',
   '/Library/Frameworks/Python.framework/Versions/3.6/lib/python3.6/site-packages/cv2/load_config_py2.py',
   'DATA'),
  ('tcl/encoding/macCentEuro.enc',
   '/Library/Frameworks/Python.framework/Versions/3.6/lib/tcl8.6/encoding/macCentEuro.enc',
   'DATA'),
  ('tcl/encoding/euc-kr.enc',
   '/Library/Frameworks/Python.framework/Versions/3.6/lib/tcl8.6/encoding/euc-kr.enc',
   'DATA'),
  ('tk/choosedir.tcl',
   '/Library/Frameworks/Python.framework/Versions/3.6/lib/tk8.6/choosedir.tcl',
   'DATA'),
  ('tcl/msgs/kw_gb.msg',
   '/Library/Frameworks/Python.framework/Versions/3.6/lib/tcl8.6/msgs/kw_gb.msg',
   'DATA'),
  ('tcl/msgs/ca.msg',
   '/Library/Frameworks/Python.framework/Versions/3.6/lib/tcl8.6/msgs/ca.msg',
   'DATA'),
  ('tcl/msgs/es_ni.msg',
   '/Library/Frameworks/Python.framework/Versions/3.6/lib/tcl8.6/msgs/es_ni.msg',
   'DATA'),
  ('tcl8/8.4/platform-1.0.14.tm',
   '/Library/Frameworks/Python.framework/Versions/3.6/lib/tcl8.6/../tcl8/8.4/platform-1.0.14.tm',
   'DATA'),
  ('tk/ttk/winTheme.tcl',
   '/Library/Frameworks/Python.framework/Versions/3.6/lib/tk8.6/ttk/winTheme.tcl',
   'DATA'),
  ('tk/menu.tcl',
   '/Library/Frameworks/Python.framework/Versions/3.6/lib/tk8.6/menu.tcl',
   'DATA'),
  ('tcl/encoding/iso8859-16.enc',
   '/Library/Frameworks/Python.framework/Versions/3.6/lib/tcl8.6/encoding/iso8859-16.enc',
   'DATA'),
  ('tcl/encoding/macGreek.enc',
   '/Library/Frameworks/Python.framework/Versions/3.6/lib/tcl8.6/encoding/macGreek.enc',
   'DATA'),
  ('tcl/encoding/macUkraine.enc',
   '/Library/Frameworks/Python.framework/Versions/3.6/lib/tcl8.6/encoding/macUkraine.enc',
   'DATA'),
  ('tk/images/pwrdLogo175.gif',
   '/Library/Frameworks/Python.framework/Versions/3.6/lib/tk8.6/images/pwrdLogo175.gif',
   'DATA'),
  ('tcl/msgs/de_at.msg',
   '/Library/Frameworks/Python.framework/Versions/3.6/lib/tcl8.6/msgs/de_at.msg',
   'DATA'),
  ('tcl/msgs/eu.msg',
   '/Library/Frameworks/Python.framework/Versions/3.6/lib/tcl8.6/msgs/eu.msg',
   'DATA'),
  ('tcl/msgs/ga_ie.msg',
   '/Library/Frameworks/Python.framework/Versions/3.6/lib/tcl8.6/msgs/ga_ie.msg',
   'DATA'),
  ('tcl/encoding/iso8859-14.enc',
   '/Library/Frameworks/Python.framework/Versions/3.6/lib/tcl8.6/encoding/iso8859-14.enc',
   'DATA'),
  ('tcl/msgs/kl.msg',
   '/Library/Frameworks/Python.framework/Versions/3.6/lib/tcl8.6/msgs/kl.msg',
   'DATA'),
  ('tcl/msgs/pt.msg',
   '/Library/Frameworks/Python.framework/Versions/3.6/lib/tcl8.6/msgs/pt.msg',
   'DATA'),
  ('tcl/msgs/lt.msg',
   '/Library/Frameworks/Python.framework/Versions/3.6/lib/tcl8.6/msgs/lt.msg',
   'DATA'),
  ('cv2/utils/__init__.py',
   '/Library/Frameworks/Python.framework/Versions/3.6/lib/python3.6/site-packages/cv2/utils/__init__.py',
   'DATA'),
  ('tcl/msgs/kl_gl.msg',
   '/Library/Frameworks/Python.framework/Versions/3.6/lib/tcl8.6/msgs/kl_gl.msg',
   'DATA'),
  ('tk/iconlist.tcl',
   '/Library/Frameworks/Python.framework/Versions/3.6/lib/tk8.6/iconlist.tcl',
   'DATA'),
  ('tcl/msgs/es_pa.msg',
   '/Library/Frameworks/Python.framework/Versions/3.6/lib/tcl8.6/msgs/es_pa.msg',
   'DATA'),
  ('tcl/encoding/cp1256.enc',
   '/Library/Frameworks/Python.framework/Versions/3.6/lib/tcl8.6/encoding/cp1256.enc',
   'DATA'),
  ('tk/ttk/combobox.tcl',
   '/Library/Frameworks/Python.framework/Versions/3.6/lib/tk8.6/ttk/combobox.tcl',
   'DATA'),
  ('tk/ttk/vistaTheme.tcl',
   '/Library/Frameworks/Python.framework/Versions/3.6/lib/tk8.6/ttk/vistaTheme.tcl',
   'DATA'),
  ('tk/ttk/ttk.tcl',
   '/Library/Frameworks/Python.framework/Versions/3.6/lib/tk8.6/ttk/ttk.tcl',
   'DATA'),
  ('tcl/encoding/cp936.enc',
   '/Library/Frameworks/Python.framework/Versions/3.6/lib/tcl8.6/encoding/cp936.enc',
   'DATA'),
  ('tcl/msgs/es_uy.msg',
   '/Library/Frameworks/Python.framework/Versions/3.6/lib/tcl8.6/msgs/es_uy.msg',
   'DATA'),
  ('tcl/init.tcl',
   '/Library/Frameworks/Python.framework/Versions/3.6/lib/tcl8.6/init.tcl',
   'DATA'),
  ('tk/images/pwrdLogo100.gif',
   '/Library/Frameworks/Python.framework/Versions/3.6/lib/tk8.6/images/pwrdLogo100.gif',
   'DATA'),
  ('tcl/msgs/en_ph.msg',
   '/Library/Frameworks/Python.framework/Versions/3.6/lib/tcl8.6/msgs/en_ph.msg',
   'DATA'),
  ('tcl/msgs/es_hn.msg',
   '/Library/Frameworks/Python.framework/Versions/3.6/lib/tcl8.6/msgs/es_hn.msg',
   'DATA'),
  ('tcl/encoding/cp874.enc',
   '/Library/Frameworks/Python.framework/Versions/3.6/lib/tcl8.6/encoding/cp874.enc',
   'DATA'),
  ('tcl/msgs/zh.msg',
   '/Library/Frameworks/Python.framework/Versions/3.6/lib/tcl8.6/msgs/zh.msg',
   'DATA'),
  ('tk/button.tcl',
   '/Library/Frameworks/Python.framework/Versions/3.6/lib/tk8.6/button.tcl',
   'DATA'),
  ('tcl/parray.tcl',
   '/Library/Frameworks/Python.framework/Versions/3.6/lib/tcl8.6/parray.tcl',
   'DATA'),
  ('tk/msgs/pl.msg',
   '/Library/Frameworks/Python.framework/Versions/3.6/lib/tk8.6/msgs/pl.msg',
   'DATA'),
  ('tcl/msgs/kok.msg',
   '/Library/Frameworks/Python.framework/Versions/3.6/lib/tcl8.6/msgs/kok.msg',
   'DATA'),
  ('cv2/config-3.py',
   '/Library/Frameworks/Python.framework/Versions/3.6/lib/python3.6/site-packages/cv2/config-3.py',
   'DATA'),
  ('tcl/msgs/gl.msg',
   '/Library/Frameworks/Python.framework/Versions/3.6/lib/tcl8.6/msgs/gl.msg',
   'DATA'),
  ('tcl/msgs/da.msg',
   '/Library/Frameworks/Python.framework/Versions/3.6/lib/tcl8.6/msgs/da.msg',
   'DATA'),
  ('tcl/encoding/cp949.enc',
   '/Library/Frameworks/Python.framework/Versions/3.6/lib/tcl8.6/encoding/cp949.enc',
   'DATA'),
  ('tk/ttk/xpTheme.tcl',
   '/Library/Frameworks/Python.framework/Versions/3.6/lib/tk8.6/ttk/xpTheme.tcl',
   'DATA'),
  ('tk/tearoff.tcl',
   '/Library/Frameworks/Python.framework/Versions/3.6/lib/tk8.6/tearoff.tcl',
   'DATA'),
  ('tcl/encoding/cp1254.enc',
   '/Library/Frameworks/Python.framework/Versions/3.6/lib/tcl8.6/encoding/cp1254.enc',
   'DATA'),
  ('tcl/msgs/fo_fo.msg',
   '/Library/Frameworks/Python.framework/Versions/3.6/lib/tcl8.6/msgs/fo_fo.msg',
   'DATA'),
  ('tcl8/8.5/msgcat-1.6.1.tm',
   '/Library/Frameworks/Python.framework/Versions/3.6/lib/tcl8.6/../tcl8/8.5/msgcat-1.6.1.tm',
   'DATA'),
  ('tcl/encoding/macThai.enc',
   '/Library/Frameworks/Python.framework/Versions/3.6/lib/tcl8.6/encoding/macThai.enc',
   'DATA'),
  ('tcl/msgs/en_hk.msg',
   '/Library/Frameworks/Python.framework/Versions/3.6/lib/tcl8.6/msgs/en_hk.msg',
   'DATA'),
  ('tk/safetk.tcl',
   '/Library/Frameworks/Python.framework/Versions/3.6/lib/tk8.6/safetk.tcl',
   'DATA'),
  ('tcl/encoding/cp861.enc',
   '/Library/Frameworks/Python.framework/Versions/3.6/lib/tcl8.6/encoding/cp861.enc',
   'DATA'),
  ('tk/tk.tcl',
   '/Library/Frameworks/Python.framework/Versions/3.6/lib/tk8.6/tk.tcl',
   'DATA'),
  ('tcl/msgs/fr.msg',
   '/Library/Frameworks/Python.framework/Versions/3.6/lib/tcl8.6/msgs/fr.msg',
   'DATA'),
  ('tcl/encoding/iso8859-6.enc',
   '/Library/Frameworks/Python.framework/Versions/3.6/lib/tcl8.6/encoding/iso8859-6.enc',
   'DATA'),
  ('tcl/auto.tcl',
   '/Library/Frameworks/Python.framework/Versions/3.6/lib/tcl8.6/auto.tcl',
   'DATA'),
  ('tcl/msgs/nl.msg',
   '/Library/Frameworks/Python.framework/Versions/3.6/lib/tcl8.6/msgs/nl.msg',
   'DATA'),
  ('tcl/msgs/es_sv.msg',
   '/Library/Frameworks/Python.framework/Versions/3.6/lib/tcl8.6/msgs/es_sv.msg',
   'DATA'),
  ('tcl/msgs/en_ie.msg',
   '/Library/Frameworks/Python.framework/Versions/3.6/lib/tcl8.6/msgs/en_ie.msg',
   'DATA'),
  ('tcl/msgs/mr_in.msg',
   '/Library/Frameworks/Python.framework/Versions/3.6/lib/tcl8.6/msgs/mr_in.msg',
   'DATA'),
  ('tcl/encoding/ascii.enc',
   '/Library/Frameworks/Python.framework/Versions/3.6/lib/tcl8.6/encoding/ascii.enc',
   'DATA'),
  ('tcl/msgs/ar_jo.msg',
   '/Library/Frameworks/Python.framework/Versions/3.6/lib/tcl8.6/msgs/ar_jo.msg',
   'DATA'),
  ('tcl/encoding/euc-cn.enc',
   '/Library/Frameworks/Python.framework/Versions/3.6/lib/tcl8.6/encoding/euc-cn.enc',
   'DATA'),
  ('tcl/msgs/nn.msg',
   '/Library/Frameworks/Python.framework/Versions/3.6/lib/tcl8.6/msgs/nn.msg',
   'DATA'),
  ('tcl/msgs/ms.msg',
   '/Library/Frameworks/Python.framework/Versions/3.6/lib/tcl8.6/msgs/ms.msg',
   'DATA'),
  ('tcl/encoding/cp437.enc',
   '/Library/Frameworks/Python.framework/Versions/3.6/lib/tcl8.6/encoding/cp437.enc',
   'DATA'),
  ('tcl8/8.4/platform/shell-1.1.4.tm',
   '/Library/Frameworks/Python.framework/Versions/3.6/lib/tcl8.6/../tcl8/8.4/platform/shell-1.1.4.tm',
   'DATA'),
  ('tk/msgs/hu.msg',
   '/Library/Frameworks/Python.framework/Versions/3.6/lib/tk8.6/msgs/hu.msg',
   'DATA'),
  ('tk/optMenu.tcl',
   '/Library/Frameworks/Python.framework/Versions/3.6/lib/tk8.6/optMenu.tcl',
   'DATA'),
  ('tcl/msgs/es_cr.msg',
   '/Library/Frameworks/Python.framework/Versions/3.6/lib/tcl8.6/msgs/es_cr.msg',
   'DATA'),
  ('tcl/encoding/cp1255.enc',
   '/Library/Frameworks/Python.framework/Versions/3.6/lib/tcl8.6/encoding/cp1255.enc',
   'DATA'),
  ('tk/ttk/cursors.tcl',
   '/Library/Frameworks/Python.framework/Versions/3.6/lib/tk8.6/ttk/cursors.tcl',
   'DATA'),
  ('tcl/encoding/macJapan.enc',
   '/Library/Frameworks/Python.framework/Versions/3.6/lib/tcl8.6/encoding/macJapan.enc',
   'DATA'),
  ('tcl/encoding/cp864.enc',
   '/Library/Frameworks/Python.framework/Versions/3.6/lib/tcl8.6/encoding/cp864.enc',
   'DATA'),
  ('tk/tkfbox.tcl',
   '/Library/Frameworks/Python.framework/Versions/3.6/lib/tk8.6/tkfbox.tcl',
   'DATA'),
  ('tcl/encoding/cp863.enc',
   '/Library/Frameworks/Python.framework/Versions/3.6/lib/tcl8.6/encoding/cp863.enc',
   'DATA'),
  ('tk/focus.tcl',
   '/Library/Frameworks/Python.framework/Versions/3.6/lib/tk8.6/focus.tcl',
   'DATA'),
  ('tk/ttk/entry.tcl',
   '/Library/Frameworks/Python.framework/Versions/3.6/lib/tk8.6/ttk/entry.tcl',
   'DATA'),
  ('tk/msgs/nl.msg',
   '/Library/Frameworks/Python.framework/Versions/3.6/lib/tk8.6/msgs/nl.msg',
   'DATA'),
  ('tk/msgs/eo.msg',
   '/Library/Frameworks/Python.framework/Versions/3.6/lib/tk8.6/msgs/eo.msg',
   'DATA'),
  ('tcl/msgs/bn_in.msg',
   '/Library/Frameworks/Python.framework/Versions/3.6/lib/tcl8.6/msgs/bn_in.msg',
   'DATA'),
  ('tcl/msgs/sk.msg',
   '/Library/Frameworks/Python.framework/Versions/3.6/lib/tcl8.6/msgs/sk.msg',
   'DATA'),
  ('tcl/encoding/koi8-r.enc',
   '/Library/Frameworks/Python.framework/Versions/3.6/lib/tcl8.6/encoding/koi8-r.enc',
   'DATA'),
  ('tcl/msgs/en_ca.msg',
   '/Library/Frameworks/Python.framework/Versions/3.6/lib/tcl8.6/msgs/en_ca.msg',
   'DATA'),
  ('tcl/msgs/gv_gb.msg',
   '/Library/Frameworks/Python.framework/Versions/3.6/lib/tcl8.6/msgs/gv_gb.msg',
   'DATA'),
  ('tcl/tclAppInit.c',
   '/Library/Frameworks/Python.framework/Versions/3.6/lib/tcl8.6/tclAppInit.c',
   'DATA'),
  ('tk/obsolete.tcl',
   '/Library/Frameworks/Python.framework/Versions/3.6/lib/tk8.6/obsolete.tcl',
   'DATA'),
  ('tcl/http1.0/pkgIndex.tcl',
   '/Library/Frameworks/Python.framework/Versions/3.6/lib/tcl8.6/http1.0/pkgIndex.tcl',
   'DATA'),
  ('tcl8/8.6/tdbc/sqlite3-1.0.6.tm',
   '/Library/Frameworks/Python.framework/Versions/3.6/lib/tcl8.6/../tcl8/8.6/tdbc/sqlite3-1.0.6.tm',
   'DATA'),
  ('tcl8/8.5/tcltest-2.4.1.tm',
   '/Library/Frameworks/Python.framework/Versions/3.6/lib/tcl8.6/../tcl8/8.5/tcltest-2.4.1.tm',
   'DATA'),
  ('tcl/msgs/ru_ua.msg',
   '/Library/Frameworks/Python.framework/Versions/3.6/lib/tcl8.6/msgs/ru_ua.msg',
   'DATA'),
  ('tcl/encoding/iso8859-2.enc',
   '/Library/Frameworks/Python.framework/Versions/3.6/lib/tcl8.6/encoding/iso8859-2.enc',
   'DATA'),
  ('tk/images/pwrdLogo150.gif',
   '/Library/Frameworks/Python.framework/Versions/3.6/lib/tk8.6/images/pwrdLogo150.gif',
   'DATA'),
  ('tk/ttk/treeview.tcl',
   '/Library/Frameworks/Python.framework/Versions/3.6/lib/tk8.6/ttk/treeview.tcl',
   'DATA'),
  ('tcl/msgs/ar_lb.msg',
   '/Library/Frameworks/Python.framework/Versions/3.6/lib/tcl8.6/msgs/ar_lb.msg',
   'DATA'),
  ('tk/images/logo64.gif',
   '/Library/Frameworks/Python.framework/Versions/3.6/lib/tk8.6/images/logo64.gif',
   'DATA'),
  ('tcl/msgs/mk.msg',
   '/Library/Frameworks/Python.framework/Versions/3.6/lib/tcl8.6/msgs/mk.msg',
   'DATA'),
  ('tk/msgs/ru.msg',
   '/Library/Frameworks/Python.framework/Versions/3.6/lib/tk8.6/msgs/ru.msg',
   'DATA'),
  ('tcl/encoding/gb1988.enc',
   '/Library/Frameworks/Python.framework/Versions/3.6/lib/tcl8.6/encoding/gb1988.enc',
   'DATA'),
  ('tk/ttk/utils.tcl',
   '/Library/Frameworks/Python.framework/Versions/3.6/lib/tk8.6/ttk/utils.tcl',
   'DATA'),
  ('tcl/encoding/cp1253.enc',
   '/Library/Frameworks/Python.framework/Versions/3.6/lib/tcl8.6/encoding/cp1253.enc',
   'DATA'),
  ('cv2/misc/version.py',
   '/Library/Frameworks/Python.framework/Versions/3.6/lib/python3.6/site-packages/cv2/misc/version.py',
   'DATA'),
  ('tcl/encoding/cp862.enc',
   '/Library/Frameworks/Python.framework/Versions/3.6/lib/tcl8.6/encoding/cp862.enc',
   'DATA'),
  ('tcl/encoding/macCyrillic.enc',
   '/Library/Frameworks/Python.framework/Versions/3.6/lib/tcl8.6/encoding/macCyrillic.enc',
   'DATA'),
  ('tk/images/pwrdLogo200.gif',
   '/Library/Frameworks/Python.framework/Versions/3.6/lib/tk8.6/images/pwrdLogo200.gif',
   'DATA'),
  ('tcl/msgs/fa_in.msg',
   '/Library/Frameworks/Python.framework/Versions/3.6/lib/tcl8.6/msgs/fa_in.msg',
   'DATA'),
  ('tcl/msgs/fa.msg',
   '/Library/Frameworks/Python.framework/Versions/3.6/lib/tcl8.6/msgs/fa.msg',
   'DATA'),
  ('tcl/msgs/bn.msg',
   '/Library/Frameworks/Python.framework/Versions/3.6/lib/tcl8.6/msgs/bn.msg',
   'DATA'),
  ('tcl/msgs/es_mx.msg',
   '/Library/Frameworks/Python.framework/Versions/3.6/lib/tcl8.6/msgs/es_mx.msg',
   'DATA'),
  ('tk/images/README',
   '/Library/Frameworks/Python.framework/Versions/3.6/lib/tk8.6/images/README',
   'DATA'),
  ('tcl/encoding/cp775.enc',
   '/Library/Frameworks/Python.framework/Versions/3.6/lib/tcl8.6/encoding/cp775.enc',
   'DATA'),
  ('tcl/msgs/sh.msg',
   '/Library/Frameworks/Python.framework/Versions/3.6/lib/tcl8.6/msgs/sh.msg',
   'DATA'),
  ('tcl/msgs/en_in.msg',
   '/Library/Frameworks/Python.framework/Versions/3.6/lib/tcl8.6/msgs/en_in.msg',
   'DATA'),
  ('tk/msgs/en_gb.msg',
   '/Library/Frameworks/Python.framework/Versions/3.6/lib/tk8.6/msgs/en_gb.msg',
   'DATA'),
  ('tcl/msgs/es_pe.msg',
   '/Library/Frameworks/Python.framework/Versions/3.6/lib/tcl8.6/msgs/es_pe.msg',
   'DATA'),
  ('tcl/encoding/iso8859-7.enc',
   '/Library/Frameworks/Python.framework/Versions/3.6/lib/tcl8.6/encoding/iso8859-7.enc',
   'DATA'),
  ('tk/msgbox.tcl',
   '/Library/Frameworks/Python.framework/Versions/3.6/lib/tk8.6/msgbox.tcl',
   'DATA'),
  ('tcl/encoding/cp866.enc',
   '/Library/Frameworks/Python.framework/Versions/3.6/lib/tcl8.6/encoding/cp866.enc',
   'DATA'),
  ('tk/dialog.tcl',
   '/Library/Frameworks/Python.framework/Versions/3.6/lib/tk8.6/dialog.tcl',
   'DATA'),
  ('tk/msgs/sv.msg',
   '/Library/Frameworks/Python.framework/Versions/3.6/lib/tk8.6/msgs/sv.msg',
   'DATA'),
  ('tcl/msgs/cs.msg',
   '/Library/Frameworks/Python.framework/Versions/3.6/lib/tcl8.6/msgs/cs.msg',
   'DATA'),
  ('tk/ttk/altTheme.tcl',
   '/Library/Frameworks/Python.framework/Versions/3.6/lib/tk8.6/ttk/altTheme.tcl',
   'DATA'),
  ('tk/images/pwrdLogo75.gif',
   '/Library/Frameworks/Python.framework/Versions/3.6/lib/tk8.6/images/pwrdLogo75.gif',
   'DATA'),
  ('tk/msgs/es.msg',
   '/Library/Frameworks/Python.framework/Versions/3.6/lib/tk8.6/msgs/es.msg',
   'DATA'),
  ('tcl/msgs/id.msg',
   '/Library/Frameworks/Python.framework/Versions/3.6/lib/tcl8.6/msgs/id.msg',
   'DATA'),
  ('tcl/msgs/kw.msg',
   '/Library/Frameworks/Python.framework/Versions/3.6/lib/tcl8.6/msgs/kw.msg',
   'DATA'),
  ('tk/images/logoMed.gif',
   '/Library/Frameworks/Python.framework/Versions/3.6/lib/tk8.6/images/logoMed.gif',
   'DATA'),
  ('tcl/encoding/cp1252.enc',
   '/Library/Frameworks/Python.framework/Versions/3.6/lib/tcl8.6/encoding/cp1252.enc',
   'DATA'),
  ('tcl/msgs/es_cl.msg',
   '/Library/Frameworks/Python.framework/Versions/3.6/lib/tcl8.6/msgs/es_cl.msg',
   'DATA'),
  ('tcl/encoding/jis0212.enc',
   '/Library/Frameworks/Python.framework/Versions/3.6/lib/tcl8.6/encoding/jis0212.enc',
   'DATA'),
  ('tk/ttk/spinbox.tcl',
   '/Library/Frameworks/Python.framework/Versions/3.6/lib/tk8.6/ttk/spinbox.tcl',
   'DATA'),
  ('certifi/cacert.pem',
   '/Library/Frameworks/Python.framework/Versions/3.6/lib/python3.6/site-packages/certifi/cacert.pem',
   'DATA'),
  ('tcl/msgs/en_be.msg',
   '/Library/Frameworks/Python.framework/Versions/3.6/lib/tcl8.6/msgs/en_be.msg',
   'DATA'),
  ('tk/icons.tcl',
   '/Library/Frameworks/Python.framework/Versions/3.6/lib/tk8.6/icons.tcl',
   'DATA'),
  ('tk/msgs/de.msg',
   '/Library/Frameworks/Python.framework/Versions/3.6/lib/tk8.6/msgs/de.msg',
   'DATA'),
  ('tcl/msgs/is.msg',
   '/Library/Frameworks/Python.framework/Versions/3.6/lib/tcl8.6/msgs/is.msg',
   'DATA'),
  ('tk/palette.tcl',
   '/Library/Frameworks/Python.framework/Versions/3.6/lib/tk8.6/palette.tcl',
   'DATA'),
  ('tcl/encoding/gb2312-raw.enc',
   '/Library/Frameworks/Python.framework/Versions/3.6/lib/tcl8.6/encoding/gb2312-raw.enc',
   'DATA'),
  ('tcl/msgs/en_bw.msg',
   '/Library/Frameworks/Python.framework/Versions/3.6/lib/tcl8.6/msgs/en_bw.msg',
   'DATA'),
  ('tcl/encoding/big5.enc',
   '/Library/Frameworks/Python.framework/Versions/3.6/lib/tcl8.6/encoding/big5.enc',
   'DATA'),
  ('tcl/msgs/en_sg.msg',
   '/Library/Frameworks/Python.framework/Versions/3.6/lib/tcl8.6/msgs/en_sg.msg',
   'DATA'),
  ('tcl/msgs/fa_ir.msg',
   '/Library/Frameworks/Python.framework/Versions/3.6/lib/tcl8.6/msgs/fa_ir.msg',
   'DATA'),
  ('tcl/msgs/sv.msg',
   '/Library/Frameworks/Python.framework/Versions/3.6/lib/tcl8.6/msgs/sv.msg',
   'DATA'),
  ('tcl/package.tcl',
   '/Library/Frameworks/Python.framework/Versions/3.6/lib/tcl8.6/package.tcl',
   'DATA'),
  ('tk/ttk/notebook.tcl',
   '/Library/Frameworks/Python.framework/Versions/3.6/lib/tk8.6/ttk/notebook.tcl',
   'DATA'),
  ('tcl/msgs/bg.msg',
   '/Library/Frameworks/Python.framework/Versions/3.6/lib/tcl8.6/msgs/bg.msg',
   'DATA'),
  ('tcl/msgs/nb.msg',
   '/Library/Frameworks/Python.framework/Versions/3.6/lib/tcl8.6/msgs/nb.msg',
   'DATA'),
  ('tcl/msgs/fo.msg',
   '/Library/Frameworks/Python.framework/Versions/3.6/lib/tcl8.6/msgs/fo.msg',
   'DATA'),
  ('tk/ttk/fonts.tcl',
   '/Library/Frameworks/Python.framework/Versions/3.6/lib/tk8.6/ttk/fonts.tcl',
   'DATA'),
  ('tk/ttk/progress.tcl',
   '/Library/Frameworks/Python.framework/Versions/3.6/lib/tk8.6/ttk/progress.tcl',
   'DATA'),
  ('tcl/encoding/macRomania.enc',
   '/Library/Frameworks/Python.framework/Versions/3.6/lib/tcl8.6/encoding/macRomania.enc',
   'DATA'),
  ('tk/clrpick.tcl',
   '/Library/Frameworks/Python.framework/Versions/3.6/lib/tk8.6/clrpick.tcl',
   'DATA'),
  ('tcl/msgs/eu_es.msg',
   '/Library/Frameworks/Python.framework/Versions/3.6/lib/tcl8.6/msgs/eu_es.msg',
   'DATA'),
  ('tcl/encoding/shiftjis.enc',
   '/Library/Frameworks/Python.framework/Versions/3.6/lib/tcl8.6/encoding/shiftjis.enc',
   'DATA'),
  ('tcl/msgs/ar_sy.msg',
   '/Library/Frameworks/Python.framework/Versions/3.6/lib/tcl8.6/msgs/ar_sy.msg',
   'DATA'),
  ('tcl/msgs/mt.msg',
   '/Library/Frameworks/Python.framework/Versions/3.6/lib/tcl8.6/msgs/mt.msg',
   'DATA'),
  ('tcl/msgs/ar_in.msg',
   '/Library/Frameworks/Python.framework/Versions/3.6/lib/tcl8.6/msgs/ar_in.msg',
   'DATA'),
  ('tcl/msgs/es_ve.msg',
   '/Library/Frameworks/Python.framework/Versions/3.6/lib/tcl8.6/msgs/es_ve.msg',
   'DATA'),
  ('tk/tclIndex',
   '/Library/Frameworks/Python.framework/Versions/3.6/lib/tk8.6/tclIndex',
   'DATA'),
  ('tcl/opt0.4/optparse.tcl',
   '/Library/Frameworks/Python.framework/Versions/3.6/lib/tcl8.6/opt0.4/optparse.tcl',
   'DATA'),
  ('tk/scale.tcl',
   '/Library/Frameworks/Python.framework/Versions/3.6/lib/tk8.6/scale.tcl',
   'DATA'),
  ('tk/panedwindow.tcl',
   '/Library/Frameworks/Python.framework/Versions/3.6/lib/tk8.6/panedwindow.tcl',
   'DATA'),
  ('tk/images/logo100.gif',
   '/Library/Frameworks/Python.framework/Versions/3.6/lib/tk8.6/images/logo100.gif',
   'DATA'),
  ('tcl/encoding/iso8859-8.enc',
   '/Library/Frameworks/Python.framework/Versions/3.6/lib/tcl8.6/encoding/iso8859-8.enc',
   'DATA'),
  ('tcl/msgs/es_bo.msg',
   '/Library/Frameworks/Python.framework/Versions/3.6/lib/tcl8.6/msgs/es_bo.msg',
   'DATA'),
  ('tcl/encoding/symbol.enc',
   '/Library/Frameworks/Python.framework/Versions/3.6/lib/tcl8.6/encoding/symbol.enc',
   'DATA'),
  ('tk/mkpsenc.tcl',
   '/Library/Frameworks/Python.framework/Versions/3.6/lib/tk8.6/mkpsenc.tcl',
   'DATA'),
  ('tk/msgs/fr.msg',
   '/Library/Frameworks/Python.framework/Versions/3.6/lib/tk8.6/msgs/fr.msg',
   'DATA'),
  ('tcl/msgs/gv.msg',
   '/Library/Frameworks/Python.framework/Versions/3.6/lib/tcl8.6/msgs/gv.msg',
   'DATA'),
  ('tcl/msgs/es.msg',
   '/Library/Frameworks/Python.framework/Versions/3.6/lib/tcl8.6/msgs/es.msg',
   'DATA'),
  ('cv2/load_config_py3.py',
   '/Library/Frameworks/Python.framework/Versions/3.6/lib/python3.6/site-packages/cv2/load_config_py3.py',
   'DATA'),
  ('tcl/msgs/hi.msg',
   '/Library/Frameworks/Python.framework/Versions/3.6/lib/tcl8.6/msgs/hi.msg',
   'DATA'),
  ('tcl/msgs/af_za.msg',
   '/Library/Frameworks/Python.framework/Versions/3.6/lib/tcl8.6/msgs/af_za.msg',
   'DATA'),
  ('tk/ttk/scale.tcl',
   '/Library/Frameworks/Python.framework/Versions/3.6/lib/tk8.6/ttk/scale.tcl',
   'DATA'),
  ('tcl/encoding/jis0201.enc',
   '/Library/Frameworks/Python.framework/Versions/3.6/lib/tcl8.6/encoding/jis0201.enc',
   'DATA'),
  ('tk/spinbox.tcl',
   '/Library/Frameworks/Python.framework/Versions/3.6/lib/tk8.6/spinbox.tcl',
   'DATA'),
  ('tk/console.tcl',
   '/Library/Frameworks/Python.framework/Versions/3.6/lib/tk8.6/console.tcl',
   'DATA'),
  ('tcl/msgs/en_nz.msg',
   '/Library/Frameworks/Python.framework/Versions/3.6/lib/tcl8.6/msgs/en_nz.msg',
   'DATA'),
  ('tcl/msgs/ru.msg',
   '/Library/Frameworks/Python.framework/Versions/3.6/lib/tcl8.6/msgs/ru.msg',
   'DATA'),
  ('tcl/msgs/en_gb.msg',
   '/Library/Frameworks/Python.framework/Versions/3.6/lib/tcl8.6/msgs/en_gb.msg',
   'DATA'),
  ('tcl/tm.tcl',
   '/Library/Frameworks/Python.framework/Versions/3.6/lib/tcl8.6/tm.tcl',
   'DATA'),
  ('tcl/msgs/be.msg',
   '/Library/Frameworks/Python.framework/Versions/3.6/lib/tcl8.6/msgs/be.msg',
   'DATA'),
  ('tcl/msgs/sq.msg',
   '/Library/Frameworks/Python.framework/Versions/3.6/lib/tcl8.6/msgs/sq.msg',
   'DATA'),
  ('tcl/tclIndex',
   '/Library/Frameworks/Python.framework/Versions/3.6/lib/tcl8.6/tclIndex',
   'DATA'),
  ('tcl/encoding/iso8859-4.enc',
   '/Library/Frameworks/Python.framework/Versions/3.6/lib/tcl8.6/encoding/iso8859-4.enc',
   'DATA'),
  ('tcl/encoding/cp932.enc',
   '/Library/Frameworks/Python.framework/Versions/3.6/lib/tcl8.6/encoding/cp932.enc',
   'DATA'),
  ('cv2/data/__init__.py',
   '/Library/Frameworks/Python.framework/Versions/3.6/lib/python3.6/site-packages/cv2/data/__init__.py',
   'DATA'),
  ('tk/xmfbox.tcl',
   '/Library/Frameworks/Python.framework/Versions/3.6/lib/tk8.6/xmfbox.tcl',
   'DATA'),
  ('tcl/encoding/macRoman.enc',
   '/Library/Frameworks/Python.framework/Versions/3.6/lib/tcl8.6/encoding/macRoman.enc',
   'DATA'),
  ('tcl/encoding/koi8-u.enc',
   '/Library/Frameworks/Python.framework/Versions/3.6/lib/tcl8.6/encoding/koi8-u.enc',
   'DATA'),
  ('tcl/encoding/tis-620.enc',
   '/Library/Frameworks/Python.framework/Versions/3.6/lib/tcl8.6/encoding/tis-620.enc',
   'DATA'),
  ('tcl/msgs/zh_tw.msg',
   '/Library/Frameworks/Python.framework/Versions/3.6/lib/tcl8.6/msgs/zh_tw.msg',
   'DATA'),
  ('tcl/msgs/es_ar.msg',
   '/Library/Frameworks/Python.framework/Versions/3.6/lib/tcl8.6/msgs/es_ar.msg',
   'DATA'),
  ('tcl/msgs/en_zw.msg',
   '/Library/Frameworks/Python.framework/Versions/3.6/lib/tcl8.6/msgs/en_zw.msg',
   'DATA'),
  ('tcl/encoding/iso2022.enc',
   '/Library/Frameworks/Python.framework/Versions/3.6/lib/tcl8.6/encoding/iso2022.enc',
   'DATA'),
  ('tcl/encoding/ksc5601.enc',
   '/Library/Frameworks/Python.framework/Versions/3.6/lib/tcl8.6/encoding/ksc5601.enc',
   'DATA'),
  ('tcl/msgs/fr_ch.msg',
   '/Library/Frameworks/Python.framework/Versions/3.6/lib/tcl8.6/msgs/fr_ch.msg',
   'DATA'),
  ('tcl/encoding/macCroatian.enc',
   '/Library/Frameworks/Python.framework/Versions/3.6/lib/tcl8.6/encoding/macCroatian.enc',
   'DATA'),
  ('tcl/msgs/vi.msg',
   '/Library/Frameworks/Python.framework/Versions/3.6/lib/tcl8.6/msgs/vi.msg',
   'DATA'),
  ('tcl/encoding/cp860.enc',
   '/Library/Frameworks/Python.framework/Versions/3.6/lib/tcl8.6/encoding/cp860.enc',
   'DATA'),
  ('tcl/encoding/euc-jp.enc',
   '/Library/Frameworks/Python.framework/Versions/3.6/lib/tcl8.6/encoding/euc-jp.enc',
   'DATA'),
  ('tk/msgs/cs.msg',
   '/Library/Frameworks/Python.framework/Versions/3.6/lib/tk8.6/msgs/cs.msg',
   'DATA'),
  ('tcl/msgs/af.msg',
   '/Library/Frameworks/Python.framework/Versions/3.6/lib/tcl8.6/msgs/af.msg',
   'DATA'),
  ('tcl/msgs/pt_br.msg',
   '/Library/Frameworks/Python.framework/Versions/3.6/lib/tcl8.6/msgs/pt_br.msg',
   'DATA'),
  ('setuptools-39.0.1.dist-info/dependency_links.txt',
   '/Library/Frameworks/Python.framework/Versions/3.6/lib/python3.6/site-packages/setuptools-39.0.1.dist-info/dependency_links.txt',
   'DATA'),
  ('setuptools-39.0.1.dist-info/WHEEL',
   '/Library/Frameworks/Python.framework/Versions/3.6/lib/python3.6/site-packages/setuptools-39.0.1.dist-info/WHEEL',
   'DATA'),
  ('setuptools-39.0.1.dist-info/METADATA',
   '/Library/Frameworks/Python.framework/Versions/3.6/lib/python3.6/site-packages/setuptools-39.0.1.dist-info/METADATA',
   'DATA'),
  ('setuptools-39.0.1.dist-info/entry_points.txt',
   '/Library/Frameworks/Python.framework/Versions/3.6/lib/python3.6/site-packages/setuptools-39.0.1.dist-info/entry_points.txt',
   'DATA'),
  ('setuptools-39.0.1.dist-info/INSTALLER',
   '/Library/Frameworks/Python.framework/Versions/3.6/lib/python3.6/site-packages/setuptools-39.0.1.dist-info/INSTALLER',
   'DATA'),
  ('setuptools-39.0.1.dist-info/top_level.txt',
   '/Library/Frameworks/Python.framework/Versions/3.6/lib/python3.6/site-packages/setuptools-39.0.1.dist-info/top_level.txt',
   'DATA'),
  ('setuptools-39.0.1.dist-info/metadata.json',
   '/Library/Frameworks/Python.framework/Versions/3.6/lib/python3.6/site-packages/setuptools-39.0.1.dist-info/metadata.json',
   'DATA'),
  ('setuptools-39.0.1.dist-info/zip-safe',
   '/Library/Frameworks/Python.framework/Versions/3.6/lib/python3.6/site-packages/setuptools-39.0.1.dist-info/zip-safe',
   'DATA'),
  ('setuptools-39.0.1.dist-info/RECORD',
   '/Library/Frameworks/Python.framework/Versions/3.6/lib/python3.6/site-packages/setuptools-39.0.1.dist-info/RECORD',
   'DATA'),
  ('setuptools-39.0.1.dist-info/LICENSE.txt',
   '/Library/Frameworks/Python.framework/Versions/3.6/lib/python3.6/site-packages/setuptools-39.0.1.dist-info/LICENSE.txt',
   'DATA'),
  ('setuptools-39.0.1.dist-info/DESCRIPTION.rst',
   '/Library/Frameworks/Python.framework/Versions/3.6/lib/python3.6/site-packages/setuptools-39.0.1.dist-info/DESCRIPTION.rst',
   'DATA')],
 False,
 False,
 False,
 [],
 'x86_64',
 None,
 None)
