module goLangPostre

go 1.15

require (
	github.com/jinzhu/gorm v1.9.16
	github.com/labstack/echo v3.3.10+incompatible
	github.com/labstack/gommon v0.3.0 // indirect
	github.com/lib/pq v1.9.0 // indirect; direct
)
