{
  "team": [
    { "name": "Adrian Hüetter", "linkedIn": "", "twitter": "", "image": "/team/suit.jpg" },
    {
      "name": "James Dunseith",
      "linkedIn": "https://www.linkedin.com/in/james-dunseith-0135651/",
      "twitter": "https://twitter.com/jamesdunseith",
      "image": "/team/james.jpg"
    },
    {
      "name": "Jingles Khok",
      "linkedIn": "https://www.linkedin.com/in/jingles/",
      "twitter": "https://twitter.com/jinglescode",
      "image": "/team/jingles.jpg"
    },
    {
      "name": "Juan Magán Valero",
      "linkedIn": "https://www.linkedin.com/in/juan-salvador-mag%C3%A1n-valero-9a071442/",
      "twitter": "",
      "image": "/team/juan.jpg"
    },
    {
      "name": "M. Ali Modiri",
      "linkedIn": "https://www.linkedin.com/in/m-a-modiri/",
      "twitter": "",
      "image": "/team/mix.jpg"
    },
    {
      "name": "Nelson Kshetrimayum",
      "linkedIn": "",
      "twitter": "https://twitter.com/nelson_ksh",
      "image": "/team/nelson.jpg"
    },
    {
      "name": "Roberto Mayen Hess",
      "linkedIn": "https://www.linkedin.com/in/roberto-mayen-hess/",
      "twitter": "",
      "image": "/team/roberto.jpg"
    },
    {
      "name": "Sebastian Pabon",
      "linkedIn": "https://www.linkedin.com/in/ing-sebastian-pabon/",
      "twitter": "https://twitter.com/SebastianPabonB",
      "image": "/team/sebastian.jpg"
    }
  ]
}
