<svg width="145" height="42" viewBox="0 0 145 42" fill="none" xmlns="http://www.w3.org/2000/svg">
<path d="M144.869 17.5572C145.113 19.2051 144.862 20.8883 144.149 22.3939C143.436 23.8995 142.293 25.1598 140.864 26.0157C139.435 26.8715 137.784 27.2844 136.12 27.2021C134.456 27.1198 132.854 26.546 131.517 25.5532C130.179 24.5605 129.166 23.1934 128.605 21.6248C128.044 20.0562 127.961 18.3566 128.366 16.7408C128.771 15.125 129.646 13.6656 130.881 12.5471C132.115 11.4286 133.654 10.7013 135.302 10.4571C136.396 10.2937 137.512 10.3478 138.586 10.6163C139.66 10.8849 140.67 11.3626 141.558 12.0222C142.447 12.6817 143.197 13.5101 143.765 14.4599C144.333 15.4097 144.708 16.4622 144.869 17.5572Z" fill="#F28F3D"/>
<path d="M17.0488 16.8509C17.8552 17.5912 18.4968 18.4927 18.9321 19.497C18.9321 19.497 20.161 5.81002 37.3227 0C32.7726 0.810378 28.5113 2.78978 24.957 5.74399C21.4027 8.69819 18.6775 12.5257 17.0488 16.8509V16.8509Z" fill="#F28F3D"/>
<path d="M15.4997 41.0232C15.4997 41.0232 35.7829 25.8249 0 3.41821C29.4597 24.2994 15.4997 41.0232 15.4997 41.0232Z" fill="#F28F3D"/>
<path d="M19.3038 8.47968C19.4017 9.14379 19.3006 9.82204 19.0131 10.4287C18.7257 11.0353 18.2648 11.5431 17.6888 11.8878C17.1128 12.2326 16.4475 12.3988 15.777 12.3655C15.1065 12.3322 14.461 12.1009 13.922 11.7007C13.383 11.3006 12.9747 10.7496 12.7488 10.1175C12.5229 9.48532 12.4895 8.80039 12.6528 8.14925C12.816 7.49812 13.1687 6.91002 13.6662 6.4593C14.1637 6.00858 14.7837 5.71547 15.4477 5.61705C15.889 5.55101 16.3389 5.57273 16.7718 5.68097C17.2046 5.7892 17.6118 5.98181 17.9701 6.24777C18.3283 6.51372 18.6306 6.84777 18.8594 7.23077C19.0883 7.61378 19.2393 8.03819 19.3038 8.47968V8.47968Z" fill="#F28F3D"/>
<path d="M26.894 13.3903C27.9938 13.3852 29.0702 13.7074 29.9863 14.316C30.9024 14.9245 31.6167 15.7919 32.0382 16.8077C32.4598 17.8235 32.5696 18.9418 32.3536 20.0202C32.1376 21.0985 31.6057 22.0883 30.8254 22.8634C30.314 23.384 29.704 23.7975 29.031 24.0798C28.358 24.362 27.6356 24.5074 26.9058 24.5074C26.176 24.5074 25.4535 24.362 24.7806 24.0798C24.1076 23.7975 23.4976 23.384 22.9861 22.8634C22.2122 22.0889 21.685 21.1026 21.4711 20.0288C21.2571 18.9551 21.3661 17.842 21.7842 16.8301C22.2022 15.8182 22.9107 14.9528 23.8201 14.3431C24.7295 13.7334 25.7991 13.4068 26.894 13.4044V13.3903ZM26.894 14.8028C25.9391 14.8047 25.0144 15.1375 24.2772 15.7445C23.5401 16.3516 23.0362 17.1953 22.8512 18.1322C22.6662 19.069 22.8117 20.041 23.2628 20.8826C23.7139 21.7243 24.4428 22.3835 25.3254 22.7482C26.2079 23.1128 27.1896 23.1603 28.1032 22.8826C29.0168 22.6048 29.8059 22.019 30.3362 21.2249C30.8665 20.4307 31.1051 19.4773 31.0114 18.527C30.9178 17.5767 30.4976 16.6882 29.8226 16.0128C29.4427 15.6222 28.9869 15.3133 28.4833 15.1052C27.9797 14.8972 27.4389 14.7942 26.894 14.8028V14.8028Z" fill="#F28F3D"/>
<path d="M41.9791 13.6729V24.1864L40.7738 23.2071C40.3934 23.6161 39.9307 23.9399 39.4163 24.1574C38.9018 24.3749 38.3471 24.4811 37.7887 24.4689C37.2364 24.4772 36.688 24.3744 36.1761 24.1667C35.6642 23.959 35.1993 23.6506 34.8089 23.2597C34.4185 22.8689 34.1106 22.4036 33.9035 21.8915C33.6963 21.3794 33.5942 20.8309 33.6031 20.2786V13.687H35.0156V20.2786C35.01 20.6465 35.0812 21.0116 35.2247 21.3505C35.3682 21.6894 35.5808 21.9946 35.8489 22.2466C36.1024 22.5035 36.4045 22.7074 36.7375 22.8464C37.0705 22.9854 37.4279 23.0568 37.7887 23.0565C38.1618 23.066 38.5327 22.9963 38.8769 22.8518C39.221 22.7073 39.5306 22.4914 39.785 22.2184C40.2913 21.7002 40.5723 21.003 40.5666 20.2786V13.687L41.9791 13.6729Z" fill="#F28F3D"/>
<path d="M49.0227 13.6446L48.3824 14.9064C48.14 14.8318 47.8872 14.7969 47.6338 14.8029C47.2727 14.7917 46.9133 14.8569 46.5791 14.994C46.2448 15.1311 45.9432 15.3371 45.694 15.5986C45.2036 16.1023 44.9312 16.7789 44.9359 17.4819V24.1676H43.5234V13.6729L44.7052 14.6145C45.079 14.2143 45.5331 13.8976 46.0377 13.685C46.5424 13.4724 47.0863 13.3688 47.6338 13.381C48.1096 13.3761 48.5817 13.4657 49.0227 13.6446V13.6446Z" fill="#F28F3D"/>
<path d="M67.5968 24.4972H63.1381V16.6296H57.0691V24.4972H52.6104V6.74695H57.0691V13.2444H63.1381V6.74695H67.5968V24.4972Z" fill="#A3CF44"/>
<path d="M77.4 24.855C74.8732 24.855 72.935 24.2508 71.5853 23.0423C70.2356 21.8339 69.5623 20.1075 69.5654 17.8632C69.5654 15.666 70.1932 13.9208 71.4488 12.6276C72.7043 11.3344 74.4699 10.6894 76.7456 10.6925C78.7952 10.6925 80.3364 11.245 81.3691 12.3498C82.4018 13.4547 82.9181 15.0367 82.9181 17.0958V18.5977H73.7511C73.7675 19.1384 73.9025 19.6688 74.1466 20.1515C74.3524 20.5523 74.6551 20.8953 75.027 21.1496C75.4058 21.4039 75.8291 21.5844 76.2747 21.6816C76.7886 21.7907 77.3126 21.8444 77.8379 21.8417C78.3131 21.8391 78.7866 21.7854 79.2504 21.6816C79.6914 21.5817 80.1218 21.4398 80.5357 21.2579C80.8595 21.1216 81.1741 20.9643 81.4774 20.7871C81.7693 20.6129 82.0047 20.4575 82.1883 20.3162H82.6309V23.7627L81.6893 24.1394C81.3103 24.2828 80.9217 24.3992 80.5263 24.4878C80.0616 24.6103 79.5899 24.7047 79.1138 24.7703C78.545 24.8357 77.9725 24.864 77.4 24.855V24.855ZM78.7843 16.0835C78.81 15.3602 78.5892 14.6497 78.1581 14.0684C77.9346 13.8265 77.6592 13.6386 77.3525 13.5187C77.0458 13.3988 76.716 13.3501 76.3877 13.3762C76.0406 13.3587 75.6936 13.4142 75.3692 13.5391C75.0448 13.664 74.7502 13.8555 74.5044 14.1013C74.0229 14.6498 73.7555 15.3536 73.7511 16.0835H78.7843Z" fill="#A3CF44"/>
<path d="M92.9136 23.08L92.1414 23.725C91.8607 23.943 91.5558 24.1278 91.2328 24.2759C90.4413 24.6936 89.5508 24.8874 88.6573 24.8362C88.1087 24.8568 87.5617 24.7633 87.0511 24.5615C86.5405 24.3596 86.0774 24.054 85.6911 23.6638C85.3024 23.2684 84.9978 22.7984 84.7955 22.2822C84.5932 21.766 84.4975 21.2141 84.514 20.6599C84.4768 19.8155 84.6844 18.9784 85.112 18.2493C85.5369 17.6126 86.1325 17.1085 86.8305 16.7944C87.6882 16.4022 88.6014 16.1449 89.5378 16.0317C90.583 15.8904 91.7114 15.779 92.923 15.6974V15.6268C92.9523 15.3194 92.8902 15.0102 92.7445 14.738C92.5987 14.4658 92.3758 14.2426 92.1038 14.0966C91.3308 13.7701 90.4932 13.6251 89.6555 13.6728C89.0703 13.6865 88.4893 13.7768 87.9275 13.9412C87.266 14.1209 86.6191 14.3507 85.9924 14.6286H85.6346V11.394C86.0489 11.2779 86.7175 11.1367 87.6403 10.9703C88.5607 10.8088 89.4932 10.7269 90.4276 10.7255C92.7347 10.7255 94.414 11.11 95.4655 11.879C96.5201 12.6464 97.0475 13.8141 97.0475 15.3914V24.4972H92.8995L92.9136 23.08ZM92.9136 21.0036V18.2163C92.2027 18.287 91.633 18.3482 91.1951 18.4C90.7564 18.4527 90.3251 18.5554 89.9097 18.706C89.5743 18.8125 89.2767 19.0136 89.0528 19.2851C88.8373 19.5842 88.7309 19.9482 88.7515 20.3162C88.7222 20.5566 88.7533 20.8005 88.8421 21.0257C88.9309 21.251 89.0746 21.4506 89.26 21.6063C89.7106 21.8715 90.2308 21.9945 90.7525 21.9594C91.1392 21.9538 91.5206 21.8689 91.8731 21.7099C92.2599 21.5395 92.6125 21.3002 92.9136 21.0036V21.0036Z" fill="#A3CF44"/>
<path d="M103.836 24.4973H99.6602V5.94666H103.836V24.4973Z" fill="#A3CF44"/>
<path d="M112.156 24.7467C110.454 24.7467 109.216 24.3967 108.441 23.6968C107.669 22.9999 107.278 21.8558 107.278 20.2644V14.0165H105.682V11.0927H107.278V7.28369H111.454V11.0927H115.47V14.0024H111.454V18.7625C111.454 19.2333 111.454 19.6429 111.454 19.9913C111.458 20.3146 111.524 20.6341 111.647 20.933C111.76 21.2158 111.968 21.4505 112.236 21.5969C112.62 21.7807 113.044 21.8649 113.469 21.8417C113.766 21.8312 114.061 21.7821 114.345 21.6957C114.606 21.6361 114.86 21.5493 115.103 21.4368H115.461V24.3795C114.986 24.5016 114.505 24.5959 114.02 24.662C113.401 24.729 112.778 24.7573 112.156 24.7467V24.7467Z" fill="#A3CF44"/>
<path d="M129.722 24.4973H125.523V17.8586C125.523 17.3172 125.499 16.7804 125.457 16.2437C125.444 15.8371 125.361 15.4357 125.212 15.0572C125.092 14.7682 124.873 14.5312 124.595 14.3886C124.252 14.2431 123.88 14.1756 123.507 14.1909C123.154 14.1925 122.803 14.2562 122.472 14.3792C122.073 14.533 121.696 14.7388 121.351 14.9913V24.4973H117.175V5.94666H121.351V12.5853C121.963 12.0548 122.636 11.5995 123.357 11.2293C124.027 10.9057 124.764 10.7444 125.508 10.7585C126.092 10.7212 126.677 10.8166 127.218 11.0376C127.76 11.2586 128.244 11.5994 128.635 12.0345C129.36 12.8945 129.722 14.1501 129.722 15.8011V24.4973Z" fill="#A3CF44"/>
<path d="M131.618 20.0695L131.205 22.4469H130.12L131.231 16.0485L133.446 16.0529C134.114 16.0529 134.639 16.236 135.02 16.6022C135.4 16.9655 135.566 17.4474 135.516 18.048C135.463 18.6691 135.21 19.1627 134.756 19.5289C134.302 19.8922 133.707 20.0739 132.972 20.0739L131.618 20.0695ZM131.772 19.1774L133.016 19.1862C133.408 19.1862 133.729 19.0865 133.978 18.8873C134.23 18.6881 134.381 18.4098 134.431 18.0524C134.472 17.7272 134.41 17.4664 134.246 17.2701C134.085 17.0709 133.84 16.964 133.512 16.9493L132.159 16.9449L131.772 19.1774ZM138.665 18.6676C138.53 18.6383 138.394 18.6237 138.256 18.6237C137.799 18.6119 137.436 18.8009 137.166 19.1906L136.595 22.4469H135.554L136.375 17.692L137.364 17.6876L137.259 18.2281C137.584 17.7975 137.959 17.5865 138.384 17.5953C138.48 17.5953 138.614 17.6173 138.784 17.6613L138.665 18.6676ZM138.667 20.0519C138.717 19.5861 138.853 19.1627 139.076 18.7819C139.301 18.401 139.59 18.1066 139.942 17.8986C140.293 17.6906 140.683 17.5924 141.111 17.6041C141.518 17.61 141.869 17.7184 142.165 17.9293C142.461 18.1403 142.676 18.4288 142.811 18.795C142.949 19.1613 142.997 19.5685 142.956 20.0167C142.909 20.5206 142.772 20.9659 142.543 21.3527C142.318 21.7394 142.028 22.0367 141.673 22.2448C141.321 22.4498 140.93 22.5465 140.5 22.5348C140.095 22.5289 139.745 22.422 139.449 22.214C139.156 22.0031 138.941 21.7159 138.803 21.3527C138.666 20.9865 138.616 20.5836 138.654 20.1442L138.667 20.0519ZM139.691 20.6539C139.706 20.9615 139.786 21.2091 139.933 21.3966C140.082 21.5812 140.289 21.6779 140.552 21.6866C140.91 21.6954 141.209 21.5577 141.449 21.2736C141.692 20.9894 141.844 20.6012 141.906 20.109L141.932 19.6783C141.932 19.3033 141.858 19.0089 141.708 18.795C141.559 18.5812 141.342 18.4684 141.058 18.4567C140.612 18.4449 140.261 18.6632 140.003 19.1115C139.848 19.3839 139.75 19.6974 139.709 20.0519C139.685 20.298 139.679 20.4987 139.691 20.6539Z" fill="#F5F5F5"/>
</svg>
