<?xml version="1.0" encoding="UTF-8" standalone="no"?>
<!-- Created with Inkscape (http://www.inkscape.org/) -->

<svg
   xmlns:dc="http://purl.org/dc/elements/1.1/"
   xmlns:cc="http://creativecommons.org/ns#"
   xmlns:rdf="http://www.w3.org/1999/02/22-rdf-syntax-ns#"
   xmlns:svg="http://www.w3.org/2000/svg"
   xmlns="http://www.w3.org/2000/svg"
   xmlns:sodipodi="http://sodipodi.sourceforge.net/DTD/sodipodi-0.dtd"
   xmlns:inkscape="http://www.inkscape.org/namespaces/inkscape"
   width="48"
   height="48"
   viewBox="0 0 12.7 12.7"
   version="1.1"
   id="svg3729"
   sodipodi:docname="rename-green.svg"
   inkscape:version="0.92.4 5da689c313, 2019-01-14">
  <defs
     id="defs3723" />
  <sodipodi:namedview
     id="base"
     pagecolor="#ffffff"
     bordercolor="#666666"
     borderopacity="1.0"
     inkscape:pageopacity="0.0"
     inkscape:pageshadow="2"
     inkscape:zoom="13.892291"
     inkscape:cx="-14.725761"
     inkscape:cy="19.900134"
     inkscape:document-units="mm"
     inkscape:current-layer="layer1"
     showgrid="true"
     showguides="false"
     units="px"
     inkscape:window-width="1890"
     inkscape:window-height="1053"
     inkscape:window-x="30"
     inkscape:window-y="0"
     inkscape:window-maximized="1">
    <inkscape:grid
       type="xygrid"
       id="grid3731" />
  </sodipodi:namedview>
  <metadata
     id="metadata3726">
    <rdf:RDF>
      <cc:Work
         rdf:about="">
        <dc:format>image/svg+xml</dc:format>
        <dc:type
           rdf:resource="http://purl.org/dc/dcmitype/StillImage" />
        <dc:title />
      </cc:Work>
    </rdf:RDF>
  </metadata>
  <g
     inkscape:label="Layer 1"
     inkscape:groupmode="layer"
     id="layer1"
     transform="translate(0,-284.30001)">
    <path
       style="fill:#eff0f1;fill-opacity:1;stroke-width:0.34642097"
       d="m 2.1166666,287.47501 c -0.146585,0 -0.2645833,0.20228 -0.2645833,0.45358 v 5.44286 c 0,0.25128 0.1179983,0.45356 0.2645833,0.45356 h 4.7625 v -0.45356 h -4.365625 c -0.219878,0 -0.396875,-0.30343 -0.396875,-0.68036 v -4.08216 c 0,-0.37692 0.176997,-0.68034 0.396875,-0.68034 h 4.365625 v -0.45358 z m 5.8208333,0 v 0.45358 H 10.31875 c 0.146585,0 0.264583,0.20228 0.264583,0.45356 v 4.53572 c 0,0.2513 -0.117998,0.45358 -0.264583,0.45358 H 7.9374999 v 0.45356 h 2.6458331 c 0.146585,0 0.264584,-0.20228 0.264584,-0.45356 v -5.44286 c 0,-0.2513 -0.117999,-0.45358 -0.264584,-0.45358 z"
       id="rect819"
       inkscape:connector-curvature="0" />
    <path
       style="fill:#eff0f1;fill-opacity:1;stroke-width:1.45773768"
       d="M 12.125 15 C 10.947703 15 10 15.947703 10 17.125 L 10 29.875 C 10 31.052297 10.947703 32 12.125 32 L 16 32 L 16 23 L 15 23 L 12 23 L 12 18 L 15 18 L 15 15 L 12.125 15 z M 17 23 L 17 32 L 19 32 L 19 30 L 22 30 L 22 32 L 23.875 32 C 25.052297 32 26 31.052297 26 29.875 L 26 23 L 17 23 z "
       transform="matrix(0.26458333,0,0,0.26458333,0,284.30001)"
       id="rect16" />
    <rect
       style="fill:#27ae60;fill-opacity:1;stroke-width:0.3289203"
       id="rect864"
       width="0.52916664"
       height="8.9958372"
       x="7.1437497"
       y="286.1521"
       ry="0.40890166" />
    <rect
       style="fill:#27ae60;fill-opacity:1;stroke-width:0.26458332"
       id="rect866"
       width="1.5875"
       height="0.52916664"
       x="6.6145835"
       y="286.1521"
       ry="0.26458332" />
    <rect
       style="fill:#27ae60;fill-opacity:1;stroke-width:0.32404706"
       id="rect868"
       width="1.5874999"
       height="0.52916664"
       x="6.614583"
       y="294.61877"
       ry="0.26458332" />
    <rect
       style="fill:#eff0f1;fill-opacity:1;stroke-width:0.26458332"
       id="rect825"
       width="0.79374999"
       height="2.3812499"
       x="5.2916665"
       y="289.0625" />
  </g>
  <g
     inkscape:groupmode="layer"
     id="layer2"
     inkscape:label="Layer 2"
     transform="translate(0,-284.30001)" />
</svg>
