<?xml version="1.0" encoding="UTF-8" standalone="no"?>
<!-- Created with Inkscape (http://www.inkscape.org/) -->

<svg
   xmlns:dc="http://purl.org/dc/elements/1.1/"
   xmlns:cc="http://creativecommons.org/ns#"
   xmlns:rdf="http://www.w3.org/1999/02/22-rdf-syntax-ns#"
   xmlns:svg="http://www.w3.org/2000/svg"
   xmlns="http://www.w3.org/2000/svg"
   xmlns:sodipodi="http://sodipodi.sourceforge.net/DTD/sodipodi-0.dtd"
   xmlns:inkscape="http://www.inkscape.org/namespaces/inkscape"
   width="48"
   height="48"
   viewBox="0 0 12.7 12.7"
   version="1.1"
   id="svg3729"
   sodipodi:docname="toggle.svg"
   inkscape:version="0.92.4 5da689c313, 2019-01-14">
  <defs
     id="defs3723" />
  <sodipodi:namedview
     id="base"
     pagecolor="#ffffff"
     bordercolor="#666666"
     borderopacity="1.0"
     inkscape:pageopacity="0.0"
     inkscape:pageshadow="2"
     inkscape:zoom="13.892291"
     inkscape:cx="9.7482445"
     inkscape:cy="20.332028"
     inkscape:document-units="mm"
     inkscape:current-layer="layer1"
     showgrid="true"
     showguides="false"
     units="px"
     inkscape:window-width="1890"
     inkscape:window-height="1053"
     inkscape:window-x="30"
     inkscape:window-y="0"
     inkscape:window-maximized="1">
    <inkscape:grid
       type="xygrid"
       id="grid3731" />
  </sodipodi:namedview>
  <metadata
     id="metadata3726">
    <rdf:RDF>
      <cc:Work
         rdf:about="">
        <dc:format>image/svg+xml</dc:format>
        <dc:type
           rdf:resource="http://purl.org/dc/dcmitype/StillImage" />
        <dc:title />
      </cc:Work>
    </rdf:RDF>
  </metadata>
  <g
     inkscape:label="Layer 1"
     inkscape:groupmode="layer"
     id="layer1"
     transform="translate(0,-284.30001)">
    <path
       style="fill:#4d4d4d;fill-opacity:1;stroke-width:0.99999994"
       d="M 8 17 C 7.4459778 17 7 17.445978 7 18 L 7 30 C 7 30.554022 7.4459778 31 8 31 L 40 31 C 40.554022 31 41 30.554022 41 30 L 41 18 C 41 17.445978 40.554022 17 40 17 L 8 17 z M 9.5 18 L 26.5 18 C 27.331035 18 28 18.668965 28 19.5 L 28 28.5 C 28 29.331035 27.331035 30 26.5 30 L 9.5 30 C 8.6689649 30 8 29.331035 8 28.5 L 8 19.5 C 8 18.668965 8.6689649 18 9.5 18 z "
       transform="matrix(0.26458333,0,0,0.26458333,0,284.30001)"
       id="rect819" />
    <rect
       style="fill:#4d4d4d;fill-opacity:1;stroke-width:0.26458338"
       id="rect16"
       width="4.2333336"
       height="2.1166673"
       x="2.6458333"
       y="289.59167"
       ry="0.26459402" />
  </g>
  <g
     inkscape:groupmode="layer"
     id="layer2"
     inkscape:label="Layer 2"
     transform="translate(0,-284.30001)" />
</svg>
