<?xml version="1.0" encoding="UTF-8" standalone="no"?>
<!-- Created with Inkscape (http://www.inkscape.org/) -->

<svg
   xmlns:dc="http://purl.org/dc/elements/1.1/"
   xmlns:cc="http://creativecommons.org/ns#"
   xmlns:rdf="http://www.w3.org/1999/02/22-rdf-syntax-ns#"
   xmlns:svg="http://www.w3.org/2000/svg"
   xmlns="http://www.w3.org/2000/svg"
   xmlns:sodipodi="http://sodipodi.sourceforge.net/DTD/sodipodi-0.dtd"
   xmlns:inkscape="http://www.inkscape.org/namespaces/inkscape"
   width="48"
   height="48"
   viewBox="0 0 12.7 12.7"
   version="1.1"
   id="svg3729"
   sodipodi:docname="pause.svg"
   inkscape:version="0.92.4 5da689c313, 2019-01-14">
  <defs
     id="defs3723">
    <clipPath
       clipPathUnits="userSpaceOnUse"
       id="clipPath4087">
      <ellipse
         id="ellipse4089"
         cx="6.3397431"
         cy="290.64154"
         rx="5.5459933"
         ry="5.5477529"
         style="stroke-width:0.24026173" />
    </clipPath>
    <clipPath
       clipPathUnits="userSpaceOnUse"
       id="clipPath4087-3">
      <ellipse
         id="ellipse4089-6"
         cx="6.3397431"
         cy="290.64154"
         rx="5.5459933"
         ry="5.5477529"
         style="stroke-width:0.24026173" />
    </clipPath>
  </defs>
  <sodipodi:namedview
     id="base"
     pagecolor="#ffffff"
     bordercolor="#666666"
     borderopacity="1.0"
     inkscape:pageopacity="0.0"
     inkscape:pageshadow="2"
     inkscape:zoom="13.892291"
     inkscape:cx="-11.832845"
     inkscape:cy="19.750967"
     inkscape:document-units="mm"
     inkscape:current-layer="layer1"
     showgrid="true"
     showguides="false"
     units="px"
     inkscape:window-width="1890"
     inkscape:window-height="1053"
     inkscape:window-x="30"
     inkscape:window-y="0"
     inkscape:window-maximized="1">
    <inkscape:grid
       type="xygrid"
       id="grid3731" />
  </sodipodi:namedview>
  <metadata
     id="metadata3726">
    <rdf:RDF>
      <cc:Work
         rdf:about="">
        <dc:format>image/svg+xml</dc:format>
        <dc:type
           rdf:resource="http://purl.org/dc/dcmitype/StillImage" />
        <dc:title />
      </cc:Work>
    </rdf:RDF>
  </metadata>
  <g
     inkscape:label="Layer 1"
     inkscape:groupmode="layer"
     id="layer1"
     transform="translate(0,-284.30001)">
    <path
       style="stroke-width:1.31668985;fill:#4d4d4d;fill-opacity:1"
       d="M 24.035156 3 A 21.03489 21.078635 0 0 0 3 24.078125 A 21.03489 21.078635 0 0 0 24.035156 45.158203 A 21.03489 21.078635 0 0 0 45.070312 24.078125 A 21.03489 21.078635 0 0 0 24.035156 3 z M 23.943359 6.0234375 A 17.919163 17.991143 0 0 1 41.861328 24.013672 A 17.919163 17.991143 0 0 1 23.943359 42.005859 A 17.919163 17.991143 0 0 1 6.0234375 24.013672 A 17.919163 17.991143 0 0 1 23.943359 6.0234375 z "
       transform="matrix(0.26458333,0,0,0.26458333,0,284.30001)"
       id="path4097" />
    <ellipse
       id="path3960"
       cx="6.3499999"
       cy="290.65747"
       rx="5.5562501"
       ry="5.5637212"
       style="display:none;stroke-width:0.25867385" />
    <text
       xml:space="preserve"
       style="font-style:normal;font-weight:normal;font-size:10.58333302px;line-height:1.25;font-family:sans-serif;letter-spacing:0px;word-spacing:0px;fill:#4d4d4d;fill-opacity:1;stroke:none;stroke-width:0.26458332;"
       x="-4.4979167"
       y="287.73959"
       id="text4060"><tspan
         sodipodi:role="line"
         id="tspan4058"
         x="-4.4979167"
         y="297.10336"
         style="stroke-width:0.26458332;fill:#4d4d4d;fill-opacity:1;" /></text>
    <text
       xml:space="preserve"
       style="font-style:normal;font-weight:normal;font-size:10.58333302px;line-height:1.25;font-family:sans-serif;letter-spacing:0px;word-spacing:0px;fill:#4d4d4d;fill-opacity:1;stroke:none;stroke-width:0.26458332;"
       x="0.79374999"
       y="296.20627"
       id="text4064"><tspan
         sodipodi:role="line"
         id="tspan4062"
         x="0.79374999"
         y="305.57004"
         style="stroke-width:0.26458332;fill:#4d4d4d;fill-opacity:1;" /></text>
    <path
       style="stroke-width:0.99999994;fill:#4d4d4d;fill-opacity:1"
       d="M 15 15 L 15 33 L 20 33 L 20 15 L 15 15 z M 28 15 L 28 33 L 33 33 L 33 15 L 28 15 z "
       transform="matrix(0.26458333,0,0,0.26458333,0,284.30001)"
       id="rect77" />
  </g>
  <g
     inkscape:groupmode="layer"
     id="layer2"
     inkscape:label="Layer 2"
     transform="translate(0,-284.30001)" />
</svg>
