<?xml version="1.0" encoding="UTF-8" standalone="no"?>
<!-- Created with Inkscape (http://www.inkscape.org/) -->

<svg
   xmlns:dc="http://purl.org/dc/elements/1.1/"
   xmlns:cc="http://creativecommons.org/ns#"
   xmlns:rdf="http://www.w3.org/1999/02/22-rdf-syntax-ns#"
   xmlns:svg="http://www.w3.org/2000/svg"
   xmlns="http://www.w3.org/2000/svg"
   xmlns:sodipodi="http://sodipodi.sourceforge.net/DTD/sodipodi-0.dtd"
   xmlns:inkscape="http://www.inkscape.org/namespaces/inkscape"
   width="48"
   height="48"
   viewBox="0 0 12.7 12.7"
   version="1.1"
   id="svg3729"
   sodipodi:docname="columns-blue.svg"
   inkscape:version="0.92.4 (5da689c313, 2019-01-14)">
  <defs
     id="defs3723" />
  <sodipodi:namedview
     id="base"
     pagecolor="#ffffff"
     bordercolor="#666666"
     borderopacity="1.0"
     inkscape:pageopacity="0.0"
     inkscape:pageshadow="2"
     inkscape:zoom="13.892291"
     inkscape:cx="-0.94689612"
     inkscape:cy="26.090618"
     inkscape:document-units="mm"
     inkscape:current-layer="layer1"
     showgrid="true"
     showguides="false"
     units="px"
     inkscape:window-width="1920"
     inkscape:window-height="1027"
     inkscape:window-x="1912"
     inkscape:window-y="-8"
     inkscape:window-maximized="1">
    <inkscape:grid
       type="xygrid"
       id="grid3731" />
  </sodipodi:namedview>
  <metadata
     id="metadata3726">
    <rdf:RDF>
      <cc:Work
         rdf:about="">
        <dc:format>image/svg+xml</dc:format>
        <dc:type
           rdf:resource="http://purl.org/dc/dcmitype/StillImage" />
        <dc:title />
      </cc:Work>
    </rdf:RDF>
  </metadata>
  <g
     inkscape:label="Layer 1"
     inkscape:groupmode="layer"
     id="layer1"
     transform="translate(0,-284.30001)">
    <rect
       id="rect3774"
       width="10.054158"
       height="1.0583314"
       x="-296.20624"
       y="5.8208342"
       style="fill:#4d4d4d;fill-opacity:1;stroke-width:0.20387487"
       transform="rotate(-90)" />
    <rect
       id="rect3774-3"
       width="10.054158"
       height="1.0583314"
       x="-296.20627"
       y="4.2333403"
       style="fill:#4d4d4d;fill-opacity:1;stroke-width:0.20387487"
       transform="rotate(-90)" />
    <rect
       id="rect3774-6"
       width="10.054158"
       height="1.0583314"
       x="-296.20624"
       y="2.6458464"
       style="fill:#4d4d4d;fill-opacity:1;stroke-width:0.20387487"
       transform="rotate(-90)" />
    <rect
       id="rect3774-7"
       width="10.054158"
       height="1.0583314"
       x="-296.20624"
       y="1.0583525"
       style="fill:#4d4d4d;fill-opacity:1;stroke-width:0.20387487"
       transform="rotate(-90)" />
    <rect
       id="rect3774-35"
       width="10.054158"
       height="2.6458638"
       x="-296.20624"
       y="7.4083281"
       style="fill:#4d4d4d;fill-opacity:1;stroke-width:0.32235664"
       transform="rotate(-90)" />
    <rect
       id="rect3774-62"
       width="10.054158"
       height="1.0583314"
       x="-296.20627"
       y="10.583316"
       style="fill:#4d4d4d;fill-opacity:1;stroke-width:0.20387486"
       transform="rotate(-90)" />
    <rect
       id="rect3774-7-9"
       width="0.7937724"
       height="10.583333"
       x="-285.88751"
       y="1.0583333"
       style="fill:#3daee9;fill-opacity:1;stroke-width:0.18115038"
       transform="rotate(-90)" />
  </g>
  <g
     inkscape:groupmode="layer"
     id="layer2"
     inkscape:label="Layer 2"
     transform="translate(0,-284.30001)" />
</svg>
