<?xml version="1.0" encoding="UTF-8" standalone="no"?>
<!-- Created with Inkscape (http://www.inkscape.org/) -->

<svg
   xmlns:dc="http://purl.org/dc/elements/1.1/"
   xmlns:cc="http://creativecommons.org/ns#"
   xmlns:rdf="http://www.w3.org/1999/02/22-rdf-syntax-ns#"
   xmlns:svg="http://www.w3.org/2000/svg"
   xmlns="http://www.w3.org/2000/svg"
   xmlns:sodipodi="http://sodipodi.sourceforge.net/DTD/sodipodi-0.dtd"
   xmlns:inkscape="http://www.inkscape.org/namespaces/inkscape"
   width="48"
   height="48"
   viewBox="0 0 12.7 12.7"
   version="1.1"
   id="svg3729"
   sodipodi:docname="previous.svg"
   inkscape:version="0.92.4 (5da689c313, 2019-01-14)">
  <defs
     id="defs3723">
    <clipPath
       clipPathUnits="userSpaceOnUse"
       id="clipPath4087">
      <ellipse
         id="ellipse4089"
         cx="6.3397431"
         cy="290.64154"
         rx="5.5459933"
         ry="5.5477529"
         style="stroke-width:0.24026173" />
    </clipPath>
    <clipPath
       clipPathUnits="userSpaceOnUse"
       id="clipPath4087-3">
      <ellipse
         id="ellipse4089-6"
         cx="6.3397431"
         cy="290.64154"
         rx="5.5459933"
         ry="5.5477529"
         style="stroke-width:0.24026173" />
    </clipPath>
  </defs>
  <sodipodi:namedview
     id="base"
     pagecolor="#ffffff"
     bordercolor="#666666"
     borderopacity="1.0"
     inkscape:pageopacity="0.0"
     inkscape:pageshadow="2"
     inkscape:zoom="16"
     inkscape:cx="22.623863"
     inkscape:cy="10.115893"
     inkscape:document-units="mm"
     inkscape:current-layer="layer1"
     showgrid="true"
     showguides="false"
     units="px"
     inkscape:window-width="1920"
     inkscape:window-height="1027"
     inkscape:window-x="3832"
     inkscape:window-y="-8"
     inkscape:window-maximized="1">
    <inkscape:grid
       type="xygrid"
       id="grid3731" />
  </sodipodi:namedview>
  <metadata
     id="metadata3726">
    <rdf:RDF>
      <cc:Work
         rdf:about="">
        <dc:format>image/svg+xml</dc:format>
        <dc:type
           rdf:resource="http://purl.org/dc/dcmitype/StillImage" />
        <dc:title />
      </cc:Work>
    </rdf:RDF>
  </metadata>
  <g
     inkscape:label="Layer 1"
     inkscape:groupmode="layer"
     id="layer1"
     transform="translate(0,-284.30001)">
    <path
       style="fill:#4d4d4d;fill-opacity:1;fill-rule:nonzero;stroke-width:0.34837419"
       d="m 4.7656006,295.99335 -2.8442708,-2.84427 -0.5984131,-0.59841 0.5984131,-0.59841 2.8442708,-2.84427 0.5984132,0.59893 -2.6566855,2.65668 a 4.7411118,4.7601565 45 0 0 5.0663572,-1.07745 4.7411118,4.7601565 45 0 0 0.6914309,-5.85132 l 0.6108152,-0.60875 a 5.5654812,5.5770554 45 0 1 -0.6898804,7.04866 5.5654812,5.5770554 45 0 1 -4.0235269,1.63194 5.5654812,5.5770554 45 0 1 -0.9952881,-0.10903 l 1.9967776,1.99677 z m -4.21834717,-4.07313 a 5.5654812,5.5770554 45 0 1 -0.0397908,-0.0377 5.5654812,5.5770554 45 0 1 -0.0289388,-0.031 z"
       id="path4097"
       inkscape:connector-curvature="0" />
    <ellipse
       id="path3960"
       cx="6.3499999"
       cy="290.65747"
       rx="5.5562501"
       ry="5.5637212"
       style="display:none;stroke-width:0.25867385" />
    <text
       xml:space="preserve"
       style="font-style:normal;font-weight:normal;font-size:10.58333302px;line-height:1.25;font-family:sans-serif;letter-spacing:0px;word-spacing:0px;fill:#4d4d4d;fill-opacity:1;stroke:none;stroke-width:0.26458332;fill-rule:nonzero;"
       x="-211.85918"
       y="207.11597"
       id="text4060"
       transform="rotate(-45)"><tspan
         sodipodi:role="line"
         id="tspan4058"
         x="-211.85918"
         y="216.47974"
         style="stroke-width:0.26458332;fill:#4d4d4d;fill-rule:nonzero;fill-opacity:1;" /></text>
    <text
       xml:space="preserve"
       style="font-style:normal;font-weight:normal;font-size:10.58333302px;line-height:1.25;font-family:sans-serif;letter-spacing:0px;word-spacing:0px;fill:#4d4d4d;fill-opacity:1;stroke:none;stroke-width:0.26458332;fill-rule:nonzero;"
       x="-206.56752"
       y="215.58264"
       id="text4064"
       transform="rotate(-45)"><tspan
         sodipodi:role="line"
         id="tspan4062"
         x="-206.56752"
         y="224.94641"
         style="stroke-width:0.26458332;fill:#4d4d4d;fill-rule:nonzero;fill-opacity:1;" /></text>
  </g>
  <g
     inkscape:groupmode="layer"
     id="layer2"
     inkscape:label="Layer 2"
     transform="translate(0,-284.30001)" />
</svg>
