<?xml version="1.0" encoding="UTF-8" standalone="no"?>
<!-- Created with Inkscape (http://www.inkscape.org/) -->

<svg
   xmlns:dc="http://purl.org/dc/elements/1.1/"
   xmlns:cc="http://creativecommons.org/ns#"
   xmlns:rdf="http://www.w3.org/1999/02/22-rdf-syntax-ns#"
   xmlns:svg="http://www.w3.org/2000/svg"
   xmlns="http://www.w3.org/2000/svg"
   xmlns:sodipodi="http://sodipodi.sourceforge.net/DTD/sodipodi-0.dtd"
   xmlns:inkscape="http://www.inkscape.org/namespaces/inkscape"
   width="48"
   height="48"
   viewBox="0 0 12.7 12.7"
   version="1.1"
   id="svg3729"
   sodipodi:docname="show.svg"
   inkscape:version="0.92.4 5da689c313, 2019-01-14">
  <defs
     id="defs3723">
    <clipPath
       clipPathUnits="userSpaceOnUse"
       id="clipPath4087">
      <ellipse
         id="ellipse4089"
         cx="6.3397431"
         cy="290.64154"
         rx="5.5459933"
         ry="5.5477529"
         style="stroke-width:0.24026173" />
    </clipPath>
    <clipPath
       clipPathUnits="userSpaceOnUse"
       id="clipPath4087-3">
      <ellipse
         id="ellipse4089-6"
         cx="6.3397431"
         cy="290.64154"
         rx="5.5459933"
         ry="5.5477529"
         style="stroke-width:0.24026173" />
    </clipPath>
  </defs>
  <sodipodi:namedview
     id="base"
     pagecolor="#ffffff"
     bordercolor="#666666"
     borderopacity="1.0"
     inkscape:pageopacity="0.0"
     inkscape:pageshadow="2"
     inkscape:zoom="19.646666"
     inkscape:cx="16.112036"
     inkscape:cy="25.893273"
     inkscape:document-units="mm"
     inkscape:current-layer="layer1"
     showgrid="true"
     showguides="false"
     units="px"
     inkscape:window-width="1890"
     inkscape:window-height="1053"
     inkscape:window-x="30"
     inkscape:window-y="0"
     inkscape:window-maximized="1">
    <inkscape:grid
       type="xygrid"
       id="grid3731" />
  </sodipodi:namedview>
  <metadata
     id="metadata3726">
    <rdf:RDF>
      <cc:Work
         rdf:about="">
        <dc:format>image/svg+xml</dc:format>
        <dc:type
           rdf:resource="http://purl.org/dc/dcmitype/StillImage" />
        <dc:title />
      </cc:Work>
    </rdf:RDF>
  </metadata>
  <g
     inkscape:label="Layer 1"
     inkscape:groupmode="layer"
     id="layer1"
     transform="translate(0,-284.30001)">
    <path
       style="stroke-width:1.07089114;fill:#eff0f1;fill-opacity:1"
       d="m 24.101562,13 c -10.476505,0.007 -18.1015619,5 -20.8652339,12 l 1.763672,1 C 6.4303064,20.241391 15.216523,15.007054 24,15 c 8.788282,0.0029 17.62355,5.238214 19.000001,11 l 1.849608,-1 C 42.000001,18 34.576715,13.008132 24.101562,13 Z"
       transform="matrix(0.26458333,0,0,0.26458333,0,284.30001)"
       id="path4097"
       inkscape:connector-curvature="0"
       sodipodi:nodetypes="ccccccc" />
    <ellipse
       id="path3960"
       cx="6.3499999"
       cy="290.65747"
       rx="5.5562501"
       ry="5.5637212"
       style="display:none;stroke-width:0.25867385" />
    <text
       xml:space="preserve"
       style="font-style:normal;font-weight:normal;font-size:10.58333302px;line-height:1.25;font-family:sans-serif;letter-spacing:0px;word-spacing:0px;fill:#eff0f1;fill-opacity:1;stroke:none;stroke-width:0.26458332;"
       x="-4.4979167"
       y="287.73959"
       id="text4060"><tspan
         sodipodi:role="line"
         id="tspan4058"
         x="-4.4979167"
         y="297.10336"
         style="stroke-width:0.26458332;fill:#eff0f1;fill-opacity:1;" /></text>
    <text
       xml:space="preserve"
       style="font-style:normal;font-weight:normal;font-size:10.58333302px;line-height:1.25;font-family:sans-serif;letter-spacing:0px;word-spacing:0px;fill:#eff0f1;fill-opacity:1;stroke:none;stroke-width:0.26458332;"
       x="0.79374999"
       y="296.20627"
       id="text4064"><tspan
         sodipodi:role="line"
         id="tspan4062"
         x="0.79374999"
         y="305.57004"
         style="stroke-width:0.26458332;fill:#eff0f1;fill-opacity:1;" /></text>
    <path
       style="stroke-width:0.88888681;fill:#eff0f1;fill-opacity:1"
       d="M 24 15 C 19.56802 15 16 18.56802 16 23 C 16 27.43198 19.56802 31 24 31 C 28.43198 31 32 27.43198 32 23 C 32 18.56802 28.43198 15 24 15 z M 23.998047 15.994141 A 7.0195112 6.9776038 0 0 1 31.017578 22.972656 A 7.0195112 6.9776038 0 0 1 23.998047 29.949219 A 7.0195112 6.9776038 0 0 1 16.978516 22.972656 A 7.0195112 6.9776038 0 0 1 23.998047 15.994141 z "
       transform="matrix(0.26458333,0,0,0.26458333,0,284.30001)"
       id="rect77" />
    <path
       style="fill:#eff0f1;stroke-width:1.13698661;fill-opacity:1"
       d="M 23.966797 17.056641 A 5.9161859 6.0089921 0 0 0 18.050781 23.066406 A 5.9161859 6.0089921 0 0 0 23.966797 29.074219 A 5.9161859 6.0089921 0 0 0 29.882812 23.066406 A 5.9161859 6.0089921 0 0 0 29.875 22.820312 A 5.9161859 6.0089921 0 0 1 25.185547 17.189453 A 5.9161859 6.0089921 0 0 0 23.966797 17.056641 z "
       transform="matrix(0.26458333,0,0,0.26458333,0,284.30001)"
       id="path32" />
  </g>
  <g
     inkscape:groupmode="layer"
     id="layer2"
     inkscape:label="Layer 2"
     transform="translate(0,-284.30001)" />
</svg>
