<?xml version="1.0" encoding="UTF-8" standalone="no"?>
<!-- Created with Inkscape (http://www.inkscape.org/) -->

<svg
   xmlns:dc="http://purl.org/dc/elements/1.1/"
   xmlns:cc="http://creativecommons.org/ns#"
   xmlns:rdf="http://www.w3.org/1999/02/22-rdf-syntax-ns#"
   xmlns:svg="http://www.w3.org/2000/svg"
   xmlns="http://www.w3.org/2000/svg"
   xmlns:sodipodi="http://sodipodi.sourceforge.net/DTD/sodipodi-0.dtd"
   xmlns:inkscape="http://www.inkscape.org/namespaces/inkscape"
   width="48"
   height="48"
   viewBox="0 0 12.7 12.7"
   version="1.1"
   id="svg3729"
   sodipodi:docname="split.svg"
   inkscape:version="0.92.4 5da689c313, 2019-01-14">
  <defs
     id="defs3723" />
  <sodipodi:namedview
     id="base"
     pagecolor="#ffffff"
     bordercolor="#666666"
     borderopacity="1.0"
     inkscape:pageopacity="0.0"
     inkscape:pageshadow="2"
     inkscape:zoom="13.892291"
     inkscape:cx="9.7482445"
     inkscape:cy="19.828151"
     inkscape:document-units="mm"
     inkscape:current-layer="layer1"
     showgrid="true"
     showguides="false"
     units="px"
     inkscape:window-width="1890"
     inkscape:window-height="1053"
     inkscape:window-x="30"
     inkscape:window-y="0"
     inkscape:window-maximized="1">
    <inkscape:grid
       type="xygrid"
       id="grid3731" />
  </sodipodi:namedview>
  <metadata
     id="metadata3726">
    <rdf:RDF>
      <cc:Work
         rdf:about="">
        <dc:format>image/svg+xml</dc:format>
        <dc:type
           rdf:resource="http://purl.org/dc/dcmitype/StillImage" />
        <dc:title />
      </cc:Work>
    </rdf:RDF>
  </metadata>
  <g
     inkscape:label="Layer 1"
     inkscape:groupmode="layer"
     id="layer1"
     transform="translate(0,-284.30001)">
    <rect
       id="rect3774"
       width="3.1750002"
       height="2.1166823"
       x="0.79374999"
       y="289.59167"
       style="fill:#4d4d4d;fill-opacity:1;stroke-width:0.16202416" />
    <rect
       id="rect3774-3"
       width="6.0854177"
       height="1.0583314"
       x="4.2333331"
       y="293.29584"
       style="fill:#4d4d4d;fill-opacity:1;stroke-width:0.15861198" />
    <rect
       id="rect3774-6"
       width="6.0854173"
       height="1.0583314"
       x="4.2333331"
       y="286.94583"
       style="fill:#4d4d4d;fill-opacity:1;stroke-width:0.15861198" />
    <rect
       style="fill:#4d4d4d;fill-opacity:1;fill-rule:nonzero;stroke-width:0.30020118"
       id="rect838"
       width="1.0583338"
       height="7.4083495"
       x="3.7041662"
       y="286.94583" />
    <path
       style="fill:#4d4d4d;fill-opacity:1;fill-rule:nonzero;stroke-width:0.2224889"
       d="m 8.5705362,285.49044 v 3.96875 L 11.377083,287.475 Z"
       id="rect860"
       inkscape:connector-curvature="0" />
    <path
       style="fill:#4d4d4d;fill-opacity:1;fill-rule:nonzero;stroke-width:0.2224889"
       d="m 8.5705365,291.84045 v 3.96875 l 2.8065465,-1.98419 z"
       id="rect860-5"
       inkscape:connector-curvature="0" />
  </g>
  <g
     inkscape:groupmode="layer"
     id="layer2"
     inkscape:label="Layer 2"
     transform="translate(0,-284.30001)" />
</svg>
