<?xml version="1.0" encoding="UTF-8" standalone="no"?>
<!-- Created with Inkscape (http://www.inkscape.org/) -->

<svg
   xmlns:dc="http://purl.org/dc/elements/1.1/"
   xmlns:cc="http://creativecommons.org/ns#"
   xmlns:rdf="http://www.w3.org/1999/02/22-rdf-syntax-ns#"
   xmlns:svg="http://www.w3.org/2000/svg"
   xmlns="http://www.w3.org/2000/svg"
   xmlns:sodipodi="http://sodipodi.sourceforge.net/DTD/sodipodi-0.dtd"
   xmlns:inkscape="http://www.inkscape.org/namespaces/inkscape"
   width="48"
   height="48"
   viewBox="0 0 12.7 12.7"
   version="1.1"
   id="svg3729"
   sodipodi:docname="unfilter.svg"
   inkscape:version="0.92.4 5da689c313, 2019-01-14">
  <defs
     id="defs3723">
    <clipPath
       clipPathUnits="userSpaceOnUse"
       id="clipPath4087">
      <ellipse
         id="ellipse4089"
         cx="6.3397431"
         cy="290.64154"
         rx="5.5459933"
         ry="5.5477529"
         style="stroke-width:0.24026173" />
    </clipPath>
  </defs>
  <sodipodi:namedview
     id="base"
     pagecolor="#ffffff"
     bordercolor="#666666"
     borderopacity="1.0"
     inkscape:pageopacity="0.0"
     inkscape:pageshadow="2"
     inkscape:zoom="14.411497"
     inkscape:cx="28.911074"
     inkscape:cy="18.280237"
     inkscape:document-units="mm"
     inkscape:current-layer="layer1"
     showgrid="true"
     showguides="false"
     units="px"
     inkscape:window-width="1890"
     inkscape:window-height="1053"
     inkscape:window-x="30"
     inkscape:window-y="0"
     inkscape:window-maximized="1">
    <inkscape:grid
       type="xygrid"
       id="grid3731" />
  </sodipodi:namedview>
  <metadata
     id="metadata3726">
    <rdf:RDF>
      <cc:Work
         rdf:about="">
        <dc:format>image/svg+xml</dc:format>
        <dc:type
           rdf:resource="http://purl.org/dc/dcmitype/StillImage" />
        <dc:title></dc:title>
      </cc:Work>
    </rdf:RDF>
  </metadata>
  <g
     inkscape:label="Layer 1"
     inkscape:groupmode="layer"
     id="layer1"
     transform="translate(0,-284.30001)">
    <rect
       style="fill:#4d4d4d;fill-opacity:1;stroke-width:0.26251155"
       id="rect916"
       width="11.1125"
       height="0.79375553"
       x="0.79375011"
       y="285.09375"
       ry="0.39687777"
       rx="0.26458332" />
    <rect
       style="fill:#4d4d4d;fill-opacity:1;stroke-width:0.26790577"
       id="rect937"
       width="0.80899447"
       height="6.9201131"
       x="-144.97887"
       y="249.40231"
       transform="matrix(0.87160145,-0.49021517,0.50984907,0.86026387,0,0)" />
    <rect
       style="fill:#4d4d4d;fill-opacity:1;stroke-width:0.26790595"
       id="rect937-3"
       width="0.80899471"
       height="6.9201188"
       x="-155.90691"
       y="243.1749"
       transform="matrix(-0.87160122,-0.49021557,-0.50984866,0.86026411,0,0)" />
    <path
       style="fill:#4d4d4d;fill-opacity:1;stroke-width:3.16226482"
       d="M 16 26 L 16 35.916016 L 19 37.648438 L 19 26 L 16 26 z "
       transform="matrix(0.26458333,0,0,0.26458333,0,284.30001)"
       id="rect956" />
    <path
       style="fill:#4d4d4d;fill-opacity:1;stroke-width:0.32404357"
       d="m 7.6729166,291.1792 v 0.79373 h 0.79375 v -0.0935 -0.70035 z"
       id="rect958"
       inkscape:connector-curvature="0" />
    <path
       style="fill:#4d4d4d;fill-opacity:1;stroke-width:1.22474492"
       d="M 16 32.453125 L 16 35.916016 L 20.685547 38.621094 A 10.275562 10.275562 0 0 1 20.625 37.605469 A 10.275562 10.275562 0 0 1 20.902344 35.283203 L 16 32.453125 z "
       transform="matrix(0.26458333,0,0,0.26458333,0,284.30001)"
       id="rect975" />
    <path
       style="fill:#4d4d4d;fill-opacity:1;stroke-width:0.01201142"
       d="m 4.2333333,288.79793 c -0.049689,-0.0777 -1.4061222,-2.34214 -1.4605416,-2.43819 -0.021041,-0.0371 -0.038256,-0.0736 -0.038256,-0.081 0,-0.0106 0.4734961,-0.0135 1.8074416,-0.0135 h 1.8074414 l 0.019805,0.0302 c 0.014267,0.0217 0.018191,0.0469 0.014039,0.0902 -0.01,0.10397 -0.00971,0.10384 -0.301159,0.11285 -0.7656205,0.0236 -0.9545409,0.0416 -1.1614893,0.11021 -0.1857496,0.0617 -0.2863199,0.12307 -0.4210031,0.25697 -0.095013,0.0946 -0.123255,0.13169 -0.1644584,0.21621 -0.02736,0.0561 -0.058022,0.13474 -0.068138,0.17464 -0.044949,0.17733 -0.03384,0.60356 0.022057,0.84633 0.015971,0.0694 0.062932,0.22882 0.1043569,0.35434 0.041424,0.12546 0.075641,0.24956 0.076036,0.27566 6.61e-4,0.0428 -0.00431,0.0508 -0.050978,0.0824 -0.028433,0.0192 -0.072454,0.0377 -0.097823,0.041 -0.044841,0.007 -0.047272,0.004 -0.087331,-0.0582 z"
       id="path1051"
       inkscape:connector-curvature="0" />
    <path
       style="fill:#da4453;fill-opacity:1;stroke-width:0.13148938"
       d="m 9.4803967,292.82425 a 2.1006196,2.1049881 45 0 0 -2.973797,0.003 2.1006196,2.1049881 45 0 0 -0.0032,2.97393 2.1006196,2.1049881 45 0 0 2.973934,-0.003 2.1006196,2.1049881 45 0 0 0.003,-2.9738 z m -0.21998,0.20701 a 1.7894719,1.7966601 45 0 1 -0.0051,2.53563 1.7894719,1.7966601 45 0 1 -2.535768,0.005 1.7894719,1.7966601 45 0 1 0.0051,-2.53591 1.7894719,1.7966601 45 0 1 2.535768,-0.005 z"
       id="path4097"
       inkscape:connector-curvature="0" />
    <rect
       id="rect3774"
       width="11.1125"
       height="2.1166666"
       x="0.79374999"
       y="289.59167"
       style="fill:#da4453;fill-opacity:1;stroke-width:0.30311829"
       clip-path="url(#clipPath4087)"
       transform="matrix(0.26688839,0.26688839,-0.13344394,0.13344394,45.085756,253.82443)" />
    <text
       xml:space="preserve"
       style="font-style:normal;font-weight:normal;font-size:3.99454355px;line-height:1.25;font-family:sans-serif;letter-spacing:0px;word-spacing:0px;fill:#da4453;fill-opacity:1;stroke:none;stroke-width:0.09986357"
       x="209.60756"
       y="203.94699"
       id="text4060"
       transform="rotate(45)"><tspan
         sodipodi:role="line"
         id="tspan4058"
         x="209.60756"
         y="207.48123"
         style="fill:#da4453;fill-opacity:1;stroke-width:0.09986357" /></text>
    <text
       xml:space="preserve"
       style="font-style:normal;font-weight:normal;font-size:3.99454355px;line-height:1.25;font-family:sans-serif;letter-spacing:0px;word-spacing:0px;fill:#da4453;fill-opacity:1;stroke:none;stroke-width:0.09986357"
       x="211.60484"
       y="207.14264"
       id="text4064"
       transform="rotate(45)"><tspan
         sodipodi:role="line"
         id="tspan4062"
         x="211.60484"
         y="210.67688"
         style="fill:#da4453;fill-opacity:1;stroke-width:0.09986357" /></text>
  </g>
  <g
     inkscape:groupmode="layer"
     id="layer2"
     inkscape:label="Layer 2"
     transform="translate(0,-284.30001)" />
</svg>
