<?xml version="1.0" encoding="UTF-8" standalone="no"?>
<!-- Created with Inkscape (http://www.inkscape.org/) -->

<svg
   xmlns:dc="http://purl.org/dc/elements/1.1/"
   xmlns:cc="http://creativecommons.org/ns#"
   xmlns:rdf="http://www.w3.org/1999/02/22-rdf-syntax-ns#"
   xmlns:svg="http://www.w3.org/2000/svg"
   xmlns="http://www.w3.org/2000/svg"
   xmlns:sodipodi="http://sodipodi.sourceforge.net/DTD/sodipodi-0.dtd"
   xmlns:inkscape="http://www.inkscape.org/namespaces/inkscape"
   width="48"
   height="48"
   viewBox="0 0 12.7 12.7"
   version="1.1"
   id="svg3729"
   sodipodi:docname="previous.svg"
   inkscape:version="0.92.4 5da689c313, 2019-01-14">
  <defs
     id="defs3723">
    <inkscape:path-effect
       effect="powerstroke"
       id="path-effect108"
       is_visible="true"
       offset_points="0,0.13229166"
       sort_points="true"
       interpolator_type="CubicBezierJohan"
       interpolator_beta="0.2"
       start_linecap_type="zerowidth"
       linejoin_type="extrp_arc"
       miter_limit="4"
       end_linecap_type="zerowidth" />
    <clipPath
       clipPathUnits="userSpaceOnUse"
       id="clipPath4087">
      <ellipse
         id="ellipse4089"
         cx="6.3397431"
         cy="290.64154"
         rx="5.5459933"
         ry="5.5477529"
         style="stroke-width:0.24026173" />
    </clipPath>
    <clipPath
       clipPathUnits="userSpaceOnUse"
       id="clipPath4087-3">
      <ellipse
         id="ellipse4089-6"
         cx="6.3397431"
         cy="290.64154"
         rx="5.5459933"
         ry="5.5477529"
         style="stroke-width:0.24026173" />
    </clipPath>
  </defs>
  <sodipodi:namedview
     id="base"
     pagecolor="#ffffff"
     bordercolor="#666666"
     borderopacity="1.0"
     inkscape:pageopacity="0.0"
     inkscape:pageshadow="2"
     inkscape:zoom="13.892291"
     inkscape:cx="-6.338502"
     inkscape:cy="17.61626"
     inkscape:document-units="mm"
     inkscape:current-layer="layer1"
     showgrid="true"
     showguides="false"
     units="px"
     inkscape:window-width="1890"
     inkscape:window-height="1053"
     inkscape:window-x="30"
     inkscape:window-y="0"
     inkscape:window-maximized="1">
    <inkscape:grid
       type="xygrid"
       id="grid3731" />
  </sodipodi:namedview>
  <metadata
     id="metadata3726">
    <rdf:RDF>
      <cc:Work
         rdf:about="">
        <dc:format>image/svg+xml</dc:format>
        <dc:type
           rdf:resource="http://purl.org/dc/dcmitype/StillImage" />
        <dc:title />
      </cc:Work>
    </rdf:RDF>
  </metadata>
  <g
     inkscape:label="Layer 1"
     inkscape:groupmode="layer"
     id="layer1"
     transform="translate(0,-284.30001)">
    <path
       style="stroke-width:0.34837419;fill:#4d4d4d;fill-opacity:1"
       d="m 6.3593016,296.24812 a 5.5654812,5.5770554 0 0 0 5.5655514,-5.57692 5.5654812,5.5770554 0 0 0 -5.5655514,-5.57744 5.5654812,5.5770554 0 0 0 -5.56555161,5.57744 5.5654812,5.5770554 0 0 0 5.56555161,5.57692 z m 0.024288,-0.79995 a 4.7411118,4.7601565 0 0 1 -4.7407959,-4.75992 4.7411118,4.7601565 0 0 1 4.7407959,-4.76043 4.7411118,4.7601565 0 0 1 4.7413124,4.76043 4.7411118,4.7601565 0 0 1 -4.7413124,4.75992 z"
       id="path4097"
       inkscape:connector-curvature="0" />
    <ellipse
       id="path3960"
       cx="6.3499999"
       cy="290.65747"
       rx="5.5562501"
       ry="5.5637212"
       style="display:none;stroke-width:0.25867385" />
    <text
       xml:space="preserve"
       style="font-style:normal;font-weight:normal;font-size:10.58333302px;line-height:1.25;font-family:sans-serif;letter-spacing:0px;word-spacing:0px;fill:#4d4d4d;fill-opacity:1;stroke:none;stroke-width:0.26458332;"
       x="-17.21652"
       y="-293.60229"
       id="text4060"
       transform="scale(-1)"><tspan
         sodipodi:role="line"
         id="tspan4058"
         x="-17.21652"
         y="-284.23853"
         style="stroke-width:0.26458332;fill:#4d4d4d;fill-opacity:1;" /></text>
    <text
       xml:space="preserve"
       style="font-style:normal;font-weight:normal;font-size:10.58333302px;line-height:1.25;font-family:sans-serif;letter-spacing:0px;word-spacing:0px;fill:#4d4d4d;fill-opacity:1;stroke:none;stroke-width:0.26458332;"
       x="-11.924853"
       y="-285.13562"
       id="text4064"
       transform="scale(-1)"><tspan
         sodipodi:role="line"
         id="tspan4062"
         x="-11.924853"
         y="-275.77185"
         style="stroke-width:0.26458332;fill:#4d4d4d;fill-opacity:1;" /></text>
    <path
       style="stroke-width:0.28167045;fill:#4d4d4d;fill-opacity:1"
       d="m 9.2333379,293.04883 c 0.015773,-0.003 0.03015,-0.009 0.045682,-0.0124 v -4.68912 c -0.015532,-0.004 -0.029909,-0.009 -0.045682,-0.0124 l -4.4522347,2.35696 z"
       id="rect77-6"
       inkscape:connector-curvature="0" />
    <rect
       style="fill:#4d4d4d;fill-opacity:1;stroke-width:0.26458332"
       id="rect24"
       width="0.79374999"
       height="4.7624998"
       x="-4.7811031"
       y="-293.07312"
       ry="0"
       transform="scale(-1)" />
  </g>
  <g
     inkscape:groupmode="layer"
     id="layer2"
     inkscape:label="Layer 2"
     transform="translate(0,-284.30001)" />
</svg>
