<?xml version="1.0" encoding="UTF-8" standalone="no"?>
<!-- Created with Inkscape (http://www.inkscape.org/) -->

<svg
   xmlns:dc="http://purl.org/dc/elements/1.1/"
   xmlns:cc="http://creativecommons.org/ns#"
   xmlns:rdf="http://www.w3.org/1999/02/22-rdf-syntax-ns#"
   xmlns:svg="http://www.w3.org/2000/svg"
   xmlns="http://www.w3.org/2000/svg"
   xmlns:sodipodi="http://sodipodi.sourceforge.net/DTD/sodipodi-0.dtd"
   xmlns:inkscape="http://www.inkscape.org/namespaces/inkscape"
   width="48"
   height="48"
   viewBox="0 0 12.7 12.7"
   version="1.1"
   id="svg3729"
   sodipodi:docname="download.svg"
   inkscape:version="0.92.4 5da689c313, 2019-01-14">
  <defs
     id="defs3723" />
  <sodipodi:namedview
     id="base"
     pagecolor="#ffffff"
     bordercolor="#666666"
     borderopacity="1.0"
     inkscape:pageopacity="0.0"
     inkscape:pageshadow="2"
     inkscape:zoom="13.892291"
     inkscape:cx="13.306639"
     inkscape:cy="21.306106"
     inkscape:document-units="mm"
     inkscape:current-layer="layer1"
     showgrid="true"
     showguides="false"
     units="px"
     inkscape:window-width="1890"
     inkscape:window-height="1053"
     inkscape:window-x="30"
     inkscape:window-y="0"
     inkscape:window-maximized="1">
    <inkscape:grid
       type="xygrid"
       id="grid3731" />
  </sodipodi:namedview>
  <metadata
     id="metadata3726">
    <rdf:RDF>
      <cc:Work
         rdf:about="">
        <dc:format>image/svg+xml</dc:format>
        <dc:type
           rdf:resource="http://purl.org/dc/dcmitype/StillImage" />
        <dc:title></dc:title>
      </cc:Work>
    </rdf:RDF>
  </metadata>
  <g
     inkscape:label="Layer 1"
     inkscape:groupmode="layer"
     id="layer1"
     transform="translate(0,-284.30001)">
    <rect
       id="rect3768"
       width="1.0583335"
       height="6.0854278"
       x="202.88254"
       y="-212.92114"
       style="fill:#4d4d4d;fill-opacity:1;stroke-width:0.19579528"
       transform="rotate(135)" />
    <rect
       id="rect3774"
       width="6.0854168"
       height="1.0583298"
       x="197.85545"
       y="-212.92114"
       style="fill:#4d4d4d;fill-opacity:1;stroke-width:0.15861186"
       transform="rotate(135)" />
    <rect
       style="fill:#4d4d4d;fill-opacity:1;stroke-width:0.26458332"
       id="rect840"
       width="11.1125"
       height="0.79374999"
       x="0.79374999"
       y="295.41251" />
    <rect
       style="fill:#4d4d4d;fill-opacity:1;stroke-width:0.26458332"
       id="rect842"
       width="0.79374999"
       height="1.5875"
       x="11.1125"
       y="294.61877" />
    <rect
       style="fill:#4d4d4d;fill-opacity:1;stroke-width:0.26458332"
       id="rect842-3"
       width="0.79374999"
       height="1.5875"
       x="0.79374999"
       y="294.61877" />
    <rect
       style="fill:#4d4d4d;fill-opacity:1;stroke-width:0.41834363"
       id="rect842-6"
       width="0.79374999"
       height="3.9687624"
       x="3.96875"
       y="285.09375" />
    <rect
       style="fill:#4d4d4d;fill-opacity:1;stroke-width:0.41834363"
       id="rect842-6-7"
       width="0.79374999"
       height="3.9687624"
       x="7.9375"
       y="285.09375" />
    <rect
       style="fill:#4d4d4d;fill-opacity:1;stroke-width:0.45827204"
       id="rect842-6-5"
       width="4.7625012"
       height="0.79375076"
       x="3.9687488"
       y="285.09375" />
  </g>
  <g
     inkscape:groupmode="layer"
     id="layer2"
     inkscape:label="Layer 2"
     transform="translate(0,-284.30001)" />
</svg>
