<?xml version="1.0" encoding="UTF-8" standalone="no"?>
<!-- Created with Inkscape (http://www.inkscape.org/) -->

<svg
   xmlns:dc="http://purl.org/dc/elements/1.1/"
   xmlns:cc="http://creativecommons.org/ns#"
   xmlns:rdf="http://www.w3.org/1999/02/22-rdf-syntax-ns#"
   xmlns:svg="http://www.w3.org/2000/svg"
   xmlns="http://www.w3.org/2000/svg"
   xmlns:sodipodi="http://sodipodi.sourceforge.net/DTD/sodipodi-0.dtd"
   xmlns:inkscape="http://www.inkscape.org/namespaces/inkscape"
   width="48"
   height="48"
   viewBox="0 0 12.7 12.7"
   version="1.1"
   id="svg3729"
   sodipodi:docname="audio.svg"
   inkscape:version="0.92.4 (5da689c313, 2019-01-14)">
  <defs
     id="defs3723">
    <clipPath
       clipPathUnits="userSpaceOnUse"
       id="clipPath4087">
      <ellipse
         id="ellipse4089"
         cx="6.3397431"
         cy="290.64154"
         rx="5.5459933"
         ry="5.5477529"
         style="stroke-width:0.24026173" />
    </clipPath>
    <clipPath
       clipPathUnits="userSpaceOnUse"
       id="clipPath4087-3">
      <ellipse
         id="ellipse4089-6"
         cx="6.3397431"
         cy="290.64154"
         rx="5.5459933"
         ry="5.5477529"
         style="stroke-width:0.24026173" />
    </clipPath>
  </defs>
  <sodipodi:namedview
     id="base"
     pagecolor="#ffffff"
     bordercolor="#666666"
     borderopacity="1.0"
     inkscape:pageopacity="0.0"
     inkscape:pageshadow="2"
     inkscape:zoom="13.892291"
     inkscape:cx="12.780293"
     inkscape:cy="20.40401"
     inkscape:document-units="mm"
     inkscape:current-layer="layer1"
     showgrid="true"
     showguides="false"
     units="px"
     inkscape:window-width="1920"
     inkscape:window-height="1027"
     inkscape:window-x="3832"
     inkscape:window-y="-8"
     inkscape:window-maximized="1">
    <inkscape:grid
       type="xygrid"
       id="grid3731" />
  </sodipodi:namedview>
  <metadata
     id="metadata3726">
    <rdf:RDF>
      <cc:Work
         rdf:about="">
        <dc:format>image/svg+xml</dc:format>
        <dc:type
           rdf:resource="http://purl.org/dc/dcmitype/StillImage" />
        <dc:title />
      </cc:Work>
    </rdf:RDF>
  </metadata>
  <g
     inkscape:label="Layer 1"
     inkscape:groupmode="layer"
     id="layer1"
     transform="translate(0,-284.30001)">
    <path
       style="fill:#eff0f1;fill-opacity:1;stroke-width:0.30931747"
       d="m 6.2817229,285.62293 a 5.019712,4.8746779 87.968628 0 0 -3.3740837,1.46614 v 4.6e-4 a 5.019712,4.8746779 87.968628 0 0 -1.4130275,3.2959 h 0.6927226 a 4.2807422,4.1562283 86.09784 0 1 1.2000561,-2.77072 4.2807422,4.1562283 86.09784 0 1 5.8781945,0.0121 4.2807422,4.1562283 86.09784 0 1 1.2113601,2.7586 h 0.743366 a 5.019712,4.8746779 87.968628 0 0 -1.418906,-3.28888 5.019712,4.8746779 87.968628 0 0 -3.5196821,-1.47358 z"
       id="path4097"
       inkscape:connector-curvature="0" />
    <ellipse
       id="path3960"
       cx="6.3499999"
       cy="290.65747"
       rx="5.5562501"
       ry="5.5637212"
       style="display:none;stroke-width:0.25867385" />
    <text
       xml:space="preserve"
       style="font-style:normal;font-weight:normal;font-size:10.58333302px;line-height:1.25;font-family:sans-serif;letter-spacing:0px;word-spacing:0px;fill:#eff0f1;fill-opacity:1;stroke:none;stroke-width:0.26458332;"
       x="-4.4979167"
       y="287.73959"
       id="text4060"><tspan
         sodipodi:role="line"
         id="tspan4058"
         x="-4.4979167"
         y="297.10336"
         style="stroke-width:0.26458332;fill:#eff0f1;fill-opacity:1;" /></text>
    <text
       xml:space="preserve"
       style="font-style:normal;font-weight:normal;font-size:10.58333302px;line-height:1.25;font-family:sans-serif;letter-spacing:0px;word-spacing:0px;fill:#eff0f1;fill-opacity:1;stroke:none;stroke-width:0.26458332;"
       x="0.79374999"
       y="296.20627"
       id="text4064"><tspan
         sodipodi:role="line"
         id="tspan4062"
         x="0.79374999"
         y="305.57004"
         style="stroke-width:0.26458332;fill:#eff0f1;fill-opacity:1;" /></text>
    <path
       style="fill:#da4453;fill-opacity:1;stroke-width:0.93541437"
       d="M 5 23 C 3.8920216 23 3 23.892022 3 25 L 3 36 C 3 37.107978 3.8920216 38 5 38 L 8.875 38 C 8.9177873 38 8.9578958 37.990903 9 37.988281 L 9 23.011719 C 8.9578958 23.009097 8.9177873 23 8.875 23 L 5 23 z M 10 23.34375 L 10 37.65625 C 10.528552 37.297044 10.875 36.689962 10.875 36 L 10.875 25 C 10.875 24.310038 10.528552 23.702956 10 23.34375 z "
       transform="matrix(0.26458333,0,0,0.26458333,0,284.30001)"
       id="rect867" />
    <path
       style="fill:#da4453;fill-opacity:1;stroke-width:0.93541437"
       d="M 39.125 23 C 39.082213 23 39.042104 23.009097 39 23.011719 L 39 37.988281 C 39.042104 37.990903 39.082213 38 39.125 38 L 43 38 C 44.107978 38 45 37.107978 45 36 L 45 25 C 45 23.892022 44.107978 23 43 23 L 39.125 23 z M 38 23.34375 C 37.471448 23.702956 37.125 24.310038 37.125 25 L 37.125 36 C 37.125 36.689962 37.471448 37.297044 38 37.65625 L 38 23.34375 z "
       transform="matrix(0.26458333,0,0,0.26458333,0,284.30001)"
       id="rect869" />
  </g>
  <g
     inkscape:groupmode="layer"
     id="layer2"
     inkscape:label="Layer 2"
     transform="translate(0,-284.30001)" />
</svg>
