<?xml version="1.0" encoding="UTF-8" standalone="no"?>
<!-- Created with Inkscape (http://www.inkscape.org/) -->

<svg
   xmlns:dc="http://purl.org/dc/elements/1.1/"
   xmlns:cc="http://creativecommons.org/ns#"
   xmlns:rdf="http://www.w3.org/1999/02/22-rdf-syntax-ns#"
   xmlns:svg="http://www.w3.org/2000/svg"
   xmlns="http://www.w3.org/2000/svg"
   xmlns:sodipodi="http://sodipodi.sourceforge.net/DTD/sodipodi-0.dtd"
   xmlns:inkscape="http://www.inkscape.org/namespaces/inkscape"
   width="48"
   height="48"
   viewBox="0 0 12.7 12.7"
   version="1.1"
   id="svg3729"
   sodipodi:docname="refresh.svg"
   inkscape:version="0.92.4 5da689c313, 2019-01-14">
  <defs
     id="defs3723">
    <clipPath
       clipPathUnits="userSpaceOnUse"
       id="clipPath4087">
      <ellipse
         id="ellipse4089"
         cx="6.3397431"
         cy="290.64154"
         rx="5.5459933"
         ry="5.5477529"
         style="stroke-width:0.24026173" />
    </clipPath>
    <clipPath
       clipPathUnits="userSpaceOnUse"
       id="clipPath4087-3">
      <ellipse
         id="ellipse4089-6"
         cx="6.3397431"
         cy="290.64154"
         rx="5.5459933"
         ry="5.5477529"
         style="stroke-width:0.24026173" />
    </clipPath>
  </defs>
  <sodipodi:namedview
     id="base"
     pagecolor="#ffffff"
     bordercolor="#666666"
     borderopacity="1.0"
     inkscape:pageopacity="0.0"
     inkscape:pageshadow="2"
     inkscape:zoom="13.892291"
     inkscape:cx="-1.4810045"
     inkscape:cy="20.332028"
     inkscape:document-units="mm"
     inkscape:current-layer="layer1"
     showgrid="true"
     showguides="false"
     units="px"
     inkscape:window-width="1890"
     inkscape:window-height="1053"
     inkscape:window-x="30"
     inkscape:window-y="0"
     inkscape:window-maximized="1">
    <inkscape:grid
       type="xygrid"
       id="grid3731" />
  </sodipodi:namedview>
  <metadata
     id="metadata3726">
    <rdf:RDF>
      <cc:Work
         rdf:about="">
        <dc:format>image/svg+xml</dc:format>
        <dc:type
           rdf:resource="http://purl.org/dc/dcmitype/StillImage" />
        <dc:title />
      </cc:Work>
    </rdf:RDF>
  </metadata>
  <g
     inkscape:label="Layer 1"
     inkscape:groupmode="layer"
     id="layer1"
     transform="translate(0,-284.30001)">
    <path
       style="stroke-width:0.34837419;fill:#4d4d4d;fill-rule:nonzero;fill-opacity:1"
       d="m 2.4523641,286.71207 a 5.5770554,5.5654812 45 0 0 -0.028502,0.0314 l 0.068697,-0.0687 a 5.5770554,5.5654812 45 0 0 -0.040195,0.0373 z m 0.8155897,-0.66797 0.5842866,0.5821 a 4.7601565,4.7411118 45 0 1 5.8666183,0.68221 4.7601565,4.7411118 45 0 1 0.6913513,5.85164 l 0.610961,0.60877 a 5.5770554,5.5654812 45 0 0 -0.689889,-7.04871 5.5770554,5.5654812 45 0 0 -7.0633282,-0.67601 z m -1.4959786,1.49744 a 5.5770554,5.5654812 45 0 0 0.6884279,7.04944 5.5770554,5.5654812 45 0 0 7.065155,0.67564 l -0.5996339,-0.59744 a 4.7601565,4.7411118 45 0 1 -5.9119287,-0.65591 4.7601565,4.7411118 45 0 1 -0.6632148,-5.89512 z"
       id="path4097"
       inkscape:connector-curvature="0" />
    <ellipse
       id="path3960"
       cx="6.3499999"
       cy="290.65747"
       rx="5.5562501"
       ry="5.5637212"
       style="display:none;stroke-width:0.25867385" />
    <text
       xml:space="preserve"
       style="font-style:normal;font-weight:normal;font-size:10.58333302px;line-height:1.25;font-family:sans-serif;letter-spacing:0px;word-spacing:0px;fill:#4d4d4d;fill-opacity:1;stroke:none;stroke-width:0.26458332;fill-rule:nonzero;"
       x="-211.85918"
       y="207.11597"
       id="text4060"
       transform="rotate(-45)"><tspan
         sodipodi:role="line"
         id="tspan4058"
         x="-211.85918"
         y="216.47974"
         style="stroke-width:0.26458332;fill:#4d4d4d;fill-rule:nonzero;fill-opacity:1;" /></text>
    <text
       xml:space="preserve"
       style="font-style:normal;font-weight:normal;font-size:10.58333302px;line-height:1.25;font-family:sans-serif;letter-spacing:0px;word-spacing:0px;fill:#4d4d4d;fill-opacity:1;stroke:none;stroke-width:0.26458332;fill-rule:nonzero;"
       x="-206.56752"
       y="215.58264"
       id="text4064"
       transform="rotate(-45)"><tspan
         sodipodi:role="line"
         id="tspan4062"
         x="-206.56752"
         y="224.94641"
         style="stroke-width:0.26458332;fill:#4d4d4d;fill-rule:nonzero;fill-opacity:1;" /></text>
    <rect
       style="fill:#4d4d4d;stroke-width:0.26458332;fill-rule:nonzero;fill-opacity:1"
       id="rect25"
       width="1.0583333"
       height="3.175"
       x="-199.95293"
       y="205.26389"
       ry="0"
       transform="rotate(-45)" />
    <rect
       style="fill:#4d4d4d;stroke-width:0.28983557;fill-rule:nonzero;fill-opacity:1"
       id="rect27"
       width="1.0583333"
       height="3.1749794"
       x="-203.12793"
       y="211.61389"
       transform="rotate(-45)" />
  </g>
  <g
     inkscape:groupmode="layer"
     id="layer2"
     inkscape:label="Layer 2"
     transform="translate(0,-284.30001)" />
</svg>
