<?xml version="1.0" encoding="UTF-8" standalone="no"?>
<!-- Created with Inkscape (http://www.inkscape.org/) -->

<svg
   xmlns:dc="http://purl.org/dc/elements/1.1/"
   xmlns:cc="http://creativecommons.org/ns#"
   xmlns:rdf="http://www.w3.org/1999/02/22-rdf-syntax-ns#"
   xmlns:svg="http://www.w3.org/2000/svg"
   xmlns="http://www.w3.org/2000/svg"
   xmlns:sodipodi="http://sodipodi.sourceforge.net/DTD/sodipodi-0.dtd"
   xmlns:inkscape="http://www.inkscape.org/namespaces/inkscape"
   width="48"
   height="48"
   viewBox="0 0 12.7 12.7"
   version="1.1"
   id="svg3729"
   sodipodi:docname="pen-red.svg"
   inkscape:version="0.92.4 (5da689c313, 2019-01-14)">
  <defs
     id="defs3723" />
  <sodipodi:namedview
     id="base"
     pagecolor="#ffffff"
     bordercolor="#666666"
     borderopacity="1.0"
     inkscape:pageopacity="0.0"
     inkscape:pageshadow="2"
     inkscape:zoom="19.646666"
     inkscape:cx="18.151908"
     inkscape:cy="1.9954772"
     inkscape:document-units="mm"
     inkscape:current-layer="layer1"
     showgrid="true"
     showguides="false"
     units="px"
     inkscape:window-width="1920"
     inkscape:window-height="1027"
     inkscape:window-x="3832"
     inkscape:window-y="-8"
     inkscape:window-maximized="1">
    <inkscape:grid
       type="xygrid"
       id="grid3731" />
  </sodipodi:namedview>
  <metadata
     id="metadata3726">
    <rdf:RDF>
      <cc:Work
         rdf:about="">
        <dc:format>image/svg+xml</dc:format>
        <dc:type
           rdf:resource="http://purl.org/dc/dcmitype/StillImage" />
        <dc:title></dc:title>
      </cc:Work>
    </rdf:RDF>
  </metadata>
  <g
     inkscape:label="Layer 1"
     inkscape:groupmode="layer"
     id="layer1"
     transform="translate(0,-284.30001)">
    <path
       style="fill:#eff0f1;fill-opacity:1;stroke-width:0.37963989"
       d="m 9.15633,285.59862 -6.5481034,6.5481 0.3741774,0.37418 5.2384826,-5.23849 1.4967094,1.49671 -5.2384827,5.23849 0.3741773,0.37417 6.5481034,-6.5481 z"
       id="rect836"
       inkscape:connector-curvature="0" />
    <path
       style="fill:#eff0f1;fill-opacity:1;stroke-width:0.26458332"
       d="M 3.5699793,291.93332 H 2.8216246 l -0.4004866,0.40049 v 1.49671 l 0.561266,-0.56127 v -0.74835 z m 1.4967093,1.49671 -0.5875753,0.58758 H 3.7307586 l -0.561266,0.56126 H 4.666202 l 0.4004866,-0.40048 z"
       id="rect857"
       inkscape:connector-curvature="0" />
    <rect
       style="fill:#da4453;fill-opacity:1;stroke-width:0.26458332"
       id="rect902"
       width="2.1166666"
       height="0.52916664"
       x="208.95239"
       y="202.88257"
       ry="3.8334952e-06"
       transform="rotate(45)" />
    <path
       style="fill:#da4453;fill-opacity:1;stroke-width:0.16733719"
       d="m 2.4211403,293.83052 -2.4e-6,0.74835 0.7483571,0 0.561266,-0.56127 -0.7483547,-0.74835 z"
       id="rect906-1"
       inkscape:connector-curvature="0" />
    <rect
       style="fill:#da4453;fill-opacity:1;stroke-width:0.26458332"
       id="rect902-3"
       width="2.1166666"
       height="0.52916664"
       x="208.95239"
       y="202.08881"
       ry="3.8334952e-06"
       transform="rotate(45)" />
  </g>
  <g
     inkscape:groupmode="layer"
     id="layer2"
     inkscape:label="Layer 2"
     transform="translate(0,-284.30001)" />
</svg>
