<?xml version="1.0" encoding="UTF-8" standalone="no"?>
<!-- Created with Inkscape (http://www.inkscape.org/) -->

<svg
   xmlns:dc="http://purl.org/dc/elements/1.1/"
   xmlns:cc="http://creativecommons.org/ns#"
   xmlns:rdf="http://www.w3.org/1999/02/22-rdf-syntax-ns#"
   xmlns:svg="http://www.w3.org/2000/svg"
   xmlns="http://www.w3.org/2000/svg"
   xmlns:sodipodi="http://sodipodi.sourceforge.net/DTD/sodipodi-0.dtd"
   xmlns:inkscape="http://www.inkscape.org/namespaces/inkscape"
   width="48"
   height="48"
   viewBox="0 0 12.7 12.7"
   version="1.1"
   id="svg3729"
   sodipodi:docname="folder-yellow.svg"
   inkscape:version="0.92.4 (5da689c313, 2019-01-14)">
  <defs
     id="defs3723" />
  <sodipodi:namedview
     id="base"
     pagecolor="#ffffff"
     bordercolor="#666666"
     borderopacity="1.0"
     inkscape:pageopacity="0.0"
     inkscape:pageshadow="2"
     inkscape:zoom="13.892291"
     inkscape:cx="-9.9952871"
     inkscape:cy="21.522053"
     inkscape:document-units="mm"
     inkscape:current-layer="layer1"
     showgrid="true"
     showguides="false"
     units="px"
     inkscape:window-width="1920"
     inkscape:window-height="1027"
     inkscape:window-x="3832"
     inkscape:window-y="-8"
     inkscape:window-maximized="1">
    <inkscape:grid
       type="xygrid"
       id="grid3731" />
  </sodipodi:namedview>
  <metadata
     id="metadata3726">
    <rdf:RDF>
      <cc:Work
         rdf:about="">
        <dc:format>image/svg+xml</dc:format>
        <dc:type
           rdf:resource="http://purl.org/dc/dcmitype/StillImage" />
        <dc:title />
      </cc:Work>
    </rdf:RDF>
  </metadata>
  <g
     inkscape:label="Layer 1"
     inkscape:groupmode="layer"
     id="layer1"
     transform="translate(0,-284.30001)">
    <path
       style="fill:#edc11e;fill-opacity:1;stroke-width:1.10782337"
       d="M 3 3 L 3 16 L 17.857422 16 L 20 13.857422 L 20 11 L 30 11 L 30 8 L 25 3 L 3 3 z "
       transform="matrix(0.26458333,0,0,0.26458333,0,284.30001)"
       id="rect823" />
    <path
       style="fill:#eff0f1;fill-opacity:1;stroke-width:0.99999994"
       d="M 3 8 L 3 45 L 45 45 L 45 8 L 3 8 z M 6 11 L 42 11 L 42 42 L 6 42 L 6 11 z "
       id="rect818"
       transform="matrix(0.26458333,0,0,0.26458333,0,284.30001)" />
    <path
       style="fill:#eff0f1;fill-opacity:1;stroke-width:1.34164596"
       d="M 5 13 L 5 19 L 15 19 L 20 14 L 20 13 L 5 13 z "
       transform="matrix(0.26458333,0,0,0.26458333,0,284.30001)"
       id="rect887" />
    <rect
       style="fill:#eff0f1;fill-opacity:1;stroke-width:0.29581255"
       id="rect889"
       width="6.8791666"
       height="1.3229111"
       x="4.4979167"
       y="286.68127" />
  </g>
  <g
     inkscape:groupmode="layer"
     id="layer2"
     inkscape:label="Layer 2"
     transform="translate(0,-284.30001)" />
</svg>
