<?xml version="1.0" encoding="UTF-8" standalone="no"?>
<!-- Created with Inkscape (http://www.inkscape.org/) -->

<svg
   xmlns:dc="http://purl.org/dc/elements/1.1/"
   xmlns:cc="http://creativecommons.org/ns#"
   xmlns:rdf="http://www.w3.org/1999/02/22-rdf-syntax-ns#"
   xmlns:svg="http://www.w3.org/2000/svg"
   xmlns="http://www.w3.org/2000/svg"
   xmlns:sodipodi="http://sodipodi.sourceforge.net/DTD/sodipodi-0.dtd"
   xmlns:inkscape="http://www.inkscape.org/namespaces/inkscape"
   width="48"
   height="48"
   viewBox="0 0 12.7 12.7"
   version="1.1"
   id="svg3729"
   sodipodi:docname="sc.svg"
   inkscape:version="0.92.4 (5da689c313, 2019-01-14)">
  <defs
     id="defs3723" />
  <sodipodi:namedview
     id="base"
     pagecolor="#ffffff"
     bordercolor="#666666"
     borderopacity="1.0"
     inkscape:pageopacity="0.0"
     inkscape:pageshadow="2"
     inkscape:zoom="15.879568"
     inkscape:cx="32.962836"
     inkscape:cy="25.193646"
     inkscape:document-units="mm"
     inkscape:current-layer="layer1"
     showgrid="true"
     showguides="false"
     units="px"
     inkscape:window-width="1920"
     inkscape:window-height="1027"
     inkscape:window-x="3832"
     inkscape:window-y="-8"
     inkscape:window-maximized="1"
     inkscape:lockguides="false">
    <inkscape:grid
       type="xygrid"
       id="grid3731" />
  </sodipodi:namedview>
  <metadata
     id="metadata3726">
    <rdf:RDF>
      <cc:Work
         rdf:about="">
        <dc:format>image/svg+xml</dc:format>
        <dc:type
           rdf:resource="http://purl.org/dc/dcmitype/StillImage" />
        <dc:title></dc:title>
      </cc:Work>
    </rdf:RDF>
  </metadata>
  <g
     inkscape:label="Layer 1"
     inkscape:groupmode="layer"
     id="layer1"
     transform="translate(0,-284.30001)">
    <path
       style="fill:#eff0f1;fill-opacity:1;stroke-width:0.99999994"
       d="M 9.1503906 6.3222656 L 6.3222656 9.1503906 L 10.564453 14.806641 L 10.777344 15.019531 A 15.999999 15.999999 0 0 0 8.2949219 21 L 8 21 L 1 22 L 1 26 L 8 27 L 8.2910156 27 A 15.999999 15.999999 0 0 0 10.767578 32.990234 L 10.564453 33.193359 L 6.3222656 38.849609 L 9.1503906 41.677734 L 14.806641 37.435547 L 15.019531 37.222656 A 15.999999 15.999999 0 0 0 21 39.705078 L 21 40 L 22 47 L 26 47 L 27 40 L 27 39.708984 A 15.999999 15.999999 0 0 0 32.990234 37.232422 L 33.193359 37.435547 L 38.849609 41.677734 L 41.677734 38.849609 L 37.435547 33.191406 L 37.222656 32.978516 A 15.999999 15.999999 0 0 0 37.978516 31.736328 L 36.279297 30.673828 A 14 14 0 0 1 35.78125 31.537109 A 14 14 0 0 1 35.775391 31.544922 A 14 14 0 0 1 35.027344 32.599609 A 14 14 0 0 1 34.941406 32.712891 A 14 14 0 0 1 34.164062 33.603516 A 14 14 0 0 1 33.990234 33.789062 A 14 14 0 0 1 33.21875 34.513672 A 14 14 0 0 1 32.933594 34.765625 A 14 14 0 0 1 32.195312 35.330078 A 14 14 0 0 1 31.640625 35.726562 A 14 14 0 0 1 31.546875 35.789062 L 31.548828 35.791016 A 14 14 0 0 1 27 37.65625 A 14 14 0 0 1 25.769531 37.871094 A 14 14 0 0 1 25.460938 37.908203 A 14 14 0 0 1 24.337891 37.988281 A 14 14 0 0 1 24 38 A 14 14 0 0 1 21 37.664062 A 14 14 0 0 1 16.462891 35.779297 A 14 14 0 0 1 15.361328 34.996094 A 14 14 0 0 1 15.304688 34.953125 A 14 14 0 0 1 14.363281 34.132812 A 14 14 0 0 1 14.224609 34.001953 A 14 14 0 0 1 13.482422 33.214844 A 14 14 0 0 1 13.232422 32.929688 A 14 14 0 0 1 12.654297 32.173828 A 14 14 0 0 1 12.279297 31.648438 A 14 14 0 0 1 12.210938 31.546875 L 12.208984 31.548828 A 14 14 0 0 1 10.34375 27 A 14 14 0 0 1 10.128906 25.769531 A 14 14 0 0 1 10.091797 25.460938 A 14 14 0 0 1 10.011719 24.337891 A 14 14 0 0 1 10 24 A 14 14 0 0 1 10.335938 21 A 14 14 0 0 1 12.220703 16.462891 A 14 14 0 0 1 12.957031 15.421875 A 14 14 0 0 1 13.070312 15.271484 A 14 14 0 0 1 13.808594 14.425781 A 14 14 0 0 1 14.025391 14.195312 A 14 14 0 0 1 14.748047 13.515625 A 14 14 0 0 1 15.083984 13.220703 A 14 14 0 0 1 15.767578 12.697266 A 14 14 0 0 1 16.421875 12.228516 A 14 14 0 0 1 16.443359 12.214844 A 14 14 0 0 1 16.451172 12.208984 A 14 14 0 0 1 17.179688 11.794922 L 16.138672 10.085938 A 15.999999 15.999999 0 0 0 15.009766 10.767578 L 14.806641 10.564453 L 9.1503906 6.3222656 z "
       transform="matrix(0.26458333,0,0,0.26458333,0,284.30001)"
       id="path11" />
    <text
       xml:space="preserve"
       style="font-style:normal;font-variant:normal;font-weight:normal;font-stretch:normal;font-size:10.58333302px;line-height:1.25;font-family:'Noto Sans';-inkscape-font-specification:'Noto Sans';letter-spacing:0px;word-spacing:0px;fill:#000000;fill-opacity:1;stroke:none;stroke-width:0.26458332"
       x="6.0854168"
       y="289.32709"
       id="text4696"><tspan
         sodipodi:role="line"
         id="tspan4694"
         x="6.0854168"
         y="298.9566"
         style="font-style:normal;font-variant:normal;font-weight:normal;font-stretch:normal;font-family:Consolas;-inkscape-font-specification:Consolas;stroke-width:0.26458332" /></text>
    <text
       xml:space="preserve"
       style="font-style:normal;font-variant:normal;font-weight:normal;font-stretch:normal;font-size:9.50127125px;line-height:1.25;font-family:'Noto Sans';-inkscape-font-specification:'Noto Sans';letter-spacing:0px;word-spacing:0px;fill:#eff0f1;fill-opacity:1;stroke:none;stroke-width:0.23753177"
       x="3.6141994"
       y="323.02316"
       id="text4522"
       transform="scale(1.105294,0.90473662)"><tspan
         sodipodi:role="line"
         id="tspan4520"
         x="3.6141994"
         y="323.02316"
         style="font-style:normal;font-variant:normal;font-weight:500;font-stretch:normal;font-size:11.40152454px;font-family:'Source Code Pro';-inkscape-font-specification:'Source Code Pro Medium';fill:#eff0f1;fill-opacity:1;stroke-width:0.23753177">S</tspan></text>
  </g>
  <g
     inkscape:groupmode="layer"
     id="layer2"
     inkscape:label="Layer 2"
     transform="translate(0,-284.30001)" />
</svg>
