<?xml version="1.0" encoding="UTF-8" standalone="no"?>
<!-- Created with Inkscape (http://www.inkscape.org/) -->

<svg
   xmlns:dc="http://purl.org/dc/elements/1.1/"
   xmlns:cc="http://creativecommons.org/ns#"
   xmlns:rdf="http://www.w3.org/1999/02/22-rdf-syntax-ns#"
   xmlns:svg="http://www.w3.org/2000/svg"
   xmlns="http://www.w3.org/2000/svg"
   xmlns:sodipodi="http://sodipodi.sourceforge.net/DTD/sodipodi-0.dtd"
   xmlns:inkscape="http://www.inkscape.org/namespaces/inkscape"
   width="48"
   height="48"
   viewBox="0 0 12.7 12.7"
   version="1.1"
   id="svg3729"
   sodipodi:docname="cancel-red.svg"
   inkscape:version="0.92.4 5da689c313, 2019-01-14">
  <defs
     id="defs3723">
    <clipPath
       clipPathUnits="userSpaceOnUse"
       id="clipPath4087">
      <ellipse
         id="ellipse4089"
         cx="6.3397431"
         cy="290.64154"
         rx="5.5459933"
         ry="5.5477529"
         style="stroke-width:0.24026173" />
    </clipPath>
    <clipPath
       clipPathUnits="userSpaceOnUse"
       id="clipPath4087-3">
      <ellipse
         id="ellipse4089-6"
         cx="6.3397431"
         cy="290.64154"
         rx="5.5459933"
         ry="5.5477529"
         style="stroke-width:0.24026173" />
    </clipPath>
  </defs>
  <sodipodi:namedview
     id="base"
     pagecolor="#ffffff"
     bordercolor="#666666"
     borderopacity="1.0"
     inkscape:pageopacity="0.0"
     inkscape:pageshadow="2"
     inkscape:zoom="13.892291"
     inkscape:cx="-13.861971"
     inkscape:cy="20.116081"
     inkscape:document-units="mm"
     inkscape:current-layer="layer1"
     showgrid="true"
     showguides="false"
     units="px"
     inkscape:window-width="1890"
     inkscape:window-height="1053"
     inkscape:window-x="30"
     inkscape:window-y="0"
     inkscape:window-maximized="1">
    <inkscape:grid
       type="xygrid"
       id="grid3731" />
  </sodipodi:namedview>
  <metadata
     id="metadata3726">
    <rdf:RDF>
      <cc:Work
         rdf:about="">
        <dc:format>image/svg+xml</dc:format>
        <dc:type
           rdf:resource="http://purl.org/dc/dcmitype/StillImage" />
        <dc:title></dc:title>
      </cc:Work>
    </rdf:RDF>
  </metadata>
  <g
     inkscape:label="Layer 1"
     inkscape:groupmode="layer"
     id="layer1"
     transform="translate(0,-284.30001)">
    <path
       style="stroke-width:0.34837419;fill:#da4453;fill-opacity:1"
       d="m 10.302963,286.72728 a 5.5654812,5.5770554 45 0 0 -7.878918,0.008 5.5654812,5.5770554 45 0 0 -0.0084,7.87928 5.5654812,5.5770554 45 0 0 7.879283,-0.008 5.5654812,5.5770554 45 0 0 0.008,-7.87892 z m -0.5828255,0.54847 a 4.7411118,4.7601565 45 0 1 -0.01352,6.71802 4.7411118,4.7601565 45 0 1 -6.7183832,0.0139 4.7411118,4.7601565 45 0 1 0.01352,-6.71875 4.7411118,4.7601565 45 0 1 6.7183832,-0.0132 z"
       id="path4097"
       inkscape:connector-curvature="0" />
    <rect
       id="rect3774"
       width="11.1125"
       height="2.1166666"
       x="0.79374999"
       y="289.59167"
       style="stroke-width:0.30311829;fill:#da4453;fill-opacity:1"
       clip-path="url(#clipPath4087)"
       transform="matrix(0.70710678,0.70710678,-0.3535527,0.3535527,104.63749,183.39934)" />
    <ellipse
       id="path3960"
       cx="6.3499999"
       cy="290.65747"
       rx="5.5562501"
       ry="5.5637212"
       style="display:none;stroke-width:0.25867385" />
    <text
       xml:space="preserve"
       style="font-style:normal;font-weight:normal;font-size:10.58333302px;line-height:1.25;font-family:sans-serif;letter-spacing:0px;word-spacing:0px;fill:#da4453;fill-opacity:1;stroke:none;stroke-width:0.26458332;"
       x="199.17488"
       y="198.10735"
       id="text4060"
       transform="rotate(45)"><tspan
         sodipodi:role="line"
         id="tspan4058"
         x="199.17488"
         y="207.47112"
         style="stroke-width:0.26458332;fill:#da4453;fill-opacity:1;" /></text>
    <text
       xml:space="preserve"
       style="font-style:normal;font-weight:normal;font-size:10.58333302px;line-height:1.25;font-family:sans-serif;letter-spacing:0px;word-spacing:0px;fill:#da4453;fill-opacity:1;stroke:none;stroke-width:0.26458332;"
       x="204.46655"
       y="206.57402"
       id="text4064"
       transform="rotate(45)"><tspan
         sodipodi:role="line"
         id="tspan4062"
         x="204.46655"
         y="215.93779"
         style="stroke-width:0.26458332;fill:#da4453;fill-opacity:1;" /></text>
  </g>
  <g
     inkscape:groupmode="layer"
     id="layer2"
     inkscape:label="Layer 2"
     transform="translate(0,-284.30001)" />
</svg>
