<?xml version="1.0" encoding="UTF-8" standalone="no"?>
<!-- Created with Inkscape (http://www.inkscape.org/) -->

<svg
   xmlns:dc="http://purl.org/dc/elements/1.1/"
   xmlns:cc="http://creativecommons.org/ns#"
   xmlns:rdf="http://www.w3.org/1999/02/22-rdf-syntax-ns#"
   xmlns:svg="http://www.w3.org/2000/svg"
   xmlns="http://www.w3.org/2000/svg"
   xmlns:sodipodi="http://sodipodi.sourceforge.net/DTD/sodipodi-0.dtd"
   xmlns:inkscape="http://www.inkscape.org/namespaces/inkscape"
   width="48"
   height="48"
   viewBox="0 0 12.7 12.7"
   version="1.1"
   id="svg3729"
   sodipodi:docname="finance.svg"
   inkscape:version="0.92.4 5da689c313, 2019-01-14">
  <defs
     id="defs3723" />
  <sodipodi:namedview
     id="base"
     pagecolor="#ffffff"
     bordercolor="#666666"
     borderopacity="1.0"
     inkscape:pageopacity="0.0"
     inkscape:pageshadow="2"
     inkscape:zoom="14.409213"
     inkscape:cx="0.45423271"
     inkscape:cy="21.643208"
     inkscape:document-units="mm"
     inkscape:current-layer="layer1"
     showgrid="true"
     showguides="false"
     units="px"
     inkscape:window-width="1890"
     inkscape:window-height="1053"
     inkscape:window-x="30"
     inkscape:window-y="0"
     inkscape:window-maximized="1">
    <inkscape:grid
       type="xygrid"
       id="grid3731" />
  </sodipodi:namedview>
  <metadata
     id="metadata3726">
    <rdf:RDF>
      <cc:Work
         rdf:about="">
        <dc:format>image/svg+xml</dc:format>
        <dc:type
           rdf:resource="http://purl.org/dc/dcmitype/StillImage" />
        <dc:title />
      </cc:Work>
    </rdf:RDF>
  </metadata>
  <g
     inkscape:label="Layer 1"
     inkscape:groupmode="layer"
     id="layer1"
     transform="translate(0,-284.30001)">
    <path
       style="fill:#eff0f1;fill-opacity:1;fill-rule:nonzero;stroke-width:1.21395409"
       d="M 5 10 C 3.8919748 10 3 10.891975 3 12 L 3 36 C 3 37.108025 3.8919748 38 5 38 L 9 38 L 40 38 L 43 38 C 44.108025 38 45 37.108025 45 36 L 45 12 C 45 10.891975 44.108025 10 43 10 L 40 10 L 9 10 L 5 10 z M 24 13.416016 A 14 10.679801 0 0 1 38 24.095703 A 14 10.679801 0 0 1 24 34.775391 A 14 10.679801 0 0 1 10 24.095703 A 14 10.679801 0 0 1 24 13.416016 z "
       transform="matrix(0.26458333,0,0,0.26458333,0,284.30001)"
       id="rect818" />
    <path
       style="fill:#eff0f1;fill-opacity:1;fill-rule:nonzero;stroke-width:0.12526622"
       d="m 5.5165626,288.25553 v 1.07156 h -0.47625 v 0.71437 h 0.47625 v 1.07157 h 0.238125 v -1.07157 h 0.3571875 v 1.07157 H 6.35 v -1.07157 h 0.6562391 l -1.608739,2.97657 h 0.4799707 l 1.9947618,-3.69094 H 6.35 v -1.07156 H 6.1118751 v 1.07156 H 5.7546876 v -1.07156 z"
       id="rect4523"
       inkscape:connector-curvature="0" />
  </g>
  <g
     inkscape:groupmode="layer"
     id="layer2"
     inkscape:label="Layer 2"
     transform="translate(0,-284.30001)" />
</svg>
