<?xml version="1.0" encoding="UTF-8" standalone="no"?>
<!-- Created with Inkscape (http://www.inkscape.org/) -->

<svg
   xmlns:dc="http://purl.org/dc/elements/1.1/"
   xmlns:cc="http://creativecommons.org/ns#"
   xmlns:rdf="http://www.w3.org/1999/02/22-rdf-syntax-ns#"
   xmlns:svg="http://www.w3.org/2000/svg"
   xmlns="http://www.w3.org/2000/svg"
   xmlns:sodipodi="http://sodipodi.sourceforge.net/DTD/sodipodi-0.dtd"
   xmlns:inkscape="http://www.inkscape.org/namespaces/inkscape"
   width="48"
   height="48"
   viewBox="0 0 12.7 12.7"
   version="1.1"
   id="svg3729"
   sodipodi:docname="text-center.svg"
   inkscape:version="0.92.4 5da689c313, 2019-01-14">
  <defs
     id="defs3723" />
  <sodipodi:namedview
     id="base"
     pagecolor="#ffffff"
     bordercolor="#666666"
     borderopacity="1.0"
     inkscape:pageopacity="0.0"
     inkscape:pageshadow="2"
     inkscape:zoom="13.892291"
     inkscape:cx="-4.6482286"
     inkscape:cy="20.332028"
     inkscape:document-units="mm"
     inkscape:current-layer="layer1"
     showgrid="true"
     showguides="false"
     units="px"
     inkscape:window-width="1890"
     inkscape:window-height="1053"
     inkscape:window-x="30"
     inkscape:window-y="0"
     inkscape:window-maximized="1">
    <inkscape:grid
       type="xygrid"
       id="grid3731" />
  </sodipodi:namedview>
  <metadata
     id="metadata3726">
    <rdf:RDF>
      <cc:Work
         rdf:about="">
        <dc:format>image/svg+xml</dc:format>
        <dc:type
           rdf:resource="http://purl.org/dc/dcmitype/StillImage" />
        <dc:title />
      </cc:Work>
    </rdf:RDF>
  </metadata>
  <g
     inkscape:label="Layer 1"
     inkscape:groupmode="layer"
     id="layer1"
     transform="translate(0,-284.30001)">
    <rect
       id="rect3774"
       width="3.1749997"
       height="1.0583314"
       x="-7.9375"
       y="290.12085"
       style="stroke-width:0.11456783;fill:#4d4d4d;fill-opacity:1"
       transform="scale(-1,1)" />
    <rect
       id="rect3774-3"
       width="5.8208337"
       height="1.0583314"
       x="-9.260417"
       y="288.53336"
       style="stroke-width:0.15512559;fill:#4d4d4d;fill-opacity:1"
       transform="scale(-1,1)" />
    <rect
       id="rect3774-6"
       width="5.8208337"
       height="1.0583314"
       x="-9.260417"
       y="286.94586"
       style="stroke-width:0.15512559;fill:#4d4d4d;fill-opacity:1"
       transform="scale(-1,1)" />
    <rect
       id="rect3774-7"
       width="11.1125"
       height="1.0583314"
       x="-11.90625"
       y="285.35837"
       style="stroke-width:0.2143368;fill:#4d4d4d;fill-opacity:1"
       transform="scale(-1,1)" />
    <rect
       id="rect3774-5"
       width="8.4666662"
       height="1.0583314"
       x="-10.583333"
       y="291.70834"
       style="stroke-width:0.18708849;fill:#4d4d4d;fill-opacity:1"
       transform="scale(-1,1)" />
    <rect
       id="rect3774-35"
       width="11.1125"
       height="1.0583314"
       x="-11.90625"
       y="293.29587"
       style="stroke-width:0.2143368;fill:#4d4d4d;fill-opacity:1"
       transform="scale(-1,1)" />
    <rect
       id="rect3774-62"
       width="5.8208337"
       height="1.0583314"
       x="-9.260417"
       y="294.88333"
       style="stroke-width:0.15512559;fill:#4d4d4d;fill-opacity:1"
       transform="scale(-1,1)" />
  </g>
  <g
     inkscape:groupmode="layer"
     id="layer2"
     inkscape:label="Layer 2"
     transform="translate(0,-284.30001)" />
</svg>
