<?xml version="1.0" encoding="UTF-8" standalone="no"?>
<!-- Created with Inkscape (http://www.inkscape.org/) -->

<svg
   xmlns:dc="http://purl.org/dc/elements/1.1/"
   xmlns:cc="http://creativecommons.org/ns#"
   xmlns:rdf="http://www.w3.org/1999/02/22-rdf-syntax-ns#"
   xmlns:svg="http://www.w3.org/2000/svg"
   xmlns="http://www.w3.org/2000/svg"
   xmlns:sodipodi="http://sodipodi.sourceforge.net/DTD/sodipodi-0.dtd"
   xmlns:inkscape="http://www.inkscape.org/namespaces/inkscape"
   width="269.05371"
   height="76.513023"
   viewBox="0 0 71.187127 20.244071"
   version="1.1"
   id="svg3729"
   sodipodi:docname="shrademn-company.svg"
   inkscape:version="0.92.4 (5da689c313, 2019-01-14)">
  <defs
     id="defs3723" />
  <sodipodi:namedview
     id="base"
     pagecolor="#ffffff"
     bordercolor="#666666"
     borderopacity="1.0"
     inkscape:pageopacity="0.0"
     inkscape:pageshadow="2"
     inkscape:zoom="3.6203867"
     inkscape:cx="155.54188"
     inkscape:cy="61.180658"
     inkscape:document-units="mm"
     inkscape:current-layer="layer1"
     showgrid="true"
     showguides="false"
     units="px"
     inkscape:window-width="1920"
     inkscape:window-height="1027"
     inkscape:window-x="3832"
     inkscape:window-y="-8"
     inkscape:window-maximized="1"
     inkscape:lockguides="false"
     fit-margin-top="0"
     fit-margin-left="0"
     fit-margin-right="0"
     fit-margin-bottom="0">
    <inkscape:grid
       type="xygrid"
       id="grid3731"
       originx="-0.26458243"
       originy="-3.390573" />
  </sodipodi:namedview>
  <metadata
     id="metadata3726">
    <rdf:RDF>
      <cc:Work
         rdf:about="">
        <dc:format>image/svg+xml</dc:format>
        <dc:type
           rdf:resource="http://purl.org/dc/dcmitype/StillImage" />
        <dc:title></dc:title>
      </cc:Work>
    </rdf:RDF>
  </metadata>
  <g
     inkscape:label="Layer 1"
     inkscape:groupmode="layer"
     id="layer1"
     transform="translate(-0.26458243,-273.36537)">
    <path
       style="fill:#eff0f1;fill-opacity:1;stroke-width:0.26458332"
       d="m 2.4210408,274.40087 -0.7482747,0.74828 1.1224121,1.49655 0.056327,0.0563 a 4.233333,4.233333 0 0 0 -0.6568075,1.58234 h -0.078032 l -1.85208327,0.26458 v 1.05833 l 1.85208327,0.26459 h 0.076998 a 4.233333,4.233333 0 0 0 0.6552571,1.58491 l -0.053743,0.0537 -1.1224121,1.49655 0.7482747,0.74827 1.4965496,-1.12241 0.056327,-0.0563 a 4.233333,4.233333 0 0 0 1.5823324,0.65681 v 0.078 l 0.2645834,1.85208 h 1.0583333 l 0.2645833,-1.85208 v -0.077 a 4.233333,4.233333 0 0 0 1.5849161,-0.65526 l 0.053743,0.0537 1.4965495,1.12241 0.748275,-0.74827 -1.1224123,-1.49707 -0.056327,-0.0563 a 4.233333,4.233333 0 0 0 0.1999873,-0.32866 L 9.5988966,280.8438 a 3.7041666,3.7041666 0 0 1 -0.1317749,0.22841 3.7041666,3.7041666 0 0 1 -0.00156,0.002 3.7041666,3.7041666 0 0 1 -0.1979207,0.27906 3.7041666,3.7041666 0 0 1 -0.022738,0.03 3.7041666,3.7041666 0 0 1 -0.2056723,0.23564 3.7041666,3.7041666 0 0 1 -0.045992,0.0491 3.7041666,3.7041666 0 0 1 -0.2041218,0.19172 3.7041666,3.7041666 0 0 1 -0.075447,0.0667 3.7041666,3.7041666 0 0 1 -0.1953371,0.14934 3.7041666,3.7041666 0 0 1 -0.146761,0.10491 3.7041666,3.7041666 0 0 1 -0.024805,0.0165 l 5.291e-4,5.3e-4 a 3.7041666,3.7041666 0 0 1 -1.2035451,0.4935 3.7041666,3.7041666 0 0 1 -0.3255616,0.0568 3.7041666,3.7041666 0 0 1 -0.081649,0.01 3.7041666,3.7041666 0 0 1 -0.2971396,0.0212 3.7041666,3.7041666 0 0 1 -0.0894,0.003 3.7041666,3.7041666 0 0 1 -0.79375,-0.0889 3.7041666,3.7041666 0 0 1 -1.2004434,-0.49868 3.7041666,3.7041666 0 0 1 -0.2914552,-0.20722 3.7041666,3.7041666 0 0 1 -0.014986,-0.0114 3.7041666,3.7041666 0 0 1 -0.2490806,-0.21704 3.7041666,3.7041666 0 0 1 -0.03669,-0.0346 3.7041666,3.7041666 0 0 1 -0.1963703,-0.20826 3.7041666,3.7041666 0 0 1 -0.066146,-0.0755 3.7041666,3.7041666 0 0 1 -0.1529623,-0.19999 3.7041666,3.7041666 0 0 1 -0.099219,-0.139 3.7041666,3.7041666 0 0 1 -0.018087,-0.0269 l -5.292e-4,5.3e-4 a 3.7041666,3.7041666 0 0 1 -0.4934974,-1.20355 3.7041666,3.7041666 0 0 1 -0.056844,-0.32557 3.7041666,3.7041666 0 0 1 -0.00982,-0.0816 3.7041666,3.7041666 0 0 1 -0.021187,-0.29714 3.7041666,3.7041666 0 0 1 -0.0031,-0.0894 3.7041666,3.7041666 0 0 1 0.088884,-0.79375 3.7041666,3.7041666 0 0 1 0.4986774,-1.20045 3.7041666,3.7041666 0 0 1 0.1948201,-0.27543 3.7041666,3.7041666 0 0 1 0.029972,-0.0398 3.7041666,3.7041666 0 0 1 0.1953371,-0.22376 3.7041666,3.7041666 0 0 1 0.057361,-0.061 3.7041666,3.7041666 0 0 1 0.1912027,-0.17983 3.7041666,3.7041666 0 0 1 0.088883,-0.078 3.7041666,3.7041666 0 0 1 0.1808676,-0.13849 3.7041666,3.7041666 0 0 1 0.1731161,-0.12402 3.7041666,3.7041666 0 0 1 0.00568,-0.004 3.7041666,3.7041666 0 0 1 0.00206,-0.002 3.7041666,3.7041666 0 0 1 0.1927532,-0.10955 l -0.2754355,-0.45217 a 4.233333,4.233333 0 0 0 -0.2986897,0.18035 l -0.053743,-0.0537 z"
       id="path11"
       inkscape:connector-curvature="0" />
    <text
       xml:space="preserve"
       style="font-style:normal;font-variant:normal;font-weight:normal;font-stretch:normal;font-size:10.58333302px;line-height:1.25;font-family:'Noto Sans';-inkscape-font-specification:'Noto Sans';letter-spacing:0px;word-spacing:0px;fill:#000000;fill-opacity:1;stroke:none;stroke-width:0.26458332"
       x="6.0854168"
       y="289.32709"
       id="text4696"><tspan
         sodipodi:role="line"
         id="tspan4694"
         x="6.0854168"
         y="298.9566"
         style="font-style:normal;font-variant:normal;font-weight:normal;font-stretch:normal;font-family:Consolas;-inkscape-font-specification:Consolas;stroke-width:0.26458332" /></text>
    <text
       xml:space="preserve"
       style="font-style:normal;font-variant:normal;font-weight:normal;font-stretch:normal;font-size:9.50127125px;line-height:1.25;font-family:'Noto Sans';-inkscape-font-specification:'Noto Sans';letter-spacing:0px;word-spacing:0px;fill:#eff0f1;fill-opacity:1;stroke:none;stroke-width:0.23753177"
       x="3.6141994"
       y="310.23279"
       id="text4522"
       transform="scale(1.105294,0.90473664)"><tspan
         sodipodi:role="line"
         x="3.6141994"
         y="310.23279"
         style="font-style:normal;font-variant:normal;font-weight:500;font-stretch:normal;font-size:11.40152454px;line-height:11.87658882px;font-family:'Source Code Pro';-inkscape-font-specification:'Source Code Pro Medium';letter-spacing:0px;fill:#eff0f1;fill-opacity:1;stroke-width:0.23753177"
         id="tspan834">Shrademn'</tspan></text>
    <text
       xml:space="preserve"
       style="font-style:normal;font-variant:normal;font-weight:normal;font-stretch:normal;font-size:10.58333302px;line-height:1.25;font-family:'Noto Sans';-inkscape-font-specification:'Noto Sans';letter-spacing:0px;word-spacing:0px;fill:#000000;fill-opacity:1;stroke:none;stroke-width:0.26458332"
       x="71.4375"
       y="294.35419"
       id="text826"><tspan
         sodipodi:role="line"
         id="tspan824"
         x="71.4375"
         y="303.9837"
         style="stroke-width:0.26458332" /><tspan
         sodipodi:role="line"
         x="71.4375"
         y="317.21286"
         style="stroke-width:0.26458332"
         id="tspan828" /></text>
    <text
       xml:space="preserve"
       style="font-style:normal;font-variant:normal;font-weight:normal;font-stretch:normal;font-size:9.50127125px;line-height:1.25;font-family:'Noto Sans';-inkscape-font-specification:'Noto Sans';letter-spacing:0px;word-spacing:0px;fill:#eff0f1;fill-opacity:1;stroke:none;stroke-width:0.23753177"
       x="3.6140451"
       y="322.18744"
       id="text4522-8"
       transform="scale(1.105294,0.90473666)"><tspan
         sodipodi:role="line"
         x="3.6140451"
         y="322.18744"
         style="font-style:normal;font-variant:normal;font-weight:500;font-stretch:normal;font-size:11.40152454px;line-height:11.87658882px;font-family:'Source Code Pro';-inkscape-font-specification:'Source Code Pro Medium';letter-spacing:0px;fill:#eff0f1;fill-opacity:1;stroke-width:0.23753177"
         id="tspan834-5">  Company</tspan></text>
  </g>
  <g
     inkscape:groupmode="layer"
     id="layer2"
     inkscape:label="Layer 2"
     transform="translate(-0.26458243,-273.36537)" />
</svg>
