<?xml version="1.0" encoding="UTF-8" standalone="no"?>
<!-- Created with Inkscape (http://www.inkscape.org/) -->

<svg
   xmlns:dc="http://purl.org/dc/elements/1.1/"
   xmlns:cc="http://creativecommons.org/ns#"
   xmlns:rdf="http://www.w3.org/1999/02/22-rdf-syntax-ns#"
   xmlns:svg="http://www.w3.org/2000/svg"
   xmlns="http://www.w3.org/2000/svg"
   xmlns:sodipodi="http://sodipodi.sourceforge.net/DTD/sodipodi-0.dtd"
   xmlns:inkscape="http://www.inkscape.org/namespaces/inkscape"
   width="48"
   height="48"
   viewBox="0 0 12.7 12.7"
   version="1.1"
   id="svg3729"
   sodipodi:docname="flag-yellow.svg"
   inkscape:version="0.92.4 5da689c313, 2019-01-14">
  <defs
     id="defs3723" />
  <sodipodi:namedview
     id="base"
     pagecolor="#ffffff"
     bordercolor="#666666"
     borderopacity="1.0"
     inkscape:pageopacity="0.0"
     inkscape:pageshadow="2"
     inkscape:zoom="20.861824"
     inkscape:cx="23.694837"
     inkscape:cy="22.529824"
     inkscape:document-units="mm"
     inkscape:current-layer="layer1"
     showgrid="true"
     showguides="false"
     units="px"
     inkscape:window-width="1890"
     inkscape:window-height="1053"
     inkscape:window-x="30"
     inkscape:window-y="0"
     inkscape:window-maximized="1">
    <inkscape:grid
       type="xygrid"
       id="grid3731" />
  </sodipodi:namedview>
  <metadata
     id="metadata3726">
    <rdf:RDF>
      <cc:Work
         rdf:about="">
        <dc:format>image/svg+xml</dc:format>
        <dc:type
           rdf:resource="http://purl.org/dc/dcmitype/StillImage" />
        <dc:title></dc:title>
      </cc:Work>
    </rdf:RDF>
  </metadata>
  <g
     inkscape:label="Layer 1"
     inkscape:groupmode="layer"
     id="layer1"
     transform="translate(0,-284.30001)">
    <rect
       id="rect3768"
       width="0.79374999"
       height="11.112521"
       x="2.1166666"
       y="285.09375"
       style="fill:#eff0f1;fill-opacity:1;stroke-width:0.22913611" />
    <rect
       style="fill:#edc11e;fill-opacity:1;fill-rule:nonzero;stroke-width:0.2105213"
       id="rect819"
       width="4.0620728"
       height="3.2731483"
       x="2.9788535"
       y="284.45892"
       transform="matrix(0.97702588,0.21312067,0,1,0,0)" />
    <path
       style="fill:#edc11e;fill-opacity:1;fill-rule:nonzero;stroke-width:0.25871512"
       d="m 8.9627604,288.00418 -2.0835937,0.69864 v 2.74095 l 4.7624993,-1.05224 z"
       id="rect821"
       inkscape:connector-curvature="0"
       sodipodi:nodetypes="ccccc" />
    <rect
       style="fill:#edc11e;fill-opacity:1;fill-rule:nonzero;stroke-width:0.21052021"
       id="rect819-3"
       width="4.0620723"
       height="3.2731147"
       x="2.9788535"
       y="289.00177"
       transform="matrix(0.97702588,-0.21312068,0,1,0,0)" />
    <path
       style="fill:#edc11e;fill-opacity:1;fill-rule:nonzero;stroke-width:0.25871518"
       d="m 6.8791667,286.55407 v 2.74095 l 2.0835937,0.53865 2.6789056,-2.22737 z"
       id="rect821-6"
       inkscape:connector-curvature="0"
       sodipodi:nodetypes="ccccc" />
  </g>
  <g
     inkscape:groupmode="layer"
     id="layer2"
     inkscape:label="Layer 2"
     transform="translate(0,-284.30001)" />
</svg>
