<?xml version="1.0" encoding="UTF-8" standalone="no"?>
<!-- Created with Inkscape (http://www.inkscape.org/) -->

<svg
   xmlns:dc="http://purl.org/dc/elements/1.1/"
   xmlns:cc="http://creativecommons.org/ns#"
   xmlns:rdf="http://www.w3.org/1999/02/22-rdf-syntax-ns#"
   xmlns:svg="http://www.w3.org/2000/svg"
   xmlns="http://www.w3.org/2000/svg"
   xmlns:sodipodi="http://sodipodi.sourceforge.net/DTD/sodipodi-0.dtd"
   xmlns:inkscape="http://www.inkscape.org/namespaces/inkscape"
   width="48"
   height="48"
   viewBox="0 0 12.7 12.7"
   version="1.1"
   id="svg3729"
   sodipodi:docname="library-blue.svg"
   inkscape:version="0.92.4 (5da689c313, 2019-01-14)">
  <defs
     id="defs3723" />
  <sodipodi:namedview
     id="base"
     pagecolor="#ffffff"
     bordercolor="#666666"
     borderopacity="1.0"
     inkscape:pageopacity="0.0"
     inkscape:pageshadow="2"
     inkscape:zoom="13.892291"
     inkscape:cx="15.912237"
     inkscape:cy="29.450124"
     inkscape:document-units="mm"
     inkscape:current-layer="layer1"
     showgrid="true"
     showguides="false"
     units="px"
     inkscape:window-width="1920"
     inkscape:window-height="1027"
     inkscape:window-x="3832"
     inkscape:window-y="-8"
     inkscape:window-maximized="1">
    <inkscape:grid
       type="xygrid"
       id="grid3731" />
  </sodipodi:namedview>
  <metadata
     id="metadata3726">
    <rdf:RDF>
      <cc:Work
         rdf:about="">
        <dc:format>image/svg+xml</dc:format>
        <dc:type
           rdf:resource="http://purl.org/dc/dcmitype/StillImage" />
        <dc:title />
      </cc:Work>
    </rdf:RDF>
  </metadata>
  <g
     inkscape:label="Layer 1"
     inkscape:groupmode="layer"
     id="layer1"
     transform="translate(0,-284.30001)">
    <rect
       id="rect3768-8"
       width="1.5875003"
       height="9.2604599"
       x="0.79374999"
       y="285.09372"
       style="fill:#4d4d4d;fill-opacity:1;stroke-width:0.29581386"
       ry="0.22049505" />
    <rect
       style="fill:#3daee9;fill-opacity:1;stroke-width:0.26458332"
       id="rect855"
       width="1.5875"
       height="0.52916664"
       x="0.79375023"
       y="285.62289" />
    <rect
       style="fill:#3daee9;fill-opacity:1;stroke-width:0.26458332"
       id="rect857"
       width="1.5875"
       height="1.3229166"
       x="0.79375023"
       y="286.68124" />
    <rect
       style="fill:#3daee9;fill-opacity:1;stroke-width:0.26458332"
       id="rect861"
       width="1.5875"
       height="0.52916664"
       x="0.79375023"
       y="288.53333" />
    <rect
       id="rect3768-8-4"
       width="1.5875003"
       height="9.2604599"
       x="2.6458335"
       y="285.09372"
       style="fill:#4d4d4d;fill-opacity:1;stroke-width:0.29581386"
       ry="0.22049505" />
    <rect
       style="fill:#3daee9;fill-opacity:1;stroke-width:0.26458332"
       id="rect855-4"
       width="1.5875"
       height="0.52916664"
       x="2.6458337"
       y="285.62289" />
    <rect
       style="fill:#3daee9;fill-opacity:1;stroke-width:0.26458332"
       id="rect857-6"
       width="1.5875"
       height="1.3229166"
       x="2.6458337"
       y="286.68124" />
    <rect
       style="fill:#3daee9;fill-opacity:1;stroke-width:0.26458332"
       id="rect861-8"
       width="1.5875"
       height="0.52916664"
       x="2.6458337"
       y="288.53333" />
    <rect
       id="rect3768-8-3"
       width="1.5875003"
       height="9.2604599"
       x="4.4979167"
       y="285.09372"
       style="fill:#4d4d4d;fill-opacity:1;stroke-width:0.29581386"
       ry="0.22049505" />
    <rect
       style="fill:#3daee9;fill-opacity:1;stroke-width:0.26458332"
       id="rect855-7"
       width="1.5875"
       height="0.52916664"
       x="4.4979167"
       y="285.62289" />
    <rect
       style="fill:#3daee9;fill-opacity:1;stroke-width:0.26458332"
       id="rect857-2"
       width="1.5875"
       height="1.3229166"
       x="4.4979167"
       y="286.68124" />
    <rect
       style="fill:#3daee9;fill-opacity:1;stroke-width:0.26458332"
       id="rect861-0"
       width="1.5875"
       height="0.52916664"
       x="4.4979167"
       y="288.53333" />
    <rect
       id="rect3768-8-3-4"
       width="1.5875003"
       height="9.2604599"
       x="-137.82491"
       y="251.15515"
       style="fill:#4d4d4d;fill-opacity:1;stroke-width:0.29581386"
       ry="0.22049505"
       transform="rotate(-30)" />
    <rect
       style="fill:#3daee9;fill-opacity:1;stroke-width:0.26458332"
       id="rect855-7-8"
       width="1.5875"
       height="0.52916664"
       x="-137.82491"
       y="251.68433"
       transform="rotate(-30)" />
    <rect
       style="fill:#3daee9;fill-opacity:1;stroke-width:0.26458332"
       id="rect857-2-8"
       width="1.5875"
       height="1.3229166"
       x="-137.82491"
       y="252.74268"
       transform="rotate(-30)" />
    <rect
       style="fill:#3daee9;fill-opacity:1;stroke-width:0.26458332"
       id="rect861-0-7"
       width="1.5875"
       height="0.52916664"
       x="-137.82491"
       y="254.59476"
       transform="rotate(-30)" />
    <rect
       style="fill:#4d4d4d;fill-opacity:1;stroke-width:0.34961265"
       id="rect938"
       width="11.641667"
       height="1.3229083"
       x="0.52916664"
       y="294.88333" />
  </g>
  <g
     inkscape:groupmode="layer"
     id="layer2"
     inkscape:label="Layer 2"
     transform="translate(0,-284.30001)" />
</svg>
