ID,PCP_AR,PCP_NE_pH,PCP_HB
Seq_1,0.042,0.917,0.5
Seq_2,0.022,0.778,0.444
Seq_3,0.062,0.642,0.469
Seq_4,0.083,0.833,0.75
Seq_5,0.042,0.75,0.625
Seq_6,0.086,0.914,0.724
Seq_7,0.159,0.864,0.455
Seq_8,0.083,0.75,0.5
Seq_9,0.029,0.824,0.5
Seq_10,0.0,0.681,0.638
Seq_11,0.091,0.818,0.727
Seq_12,0.167,0.8,0.567
Seq_13,0.071,0.929,0.643
Seq_14,0.15,0.6,0.5
Seq_15,0.158,0.842,0.526
Seq_16,0.227,0.909,0.545
Seq_17,0.054,0.649,0.486
Seq_18,0.132,0.395,0.053
Seq_19,0.042,0.792,0.667
Seq_20,0.1,0.667,0.533
Seq_21,0.0,0.95,0.6
Seq_22,0.08,0.72,0.56
Seq_23,0.028,0.944,0.611
Seq_24,0.167,0.75,0.542
Seq_25,0.065,0.717,0.478
Seq_26,0.071,0.643,0.571
Seq_27,0.0,0.786,0.714
Seq_28,0.186,0.837,0.419
Seq_29,0.152,0.818,0.576
Seq_30,0.095,0.81,0.524
Seq_31,0.046,0.769,0.431
Seq_32,0.048,0.786,0.524
Seq_33,0.012,0.663,0.446
Seq_34,0.077,0.821,0.436
Seq_35,0.056,0.833,0.556
Seq_36,0.062,0.859,0.609
Seq_37,0.059,0.882,0.706
Seq_38,0.0,0.882,0.618
Seq_39,0.167,0.833,0.5
Seq_40,0.05,0.675,0.425
Seq_41,0.067,0.833,0.533
Seq_42,0.0,0.923,0.769
Seq_43,0.154,0.846,0.692
Seq_44,0.045,1.0,0.818
Seq_45,0.086,0.886,0.629
Seq_46,0.056,0.887,0.507
Seq_47,0.111,0.593,0.519
Seq_48,0.034,0.655,0.448
Seq_49,0.026,0.744,0.513
Seq_50,0.0,0.0,0.0
Seq_51,0.105,0.842,0.632
Seq_52,0.059,0.824,0.647
Seq_53,0.1,0.767,0.467
Seq_54,0.097,0.839,0.484
Seq_55,0.056,0.722,0.611
Seq_56,0.108,0.676,0.405
Seq_57,0.088,0.529,0.382
Seq_58,0.057,0.8,0.586
Seq_59,0.125,0.833,0.75
Seq_60,0.118,0.529,0.412
Seq_61,0.105,0.895,0.684
Seq_62,0.069,0.897,0.621
Seq_63,0.034,0.931,0.621
Seq_64,0.0,0.905,0.619
Seq_65,0.065,0.871,0.548
Seq_66,0.071,0.631,0.286
Seq_67,0.167,0.625,0.375
Seq_68,0.091,0.818,0.606
Seq_69,0.108,0.757,0.432
Seq_70,0.12,0.64,0.52
Seq_71,0.08,0.76,0.52
Seq_72,0.078,0.878,0.533
Seq_73,0.065,0.839,0.548
Seq_74,0.018,0.732,0.536
Seq_75,0.176,0.765,0.706
Seq_76,0.045,0.909,0.636
Seq_77,0.065,0.761,0.435
Seq_78,0.05,0.75,0.525
Seq_79,0.158,0.684,0.421
Seq_80,0.093,0.794,0.526
Seq_81,0.069,0.793,0.621
Seq_82,0.0,0.68,0.48
Seq_83,0.069,0.793,0.448
Seq_84,0.087,0.739,0.609
Seq_85,0.034,0.414,0.172
Seq_86,0.0,0.8,0.64
Seq_87,0.045,0.75,0.455
Seq_88,0.19,0.952,0.619
Seq_89,0.065,0.761,0.5
Seq_90,0.03,0.515,0.273
Seq_91,0.107,0.929,0.607
Seq_92,0.043,0.652,0.435
Seq_93,0.0,0.8,0.533
Seq_94,0.091,0.727,0.424
Seq_95,0.176,0.559,0.441
Seq_96,0.08,0.8,0.52
Seq_97,0.0,1.0,0.6
Seq_98,0.067,0.933,0.667
Seq_99,0.235,0.647,0.471
Seq_100,0.231,0.692,0.654
Seq_101,0.214,0.786,0.643
Seq_102,0.182,0.909,0.818
Seq_103,0.083,0.833,0.792
Seq_104,0.217,0.783,0.522
Seq_105,0.105,0.526,0.368
Seq_106,0.0,0.933,0.7
Seq_107,0.091,0.636,0.545
Seq_108,0.119,0.619,0.381
Seq_109,0.111,0.667,0.444
Seq_110,0.154,0.923,0.769
Seq_111,0.091,0.891,0.636
Seq_112,0.0,0.696,0.348
Seq_113,0.0,0.618,0.382
Seq_114,0.048,0.857,0.619
Seq_115,0.071,0.714,0.5
Seq_116,0.135,0.769,0.385
Seq_117,0.12,0.64,0.48
Seq_118,0.122,0.735,0.449
Seq_119,0.0,0.733,0.6
Seq_120,0.0,1.0,0.8
Seq_121,0.167,0.667,0.625
Seq_122,0.097,0.742,0.548
Seq_123,0.154,0.744,0.692
Seq_124,0.092,0.793,0.471
Seq_125,0.103,0.759,0.621
Seq_126,0.115,0.615,0.385
Seq_127,0.081,0.676,0.432
Seq_128,0.15,0.85,0.8
Seq_129,0.071,0.857,0.714
Seq_130,0.127,0.823,0.532
Seq_131,0.066,0.869,0.705
Seq_132,0.154,0.846,0.385
Seq_133,0.043,0.87,0.522
Seq_134,0.032,0.556,0.159
Seq_135,0.063,0.667,0.381
Seq_136,0.048,0.714,0.429
Seq_137,0.0,0.84,0.64
Seq_138,0.0,0.765,0.529
Seq_139,0.065,0.804,0.457
Seq_140,0.154,0.923,0.846
Seq_141,0.0,0.684,0.368
Seq_142,0.0,0.769,0.462
Seq_143,0.113,0.839,0.435
Seq_144,0.097,0.839,0.468
Seq_145,0.04,0.64,0.4
Seq_146,0.5,0.875,0.75
Seq_147,0.045,0.909,0.591
Seq_148,0.238,0.857,0.333
Seq_149,0.308,0.846,0.615
Seq_150,0.107,0.714,0.429
Seq_151,0.143,0.857,0.5
Seq_152,0.145,0.855,0.447
Seq_153,0.075,0.775,0.5
Seq_154,0.043,0.804,0.435
Seq_155,0.125,0.625,0.5
Seq_156,0.129,0.731,0.312
Seq_157,0.0,0.667,0.556
Seq_158,0.154,1.0,0.769
Seq_159,0.036,0.786,0.464
Seq_160,0.062,0.812,0.562
Seq_161,0.071,0.857,0.643
Seq_162,0.098,0.804,0.471
Seq_163,0.059,0.765,0.588
Seq_164,0.071,0.786,0.643
Seq_165,0.385,0.769,0.769
Seq_166,0.037,0.815,0.593
Seq_167,0.093,0.86,0.395
Seq_168,0.116,0.581,0.372
Seq_169,0.203,0.924,0.772
Seq_170,0.048,0.905,0.619
Seq_171,0.111,0.778,0.667
Seq_172,0.042,0.875,0.5
Seq_173,0.25,0.75,0.5
Seq_174,0.067,0.867,0.6
Seq_175,0.097,0.871,0.548
Seq_176,0.034,0.591,0.466
Seq_177,0.067,0.833,0.567
Seq_178,0.125,0.688,0.375
Seq_179,0.062,0.646,0.5
Seq_180,0.053,0.697,0.421
Seq_181,0.069,0.897,0.655
Seq_182,0.07,0.791,0.488
Seq_183,0.162,0.622,0.378
Seq_184,0.085,0.702,0.426
Seq_185,0.067,0.844,0.333
Seq_186,0.143,0.5,0.5
Seq_187,0.5,0.5,0.5
Seq_188,0.077,0.654,0.538
Seq_189,0.132,0.737,0.526
Seq_190,0.073,0.854,0.61
Seq_191,0.273,0.909,0.545
Seq_192,0.13,0.783,0.478
Seq_193,0.083,0.833,0.792
Seq_194,0.059,0.765,0.529
Seq_195,0.132,0.717,0.528
Seq_196,0.0,0.889,0.444
Seq_197,0.048,0.94,0.464
Seq_198,0.038,0.731,0.538
Seq_199,0.167,0.792,0.542
Seq_200,0.125,0.875,0.625
Seq_201,0.0,0.846,0.538
Seq_202,0.137,0.667,0.392
Seq_203,0.077,0.769,0.615
Seq_204,0.062,0.812,0.625
Seq_205,0.125,0.812,0.562
Seq_206,0.077,0.923,0.769
Seq_207,0.13,0.739,0.435
Seq_208,0.133,0.733,0.4
Seq_209,0.024,0.699,0.518
Seq_210,0.047,0.781,0.5
Seq_211,0.067,0.8,0.6
Seq_212,0.0,0.786,0.643
Seq_213,0.044,0.667,0.4
Seq_214,0.125,0.833,0.75
Seq_215,0.0,0.788,0.455
Seq_216,0.0,0.571,0.571
Seq_217,0.062,0.812,0.562
Seq_218,0.302,0.887,0.075
Seq_219,0.118,0.676,0.5
Seq_220,0.111,0.593,0.444
Seq_221,0.152,0.788,0.364
Seq_222,0.0,0.786,0.571
Seq_223,0.109,0.709,0.145
Seq_224,0.111,0.815,0.519
Seq_225,0.125,0.75,0.625
Seq_226,0.043,0.826,0.522
Seq_227,0.195,0.756,0.512
Seq_228,0.205,0.872,0.538
Seq_229,0.05,0.6,0.2
Seq_230,0.172,0.759,0.483
Seq_231,0.067,0.667,0.533
Seq_232,0.1,0.7,0.45
Seq_233,0.044,0.8,0.444
Seq_234,0.083,0.708,0.5
Seq_235,0.083,0.8,0.483
Seq_236,0.146,0.707,0.488
Seq_237,0.037,0.815,0.519
Seq_238,0.034,0.931,0.621
Seq_239,0.071,0.643,0.476
Seq_240,0.029,0.824,0.618
Seq_241,0.053,0.842,0.632
Seq_242,0.093,0.884,0.419
Seq_243,0.125,0.75,0.4
Seq_244,0.1,0.8,0.3
Seq_245,0.278,0.611,0.444
Seq_246,0.0,0.944,0.722
Seq_247,0.037,0.815,0.519
Seq_248,0.071,0.893,0.679
Seq_249,0.023,0.674,0.419
Seq_250,0.095,0.714,0.476
Seq_251,0.182,0.773,0.545
Seq_252,0.095,0.738,0.619
Seq_253,0.034,0.931,0.621
Seq_254,0.154,0.846,0.385
Seq_255,0.077,0.923,0.692
Seq_256,0.081,0.568,0.378
Seq_257,0.088,0.765,0.471
Seq_258,0.167,0.806,0.528
Seq_259,0.056,0.833,0.611
Seq_260,0.0,0.774,0.452
Seq_261,0.03,0.818,0.636
Seq_262,0.111,0.556,0.4
Seq_263,0.049,0.78,0.561
Seq_264,0.174,0.87,0.609
Seq_265,0.065,0.717,0.435
Seq_266,0.0,0.638,0.383
Seq_267,0.208,0.917,0.5
Seq_268,0.032,0.71,0.548
Seq_269,0.111,0.833,0.5
Seq_270,0.077,0.846,0.846
Seq_271,0.028,0.639,0.5
Seq_272,0.0,0.667,0.5
Seq_273,0.5,0.5,0.5
Seq_274,0.171,0.927,0.537
Seq_275,0.083,0.667,0.5
Seq_276,0.062,0.781,0.594
Seq_277,0.118,0.735,0.441
Seq_278,0.053,0.895,0.632
Seq_279,0.0,0.929,0.643
Seq_280,0.067,0.711,0.422
Seq_281,0.06,0.64,0.42
Seq_282,0.043,0.783,0.522
Seq_283,0.043,0.783,0.435
Seq_284,0.071,0.643,0.5
Seq_285,0.143,0.81,0.429
Seq_286,0.143,0.762,0.476
Seq_287,0.083,0.833,0.667
Seq_288,0.0,0.864,0.682
Seq_289,0.125,0.75,0.475
Seq_290,0.0,0.917,0.417
Seq_291,0.034,0.931,0.655
Seq_292,0.111,0.833,0.667
Seq_293,0.062,0.75,0.438
Seq_294,0.118,0.765,0.529
Seq_295,0.125,0.333,0.083
Seq_296,0.0,0.7,0.5
Seq_297,0.085,0.829,0.561
Seq_298,0.062,0.75,0.531
Seq_299,0.122,0.796,0.469
Seq_300,0.056,0.444,0.222
Seq_301,0.167,0.833,0.6
Seq_302,0.067,0.667,0.533
Seq_303,0.077,0.923,0.615
Seq_304,0.214,0.857,0.5
Seq_305,0.154,0.538,0.462
Seq_306,0.118,0.706,0.412
Seq_307,0.048,0.69,0.548
Seq_308,0.027,0.784,0.541
Seq_309,0.2,0.7,0.5
Seq_310,0.125,0.719,0.438
Seq_311,0.167,0.567,0.467
Seq_312,0.026,0.789,0.342
Seq_313,0.0,0.632,0.526
Seq_314,0.05,0.9,0.6
Seq_315,0.059,0.706,0.392
Seq_316,0.143,0.893,0.571
Seq_317,0.091,0.773,0.455
Seq_318,0.041,0.689,0.473
Seq_319,0.067,0.667,0.533
Seq_320,0.083,0.611,0.417
Seq_321,0.091,0.795,0.5
Seq_322,0.071,0.714,0.571
Seq_323,0.062,0.812,0.562
Seq_324,0.033,0.833,0.6
Seq_325,0.069,0.862,0.621
Seq_326,0.2,0.68,0.36
Seq_327,0.067,0.6,0.533
Seq_328,0.158,0.842,0.632
Seq_329,0.022,0.739,0.478
Seq_330,0.054,0.757,0.541
Seq_331,0.097,0.871,0.581
Seq_332,0.125,0.828,0.594
Seq_333,0.114,0.818,0.477
Seq_334,0.108,0.568,0.405
Seq_335,0.0,0.2,0.1
Seq_336,0.15,0.8,0.5
Seq_337,0.0,1.0,0.55
Seq_338,0.12,0.68,0.52
Seq_339,0.211,0.737,0.579
Seq_340,0.0,0.565,0.522
Seq_341,0.087,0.783,0.565
Seq_342,0.148,0.704,0.444
Seq_343,0.111,0.889,0.778
Seq_344,0.059,0.941,0.765
Seq_345,0.067,0.883,0.667
Seq_346,0.267,1.0,0.933
Seq_347,0.095,0.833,0.548
Seq_348,0.125,0.75,0.562
Seq_349,0.1,0.55,0.35
Seq_350,0.065,0.71,0.387
Seq_351,0.073,0.756,0.439
Seq_352,0.12,0.84,0.64
Seq_353,0.231,0.923,0.615
Seq_354,0.217,0.783,0.522
Seq_355,0.106,0.766,0.511
Seq_356,0.106,0.766,0.426
Seq_357,0.235,0.529,0.471
Seq_358,0.061,0.879,0.455
Seq_359,0.156,0.781,0.562
Seq_360,0.029,0.765,0.529
Seq_361,0.045,0.682,0.545
Seq_362,0.085,0.72,0.524
Seq_363,0.045,0.788,0.515
Seq_364,0.128,0.83,0.532
Seq_365,0.077,0.923,0.769
Seq_366,0.143,0.857,0.714
Seq_367,0.0,0.939,0.636
Seq_368,0.054,0.757,0.514
Seq_369,0.103,0.897,0.655
Seq_370,0.087,0.826,0.609
Seq_371,0.147,0.765,0.5
Seq_372,0.094,0.812,0.469
Seq_373,0.042,0.75,0.625
Seq_374,0.067,0.867,0.533
Seq_375,0.0,0.8,0.64
Seq_376,0.118,0.706,0.412
Seq_377,0.0,0.789,0.526
Seq_378,0.12,0.68,0.44
Seq_379,0.154,0.923,0.615
Seq_380,0.5,0.5,0.5
Seq_381,0.03,0.909,0.606
Seq_382,0.065,0.839,0.581
Seq_383,0.085,0.718,0.507
Seq_384,0.095,0.762,0.476
Seq_385,0.231,0.846,0.615
Seq_386,0.115,0.769,0.462
Seq_387,0.213,0.766,0.426
Seq_388,0.04,0.76,0.48
Seq_389,0.065,0.871,0.581
Seq_390,0.065,0.848,0.457
Seq_391,0.0,0.952,0.762
Seq_392,0.051,0.667,0.333
Seq_393,0.146,0.829,0.561
Seq_394,0.125,0.773,0.443
Seq_395,0.049,0.78,0.488
Seq_396,0.036,0.75,0.607
Seq_397,0.0,0.7,0.6
Seq_398,0.172,0.828,0.586
Seq_399,0.062,0.812,0.562
Seq_400,0.043,0.942,0.696
Seq_401,0.1,0.767,0.4
Seq_402,0.189,0.73,0.432
Seq_403,0.182,0.636,0.455
Seq_404,0.034,0.931,0.621
Seq_405,0.104,0.875,0.396
Seq_406,0.125,0.458,0.458
Seq_407,0.125,0.875,0.562
Seq_408,0.143,0.929,0.714
Seq_409,0.125,0.896,0.5
Seq_410,0.038,0.577,0.385
Seq_411,0.075,0.85,0.575
Seq_412,0.105,0.579,0.421
Seq_413,0.111,0.778,0.444
Seq_414,0.053,0.868,0.605
Seq_415,0.084,0.711,0.506
Seq_416,0.105,0.737,0.632
Seq_417,0.067,0.867,0.567
Seq_418,0.148,0.593,0.481
Seq_419,0.1,0.7,0.45
Seq_420,0.122,0.676,0.432
Seq_421,0.154,0.923,0.692
Seq_422,0.107,0.786,0.5
Seq_423,0.057,0.686,0.514
Seq_424,0.089,0.622,0.378
Seq_425,0.034,0.828,0.586
Seq_426,0.071,0.857,0.429
Seq_427,0.0,0.786,0.643
Seq_428,0.143,0.952,0.762
Seq_429,0.033,0.859,0.478
Seq_430,0.083,0.917,0.75
Seq_431,0.125,0.917,0.75
Seq_432,0.2,0.65,0.4
Seq_433,0.19,0.952,0.619
Seq_434,0.0,0.778,0.556
Seq_435,0.25,0.607,0.393
Seq_436,0.077,0.923,0.692
Seq_437,0.098,0.805,0.439
Seq_438,0.138,0.621,0.345
Seq_439,0.088,0.824,0.529
Seq_440,0.062,0.812,0.562
Seq_441,0.0,0.9,0.55
Seq_442,0.085,0.638,0.383
Seq_443,0.214,0.786,0.786
Seq_444,0.096,0.692,0.519
Seq_445,0.154,0.923,0.692
Seq_446,0.132,0.711,0.368
Seq_447,0.2,0.8,0.533
Seq_448,0.067,0.64,0.427
Seq_449,0.1,0.8,0.4
Seq_450,0.136,0.682,0.5
Seq_451,0.0,0.69,0.552
Seq_452,0.0,0.818,0.636
Seq_453,0.19,0.905,0.476
Seq_454,0.077,0.923,0.692
Seq_455,0.071,0.857,0.643
Seq_456,0.1,0.767,0.567
Seq_457,0.0,0.667,0.556
Seq_458,0.154,0.769,0.538
Seq_459,0.097,0.903,0.516
Seq_460,0.043,0.783,0.587
Seq_461,0.026,0.763,0.579
Seq_462,0.1,0.867,0.567
Seq_463,0.159,0.773,0.432
Seq_464,0.067,0.9,0.667
Seq_465,0.143,0.857,0.571
Seq_466,0.08,0.8,0.56
Seq_467,0.1,0.75,0.45
Seq_468,0.115,0.846,0.577
Seq_469,0.083,0.667,0.333
Seq_470,0.143,1.0,0.714
Seq_471,0.083,0.833,0.708
Seq_472,0.0,0.714,0.286
Seq_473,0.154,0.769,0.615
Seq_474,0.111,0.852,0.667
Seq_475,0.0,0.533,0.267
Seq_476,0.103,0.759,0.5
Seq_477,0.111,0.778,0.667
Seq_478,0.261,0.739,0.348
Seq_479,0.106,0.851,0.511
Seq_480,0.05,0.85,0.8
Seq_481,0.0,0.8,0.64
Seq_482,0.047,0.523,0.384
Seq_483,0.133,0.831,0.361
Seq_484,0.156,0.812,0.531
Seq_485,0.154,0.923,0.692
Seq_486,0.067,0.533,0.367
Seq_487,0.059,0.765,0.529
Seq_488,0.136,0.614,0.386
Seq_489,0.032,0.71,0.419
Seq_490,0.0,0.714,0.429
Seq_491,0.111,0.667,0.611
Seq_492,0.143,0.619,0.429
Seq_493,0.154,0.769,0.462
Seq_494,0.043,0.957,0.609
Seq_495,0.136,0.682,0.545
Seq_496,0.0,0.792,0.583
Seq_497,0.135,0.698,0.417
Seq_498,0.0,1.0,0.579
Seq_499,0.033,0.9,0.6
Seq_500,0.048,0.723,0.482
Seq_501,0.042,0.792,0.625
Seq_502,0.14,0.86,0.465
Seq_503,0.176,0.706,0.529
Seq_504,0.054,0.73,0.514
Seq_505,0.0,0.722,0.722
Seq_506,0.167,0.778,0.5
Seq_507,0.0,0.917,0.667
Seq_508,0.04,0.64,0.42
Seq_509,0.067,0.778,0.533
Seq_510,0.077,0.846,0.615
Seq_511,0.214,0.786,0.429
Seq_512,0.111,0.694,0.417
Seq_513,0.137,0.667,0.373
Seq_514,0.033,0.767,0.567
Seq_515,0.034,0.931,0.655
Seq_516,0.039,0.667,0.412
Seq_517,0.062,0.938,0.625
Seq_518,0.062,0.812,0.562
Seq_519,0.018,0.807,0.596
Seq_520,0.048,0.857,0.571
Seq_521,0.2,0.85,0.7
Seq_522,0.152,0.848,0.485
Seq_523,0.0,0.667,0.5
Seq_524,0.111,0.741,0.389
Seq_525,0.048,0.857,0.548
Seq_526,0.235,0.882,0.647
Seq_527,0.067,0.867,0.8
Seq_528,0.1,0.775,0.55
Seq_529,0.122,0.829,0.439
Seq_530,0.056,0.833,0.611
Seq_531,0.098,0.756,0.512
Seq_532,0.121,0.758,0.333
Seq_533,0.111,0.815,0.519
Seq_534,0.088,0.647,0.471
Seq_535,0.097,0.839,0.548
Seq_536,0.065,0.903,0.452
Seq_537,0.105,0.737,0.526
Seq_538,0.077,0.692,0.538
Seq_539,0.154,0.769,0.615
Seq_540,0.065,0.903,0.548
Seq_541,0.125,0.719,0.5
Seq_542,0.0,0.632,0.474
Seq_543,0.08,0.75,0.58
Seq_544,0.1,0.74,0.42
Seq_545,0.089,0.667,0.444
Seq_546,0.118,0.706,0.471
Seq_547,0.154,0.885,0.615
Seq_548,0.13,0.648,0.333
Seq_549,0.2,0.8,0.56
Seq_550,0.115,0.808,0.577
Seq_551,0.0,0.75,0.5
Seq_552,0.069,0.759,0.448
Seq_553,0.083,0.792,0.708
Seq_554,0.05,0.8,0.45
Seq_555,0.056,0.722,0.611
Seq_556,0.067,0.9,0.667
Seq_557,0.125,0.688,0.438
Seq_558,0.182,0.939,0.515
Seq_559,0.069,0.931,0.655
Seq_560,0.036,0.786,0.571
Seq_561,0.145,0.79,0.484
Seq_562,0.1,0.7,0.5
Seq_563,0.067,0.9,0.533
Seq_564,0.054,0.811,0.568
Seq_565,0.158,0.842,0.526
Seq_566,0.068,0.705,0.455
Seq_567,0.0,0.423,0.385
Seq_568,0.03,0.667,0.606
Seq_569,0.154,0.923,0.692
Seq_570,0.182,0.818,0.545
Seq_571,0.059,0.426,0.147
Seq_572,0.136,0.795,0.568
Seq_573,0.12,0.76,0.36
Seq_574,0.185,0.852,0.556
Seq_575,0.121,0.697,0.394
Seq_576,0.062,0.719,0.5
Seq_577,0.071,0.679,0.429
Seq_578,0.061,0.735,0.469
Seq_579,0.032,0.806,0.484
Seq_580,0.057,0.629,0.457
Seq_581,0.114,0.773,0.409
Seq_582,0.125,0.688,0.5
Seq_583,0.1,0.8,0.6
Seq_584,0.0,0.381,0.19
Seq_585,0.051,0.795,0.615
Seq_586,0.184,0.816,0.474
Seq_587,0.087,0.696,0.435
Seq_588,0.094,0.656,0.281
Seq_589,0.051,0.692,0.487
Seq_590,0.091,0.727,0.591
Seq_591,0.167,0.667,0.417
Seq_592,0.048,0.81,0.714
Seq_593,0.171,0.732,0.366
Seq_594,0.143,0.857,0.786
Seq_595,0.087,0.739,0.478
Seq_596,0.065,0.806,0.516
Seq_597,0.06,0.821,0.083
Seq_598,0.231,0.692,0.385
Seq_599,0.032,0.71,0.548
Seq_600,0.071,0.871,0.614
Seq_601,0.048,0.952,0.952
Seq_602,0.1,0.75,0.6
Seq_603,0.062,0.716,0.556
Seq_604,0.098,0.745,0.549
Seq_605,0.028,0.667,0.444
Seq_606,0.104,0.584,0.364
Seq_607,0.0,0.714,0.536
Seq_608,0.278,0.611,0.444
Seq_609,0.073,0.878,0.488
Seq_610,0.12,0.68,0.36
Seq_611,0.042,0.708,0.542
Seq_612,0.111,0.694,0.472
Seq_613,0.03,0.727,0.545
Seq_614,0.05,0.95,0.8
Seq_615,0.112,0.697,0.494
Seq_616,0.111,0.556,0.333
Seq_617,0.132,0.737,0.395
Seq_618,0.032,0.766,0.553
Seq_619,0.079,0.789,0.421
Seq_620,0.068,0.795,0.477
Seq_621,0.125,0.688,0.375
Seq_622,0.0,0.8,0.533
Seq_623,0.0,0.867,0.667
Seq_624,0.167,0.8,0.633
Seq_625,0.065,0.742,0.516
Seq_626,0.05,0.85,0.75
Seq_627,0.088,0.824,0.529
Seq_628,0.286,0.857,0.786
Seq_629,0.1,0.55,0.4
Seq_630,0.138,0.862,0.483
Seq_631,0.067,0.867,0.6
Seq_632,0.077,0.788,0.519
Seq_633,0.067,0.867,0.567
Seq_634,0.067,0.867,0.567
Seq_635,0.036,0.714,0.571
Seq_636,0.042,0.708,0.5
Seq_637,0.026,0.789,0.421
Seq_638,0.061,0.788,0.545
Seq_639,0.385,0.692,0.692
Seq_640,0.069,0.707,0.448
Seq_641,0.029,0.883,0.35
Seq_642,0.16,0.68,0.56
Seq_643,0.222,0.63,0.481
Seq_644,0.143,0.881,0.619
Seq_645,0.158,0.632,0.526
Seq_646,0.083,0.75,0.458
Seq_647,0.111,0.806,0.444
Seq_648,0.037,0.815,0.481
Seq_649,0.13,0.652,0.609
Seq_650,0.088,0.735,0.559
Seq_651,0.0,0.667,0.583
Seq_652,0.0,0.923,0.692
Seq_653,0.054,0.622,0.459
Seq_654,0.1,0.7,0.5
Seq_655,0.0,0.722,0.556
Seq_656,0.081,0.73,0.432
Seq_657,0.045,0.773,0.333
Seq_658,0.024,0.738,0.571
Seq_659,0.048,0.857,0.762
Seq_660,0.132,0.737,0.474
Seq_661,0.103,0.828,0.483
Seq_662,0.161,0.613,0.548
Seq_663,0.059,0.765,0.529
Seq_664,0.125,0.833,0.75
Seq_665,0.048,0.476,0.286
Seq_666,0.083,0.611,0.417
Seq_667,0.135,0.757,0.595
Seq_668,0.086,0.943,0.629
Seq_669,0.042,0.792,0.458
Seq_670,0.067,0.867,0.567
Seq_671,0.056,0.722,0.611
Seq_672,0.176,0.794,0.735
Seq_673,0.077,0.538,0.346
Seq_674,0.081,0.757,0.459
Seq_675,0.075,0.8,0.525
Seq_676,0.067,0.967,0.6
Seq_677,0.038,0.756,0.474
Seq_678,0.059,0.735,0.5
Seq_679,0.048,0.905,0.667
Seq_680,0.081,0.838,0.595
Seq_681,0.091,0.773,0.5
Seq_682,0.065,0.903,0.548
Seq_683,0.081,0.595,0.324
Seq_684,0.095,0.714,0.452
Seq_685,0.111,0.611,0.389
Seq_686,0.222,0.833,0.667
Seq_687,0.059,0.706,0.529
Seq_688,0.075,0.775,0.55
Seq_689,0.222,0.556,0.556
Seq_690,0.067,0.844,0.311
Seq_691,0.033,0.967,0.6
Seq_692,0.081,0.784,0.486
Seq_693,0.0,0.765,0.706
Seq_694,0.125,0.833,0.625
Seq_695,0.047,0.744,0.512
Seq_696,0.125,0.766,0.438
Seq_697,0.105,0.816,0.579
Seq_698,0.2,0.9,0.6
Seq_699,0.062,0.75,0.5
Seq_700,0.111,0.722,0.444
Seq_701,0.0,0.667,0.556
Seq_702,0.083,0.75,0.583
Seq_703,0.054,0.757,0.405
Seq_704,0.102,0.653,0.429
Seq_705,0.043,0.826,0.478
Seq_706,0.152,0.727,0.455
Seq_707,0.111,0.333,0.222
Seq_708,0.161,0.774,0.613
Seq_709,0.0,0.882,0.588
Seq_710,0.08,0.76,0.64
Seq_711,0.154,0.846,0.846
Seq_712,0.065,0.839,0.548
Seq_713,0.056,0.778,0.611
Seq_714,0.065,0.909,0.429
Seq_715,0.091,0.864,0.682
Seq_716,0.105,0.947,0.474
Seq_717,0.067,0.9,0.667
Seq_718,0.143,0.714,0.571
Seq_719,0.053,0.789,0.526
Seq_720,0.069,0.897,0.655
Seq_721,0.038,0.808,0.577
Seq_722,0.0,0.977,0.163
Seq_723,0.115,0.812,0.5
Seq_724,0.062,0.875,0.625
Seq_725,0.136,0.682,0.545
Seq_726,0.121,0.788,0.515
Seq_727,0.109,0.848,0.543
Seq_728,0.083,0.792,0.667
Seq_729,0.042,0.75,0.458
Seq_730,0.133,0.733,0.433
Seq_731,0.157,0.814,0.457
Seq_732,0.037,0.852,0.741
Seq_733,0.0,0.674,0.372
Seq_734,0.05,0.7,0.5
Seq_735,0.103,0.759,0.621
Seq_736,0.065,0.774,0.484
Seq_737,0.1,0.8,0.6
Seq_738,0.114,0.743,0.514
Seq_739,0.219,0.688,0.406
Seq_740,0.143,0.857,0.786
Seq_741,0.083,0.833,0.583
Seq_742,0.041,0.714,0.592
Seq_743,0.3,0.6,0.5
Seq_744,0.0,0.623,0.449
Seq_745,0.048,0.667,0.429
Seq_746,0.061,0.788,0.545
Seq_747,0.056,0.889,0.722
Seq_748,0.077,1.0,0.692
Seq_749,0.065,0.871,0.581
Seq_750,0.077,0.718,0.359
Seq_751,0.037,0.778,0.481
Seq_752,0.091,0.618,0.382
Seq_753,0.136,0.75,0.409
Seq_754,0.05,0.95,0.7
Seq_755,0.077,0.808,0.615
Seq_756,0.154,0.731,0.462
Seq_757,0.0,0.667,0.667
Seq_758,0.026,0.816,0.474
Seq_759,0.027,0.622,0.432
Seq_760,0.065,0.903,0.548
Seq_761,0.083,0.875,0.625
Seq_762,0.038,0.923,0.462
Seq_763,0.056,0.667,0.5
Seq_764,0.077,0.692,0.423
Seq_765,0.098,0.707,0.39
Seq_766,0.085,0.638,0.426
Seq_767,0.065,0.871,0.613
Seq_768,0.107,0.661,0.482
Seq_769,0.065,0.783,0.457
Seq_770,0.042,0.875,0.75
Seq_771,0.118,0.941,0.647
Seq_772,0.0,0.667,0.556
Seq_773,0.062,0.812,0.562
Seq_774,0.0,0.692,0.154
Seq_775,0.091,0.879,0.545
Seq_776,0.0,0.818,0.485
Seq_777,0.08,0.6,0.4
Seq_778,0.048,0.714,0.429
Seq_779,0.059,0.765,0.647
Seq_780,0.062,0.875,0.562
Seq_781,0.053,0.789,0.526
Seq_782,0.189,0.811,0.324
Seq_783,0.0,0.75,0.562
Seq_784,0.056,0.778,0.5
Seq_785,0.04,0.733,0.413
Seq_786,0.0,0.85,0.6
Seq_787,0.0,0.833,0.639
Seq_788,0.095,0.714,0.429
Seq_789,0.042,0.875,0.792
Seq_790,0.0,1.0,0.692
Seq_791,0.147,0.765,0.412
Seq_792,0.0,0.776,0.104
Seq_793,0.095,0.81,0.619
Seq_794,0.1,0.85,0.75
Seq_795,0.154,0.846,0.692
Seq_796,0.107,0.857,0.571
Seq_797,0.238,0.714,0.524
Seq_798,0.167,0.917,0.667
Seq_799,0.053,0.579,0.342
Seq_800,0.0,0.6,0.56
Seq_801,0.0,0.704,0.519
Seq_802,0.19,0.952,0.619
Seq_803,0.1,0.9,0.75
Seq_804,0.1,0.7,0.5
Seq_805,0.0,0.875,0.625
Seq_806,0.143,0.857,0.714
Seq_807,0.052,0.621,0.345
Seq_808,0.119,0.857,0.524
Seq_809,0.0,1.0,0.7
Seq_810,0.12,0.84,0.46
Seq_811,0.074,0.593,0.333
Seq_812,0.176,0.765,0.529
Seq_813,0.065,0.674,0.435
Seq_814,0.064,0.745,0.511
Seq_815,0.2,0.9,0.6
Seq_816,0.109,0.8,0.436
Seq_817,0.25,0.625,0.375
Seq_818,0.026,0.795,0.538
Seq_819,0.154,0.692,0.538
Seq_820,0.235,0.882,0.706
Seq_821,0.043,0.783,0.609
Seq_822,0.093,0.733,0.467
Seq_823,0.071,0.786,0.786
Seq_824,0.136,0.727,0.5
Seq_825,0.083,0.683,0.367
Seq_826,0.091,0.818,0.455
Seq_827,0.039,0.766,0.571
Seq_828,0.182,0.818,0.5
Seq_829,0.03,0.636,0.576
Seq_830,0.057,0.83,0.472
Seq_831,0.111,0.722,0.5
Seq_832,0.071,0.75,0.5
Seq_833,0.078,0.647,0.412
Seq_834,0.125,0.719,0.469
Seq_835,0.054,0.838,0.568
Seq_836,0.182,0.818,0.545
Seq_837,0.222,0.667,0.556
Seq_838,0.065,0.674,0.5
Seq_839,0.098,0.647,0.412
Seq_840,0.286,0.714,0.571
Seq_841,0.158,0.842,0.526
Seq_842,0.056,0.722,0.5
Seq_843,0.5,0.625,0.5
Seq_844,0.13,0.87,0.652
Seq_845,0.068,0.682,0.409
Seq_846,0.0,0.706,0.529
Seq_847,0.214,0.929,0.786
Seq_848,0.129,0.677,0.387
Seq_849,0.044,0.678,0.489
Seq_850,0.125,0.688,0.562
Seq_851,0.0,1.0,0.533
Seq_852,0.15,0.725,0.35
Seq_853,0.143,0.619,0.405
Seq_854,0.188,0.75,0.625
Seq_855,0.031,0.812,0.5
Seq_856,0.114,0.943,0.714
Seq_857,0.0,0.889,0.611
Seq_858,0.154,0.615,0.385
Seq_859,0.083,0.833,0.833
Seq_860,0.0,0.85,0.65
Seq_861,0.078,0.623,0.26
Seq_862,0.103,0.931,0.655
Seq_863,0.095,0.81,0.571
Seq_864,0.081,0.743,0.338
Seq_865,0.044,0.956,0.6
Seq_866,0.025,0.65,0.425
Seq_867,0.125,0.812,0.604
Seq_868,0.068,0.727,0.523
Seq_869,0.062,0.938,0.656
Seq_870,0.25,0.786,0.464
Seq_871,0.081,0.919,0.514
Seq_872,0.0,0.818,0.636
Seq_873,0.022,0.696,0.435
Seq_874,0.167,0.778,0.556
Seq_875,0.023,0.791,0.535
Seq_876,0.062,0.812,0.375
Seq_877,0.125,0.875,0.75
Seq_878,0.143,0.762,0.524
Seq_879,0.13	,0.522	,0.348	
