ID,RRI_A,RRI_C,RRI_D,RRI_E,RRI_F,RRI_G,RRI_H,RRI_I,RRI_K,RRI_L,RRI_M,RRI_N,RRI_P,RRI_Q,RRI_R,RRI_S,RRI_T,RRI_V,RRI_W,RRI_Y
Seq_1,1.22,0.00,0.00,1.00,1.00,1.20,0.00,1.22,1.33,1.00,0.00,1.00,0.00,1.00,0.00,1.00,1.00,1.22,0.00,1.00, 
Seq_2,1.40,1.00,1.00,0.00,1.00,1.00,0.00,1.00,1.00,1.00,0.00,0.00,0.00,1.00,0.00,1.00,1.00,1.00,0.00,0.00, 
Seq_3,1.00,0.00,1.00,0.00,1.00,1.00,1.00,1.00,1.67,1.00,0.00,0.00,0.00,0.00,0.00,1.67,0.00,1.00,0.00,0.00, 
Seq_4,1.67,0.00,0.00,1.00,1.00,1.00,1.00,0.00,1.00,1.00,0.00,1.00,1.00,1.00,0.00,1.00,1.00,2.00,1.00,1.00, 
Seq_5,0.00,1.29,0.00,1.00,0.00,1.00,1.00,1.00,1.25,1.00,0.00,1.00,1.00,0.00,1.00,0.00,1.00,1.00,0.00,1.00, 
Seq_6,1.00,0.00,1.00,1.00,0.00,1.00,0.00,1.00,1.25,1.00,1.00,1.00,1.00,0.00,0.00,1.00,1.00,1.00,0.00,0.00, 
Seq_7,1.00,1.57,1.00,1.00,1.00,1.29,1.00,0.00,0.00,0.00,0.00,0.00,1.00,1.00,1.00,1.00,1.00,1.00,0.00,1.00, 
Seq_8,1.00,1.00,0.00,0.00,0.00,1.00,1.67,0.00,1.00,1.33,0.00,1.00,0.00,0.00,0.00,0.00,0.00,1.00,1.00,0.00, 
Seq_9,1.00,0.00,0.00,0.00,1.00,1.00,1.00,0.00,1.40,1.00,0.00,1.00,1.00,1.00,1.00,1.67,1.67,1.00,1.00,1.50, 
Seq_10,1.50,1.00,0.00,0.00,1.00,1.00,0.00,1.50,1.00,1.33,0.00,1.00,1.00,0.00,0.00,1.00,1.00,0.00,0.00,1.00, 
Seq_11,1.00,1.00,0.00,1.00,1.00,1.00,0.00,1.00,1.89,1.00,1.00,1.00,1.00,1.00,0.00,1.00,1.00,0.00,1.00,1.00, 
Seq_12,1.00,1.22,1.00,1.00,1.00,1.33,1.00,1.50,1.00,1.00,1.00,1.00,1.67,0.00,0.00,0.00,1.50,1.00,0.00,0.00, 
Seq_13,1.00,0.00,0.00,1.00,1.00,1.00,1.00,1.00,1.00,1.40,0.00,0.00,1.00,0.00,0.00,1.00,0.00,1.00,0.00,0.00, 
Seq_14,1.00,1.33,0.00,1.00,0.00,1.00,0.00,0.00,0.00,1.00,0.00,1.40,0.00,1.25,1.50,1.00,1.00,0.00,0.00,1.00, 
Seq_15,1.00,1.00,0.00,0.00,1.00,1.00,0.00,1.00,1.00,1.00,0.00,0.00,1.00,0.00,0.00,1.00,1.50,1.00,0.00,0.00, 
Seq_16,1.00,0.00,0.00,0.00,1.00,1.00,0.00,1.00,1.00,1.67,0.00,0.00,0.00,0.00,1.00,1.00,0.00,0.00,0.00,0.00, 
Seq_17,1.00,1.00,0.00,1.00,0.00,0.00,0.00,0.00,0.00,0.00,1.00,0.00,0.00,0.00,0.00,1.00,1.00,0.00,0.00,1.00, 
Seq_18,1.29,1.00,1.29,1.00,1.00,1.00,1.44,1.00,1.00,1.00,1.00,1.25,1.00,1.33,1.00,1.00,1.00,1.00,0.00,1.00, 
Seq_19,1.00,1.29,1.00,1.00,0.00,1.89,1.00,1.00,0.00,0.00,1.00,1.00,1.00,1.00,1.00,1.00,0.00,1.00,0.00,1.00, 
Seq_20,1.00,0.00,1.00,0.00,1.00,1.00,0.00,1.00,1.40,1.00,0.00,0.00,1.00,0.00,0.00,1.40,0.00,0.00,1.00,0.00, 
Seq_21,1.00,1.00,0.00,0.00,0.00,1.00,1.00,1.00,1.00,0.00,0.00,1.00,1.00,1.00,1.00,1.00,1.00,1.00,1.00,0.00, 
Seq_22,0.00,1.00,1.67,2.14,0.00,0.00,0.00,0.00,0.00,0.00,0.00,0.00,0.00,1.00,1.00,0.00,0.00,0.00,0.00,0.00, 
Seq_23,1.00,0.00,0.00,0.00,1.00,1.00,0.00,1.50,1.00,1.00,0.00,0.00,0.00,0.00,0.00,1.00,0.00,0.00,0.00,0.00, 
Seq_24,1.32,1.00,1.00,1.00,1.00,1.13,0.00,1.00,1.00,1.00,1.00,1.22,1.33,1.00,1.00,1.29,1.00,1.00,1.00,1.00, 
Seq_25,1.00,1.00,1.00,1.00,1.00,1.00,1.00,0.00,1.00,1.00,0.00,1.00,0.00,1.00,1.00,1.00,1.00,0.00,1.00,1.00, 
Seq_26,1.40,0.00,0.00,0.00,1.00,1.00,0.00,1.00,1.00,1.00,0.00,1.00,1.00,0.00,1.40,0.00,1.00,1.00,1.00,1.00, 
Seq_27,1.00,0.00,1.00,1.00,1.00,2.00,0.00,1.50,1.67,1.00,0.00,0.00,0.00,0.00,0.00,1.00,0.00,0.00,0.00,0.00, 
Seq_28,0.00,1.29,1.00,1.00,1.00,1.00,0.00,1.00,1.00,1.00,0.00,1.00,1.00,1.00,1.00,1.00,1.00,1.00,0.00,1.00, 
Seq_29,1.00,1.29,0.00,1.00,1.00,1.00,0.00,1.00,0.00,0.00,0.00,1.00,1.00,0.00,1.77,1.00,0.00,1.00,0.00,1.00, 
Seq_30,1.50,0.00,1.00,0.00,0.00,1.33,0.00,1.00,1.00,1.29,0.00,0.00,1.00,1.00,0.00,1.00,0.00,1.00,0.00,0.00, 
Seq_31,1.00,1.00,1.00,1.00,0.00,1.00,1.00,1.00,1.00,1.29,0.00,1.00,1.00,1.00,1.00,1.33,0.00,1.00,0.00,1.00, 
Seq_32,1.00,0.00,1.00,1.00,1.00,1.00,0.00,1.33,1.25,1.00,0.00,1.00,1.00,1.00,1.00,0.00,1.00,1.40,1.00,0.00, 
Seq_33,1.00,0.00,1.00,1.00,1.00,0.00,0.00,1.00,1.29,1.00,0.00,1.00,0.00,1.00,1.00,1.00,0.00,1.00,0.00,0.00, 
Seq_34,1.33,1.00,1.00,0.00,0.00,1.25,0.00,1.50,1.00,1.00,0.00,1.33,0.00,0.00,0.00,1.00,1.67,1.00,1.00,1.67, 
Seq_35,0.00,0.00,0.00,0.00,1.00,0.00,0.00,1.00,1.67,1.00,0.00,0.00,1.67,0.00,0.00,0.00,1.67,1.00,0.00,0.00, 
Seq_36,1.00,1.22,1.67,1.00,0.00,1.83,0.00,0.00,1.00,1.00,0.00,1.40,1.00,1.00,1.00,1.29,0.00,0.00,1.00,1.00, 
Seq_37,1.25,0.00,1.18,1.22,1.00,1.00,1.62,1.00,1.00,1.29,0.00,0.00,1.00,1.00,1.00,1.00,1.00,1.00,0.00,1.00, 
Seq_38,1.00,0.00,0.00,0.00,1.00,1.40,1.00,1.00,0.00,1.67,0.00,0.00,1.00,0.00,0.00,1.00,0.00,1.57,0.00,0.00, 
Seq_39,0.00,0.00,1.00,0.00,1.00,1.00,1.00,0.00,1.00,1.00,1.00,0.00,0.00,0.00,0.00,1.00,1.00,1.00,0.00,0.00, 
Seq_40,1.00,0.00,1.67,0.00,1.00,1.00,0.00,0.00,1.00,1.00,0.00,0.00,0.00,0.00,0.00,0.00,0.00,1.00,1.00,0.00, 
Seq_41,0.00,1.00,0.00,0.00,1.00,1.00,0.00,0.00,0.00,0.00,0.00,0.00,0.00,0.00,1.33,0.00,1.00,1.00,0.00,0.00, 
Seq_42,1.00,1.00,1.00,1.00,0.00,1.00,1.00,1.00,1.00,1.00,0.00,1.00,1.00,0.00,0.00,1.00,1.00,1.00,1.00,1.00, 
Seq_43,1.00,0.00,0.00,1.00,1.00,1.25,0.00,1.00,1.00,1.40,1.67,0.00,1.00,1.00,1.00,1.00,1.00,1.00,0.00,0.00, 
Seq_44,0.00,1.00,1.00,0.00,1.00,1.00,0.00,0.00,1.00,0.00,0.00,1.00,1.00,1.00,1.00,1.00,1.00,1.00,0.00,0.00, 
Seq_45,1.00,0.00,0.00,0.00,0.00,1.00,1.00,1.00,0.00,1.50,0.00,0.00,1.00,1.00,0.00,1.00,1.00,1.50,0.00,0.00, 
Seq_46,1.00,0.00,1.00,0.00,1.00,1.33,1.00,1.40,2.29,1.00,0.00,1.00,1.00,1.00,1.00,1.00,1.00,1.00,0.00,0.00, 
Seq_47,1.29,1.17,1.00,1.00,0.00,1.29,1.00,1.00,1.40,1.00,0.00,1.00,1.40,0.00,1.00,1.33,1.29,1.00,0.00,1.00, 
Seq_48,1.00,1.50,0.00,1.00,1.00,1.00,1.00,1.00,1.00,1.00,0.00,1.00,0.00,0.00,0.00,1.00,1.00,1.00,1.00,0.00, 
Seq_49,0.00,0.00,0.00,0.00,1.50,1.00,1.40,1.00,1.00,1.00,0.00,0.00,0.00,0.00,1.00,0.00,1.00,1.00,0.00,0.00, 
Seq_50,1.00,0.00,0.00,0.00,1.00,1.00,0.00,1.00,1.00,1.00,1.00,0.00,0.00,0.00,0.00,1.00,0.00,0.00,0.00,0.00, 
Seq_51,1.00,1.29,1.00,1.00,1.00,1.00,1.00,1.00,1.00,1.00,0.00,1.00,1.00,0.00,1.00,1.00,1.00,1.00,0.00,1.00, 
Seq_52,0.00,0.00,0.00,0.00,0.00,1.00,0.00,1.00,0.00,1.50,0.00,1.00,1.00,0.00,0.00,1.00,0.00,0.00,0.00,0.00, 
Seq_53,1.67,1.00,0.00,1.00,1.00,1.00,0.00,1.00,1.00,0.00,0.00,1.00,1.00,0.00,1.00,1.00,0.00,1.00,0.00,1.00, 
Seq_54,0.00,1.00,0.00,0.00,0.00,1.00,0.00,0.00,0.00,1.00,0.00,0.00,0.00,0.00,1.50,0.00,0.00,1.00,0.00,0.00, 
Seq_55,1.00,1.00,1.00,1.00,0.00,1.00,1.00,1.50,1.00,1.00,0.00,1.00,1.00,1.00,1.67,0.00,1.00,1.00,1.00,1.50, 
Seq_56,1.00,1.00,0.00,1.00,1.00,1.00,0.00,1.00,1.00,1.00,0.00,1.00,1.00,0.00,0.00,1.00,1.00,0.00,0.00,1.00, 
Seq_57,1.50,1.00,1.00,0.00,0.00,1.00,0.00,1.00,1.00,1.00,1.00,1.00,0.00,1.00,1.00,0.00,1.00,1.00,0.00,0.00, 
Seq_58,1.00,0.00,1.00,0.00,1.00,1.00,0.00,1.00,1.67,1.00,0.00,0.00,0.00,0.00,0.00,1.00,0.00,1.50,0.00,0.00, 
Seq_59,1.56,0.00,0.00,0.00,0.00,1.55,0.00,1.00,0.00,1.00,0.00,1.00,1.00,0.00,0.00,1.67,1.40,1.89,0.00,0.00, 
Seq_60,0.00,0.00,0.00,0.00,1.00,1.00,1.40,1.67,0.00,1.00,0.00,1.00,0.00,1.00,1.00,1.00,0.00,1.00,0.00,0.00, 
Seq_61,0.00,1.29,0.00,1.00,1.00,1.00,0.00,1.00,0.00,1.00,0.00,1.00,0.00,0.00,1.36,1.00,1.00,0.00,0.00,1.00, 
Seq_62,0.00,0.00,0.00,0.00,1.00,1.00,0.00,0.00,1.00,1.00,0.00,0.00,0.00,1.00,0.00,1.00,1.00,1.00,0.00,1.00, 
Seq_63,0.00,0.00,0.00,0.00,0.00,1.00,1.40,0.00,0.00,0.00,0.00,0.00,0.00,1.00,0.00,1.00,0.00,1.00,0.00,0.00, 
Seq_64,1.60,0.00,1.00,1.00,0.00,1.00,0.00,1.00,1.00,1.00,0.00,1.00,1.00,1.00,0.00,1.00,1.00,1.00,1.00,0.00, 
Seq_65,0.00,1.00,0.00,1.00,1.67,1.00,0.00,1.67,1.00,0.00,0.00,0.00,1.67,1.00,1.00,1.00,1.00,0.00,1.00,0.00, 
Seq_66,1.00,0.00,1.00,0.00,1.00,1.00,0.00,0.00,1.00,1.33,0.00,0.00,0.00,1.00,0.00,1.00,1.67,1.40,0.00,0.00, 
Seq_67,0.00,0.00,0.00,0.00,0.00,0.00,1.00,1.00,1.00,1.00,0.00,0.00,1.00,1.00,1.00,1.00,0.00,0.00,1.67,1.00, 
Seq_68,1.50,0.00,1.00,1.00,1.00,1.00,1.00,1.00,1.50,1.00,0.00,1.00,0.00,0.00,1.00,0.00,1.00,1.29,0.00,0.00, 
Seq_69,0.00,1.00,0.00,0.00,1.00,1.00,0.00,1.00,1.00,1.00,1.00,0.00,0.00,1.00,1.00,0.00,1.00,0.00,0.00,0.00, 
Seq_70,0.00,0.00,1.00,0.00,1.00,0.00,0.00,1.67,1.00,1.67,0.00,0.00,1.00,1.00,1.33,0.00,1.00,1.00,1.00,0.00, 
Seq_71,1.00,1.29,1.00,0.00,1.00,1.00,0.00,0.00,1.00,1.00,0.00,1.00,1.40,1.00,1.00,1.00,1.00,0.00,1.00,1.00, 
Seq_72,1.00,0.00,0.00,1.73,1.00,1.50,0.00,0.00,1.00,1.00,1.00,0.00,1.40,0.00,1.00,1.00,0.00,0.00,0.00,1.00, 
Seq_73,0.00,1.29,0.00,2.33,1.00,1.00,1.00,1.00,1.00,0.00,0.00,0.00,1.00,0.00,1.50,1.00,1.00,1.00,1.00,1.00, 
Seq_74,0.00,1.00,0.00,0.00,0.00,1.67,0.00,1.00,1.00,0.00,0.00,1.00,1.00,1.00,1.89,1.00,1.00,1.00,0.00,1.50, 
Seq_75,0.00,0.00,0.00,0.00,1.40,1.00,0.00,0.00,3.00,1.00,0.00,0.00,1.00,0.00,0.00,0.00,0.00,0.00,0.00,0.00, 
Seq_76,0.00,0.00,0.00,0.00,1.00,1.00,1.00,1.00,1.00,1.25,0.00,0.00,0.00,0.00,0.00,0.00,0.00,0.00,1.00,0.00, 
Seq_77,1.00,1.00,0.00,1.00,0.00,1.00,0.00,1.00,1.00,1.00,1.00,1.50,1.00,0.00,0.00,1.40,1.00,1.00,0.00,1.00, 
Seq_78,1.00,0.00,0.00,1.00,1.00,1.00,1.00,1.00,1.00,1.00,0.00,1.00,0.00,0.00,0.00,1.00,0.00,0.00,0.00,0.00, 
Seq_79,0.00,0.00,0.00,0.00,1.00,1.00,0.00,1.00,0.00,1.00,0.00,0.00,1.00,0.00,1.00,1.00,0.00,1.00,0.00,0.00, 
Seq_80,1.00,0.00,1.67,1.00,1.00,1.00,0.00,1.00,1.00,1.00,0.00,1.00,1.00,1.00,1.00,1.00,1.00,1.00,1.00,0.00, 
Seq_81,1.50,0.00,1.00,0.00,1.00,1.67,0.00,0.00,1.00,1.40,0.00,0.00,0.00,0.00,0.00,0.00,1.00,1.00,0.00,0.00, 
Seq_82,1.00,1.29,1.00,0.00,1.00,1.00,0.00,1.00,0.00,1.00,0.00,1.00,1.00,0.00,1.40,1.00,1.00,1.00,0.00,1.40, 
Seq_83,0.00,1.00,1.00,1.00,1.00,1.00,0.00,1.00,1.00,0.00,1.00,0.00,1.00,0.00,0.00,1.00,0.00,1.00,1.00,1.00, 
Seq_84,1.00,0.00,1.00,1.00,1.40,1.00,0.00,1.00,1.00,1.40,0.00,1.00,1.00,1.00,1.00,1.00,1.00,1.00,0.00,0.00, 
Seq_85,0.00,0.00,1.00,0.00,0.00,0.00,0.00,1.00,1.00,0.00,1.00,1.00,1.00,0.00,1.00,0.00,0.00,1.00,1.00,1.00, 
Seq_86,1.00,0.00,1.00,0.00,1.00,1.00,0.00,1.00,1.67,1.00,0.00,0.00,1.00,0.00,0.00,1.00,0.00,1.00,0.00,0.00, 
Seq_87,1.00,0.00,1.00,0.00,0.00,1.00,1.00,1.00,0.00,0.00,0.00,0.00,0.00,1.00,1.00,1.50,1.00,1.00,1.00,1.00, 
Seq_88,1.00,0.00,1.00,0.00,1.00,1.00,0.00,1.00,1.67,1.00,0.00,0.00,0.00,0.00,0.00,1.00,0.00,1.50,0.00,0.00, 
Seq_89,1.40,1.00,1.00,1.00,1.00,1.00,1.00,1.00,1.00,1.00,0.00,1.00,0.00,1.00,0.00,1.00,1.00,0.00,0.00,0.00, 
Seq_90,0.00,0.00,0.00,0.00,1.00,1.00,0.00,1.00,1.00,1.00,0.00,1.00,1.00,0.00,1.00,1.00,0.00,0.00,0.00,0.00, 
Seq_91,0.00,1.00,0.00,1.00,0.00,1.00,0.00,1.00,0.00,1.00,0.00,0.00,1.00,1.50,0.00,1.00,1.00,1.00,0.00,1.00, 
Seq_92,1.00,1.00,1.00,0.00,1.00,1.00,1.00,1.40,1.00,1.00,1.00,1.00,1.50,0.00,0.00,1.00,1.00,0.00,0.00,0.00, 
Seq_93,0.00,0.00,0.00,0.00,0.00,1.00,0.00,1.00,0.00,1.67,0.00,0.00,0.00,0.00,1.00,1.00,1.00,1.00,0.00,0.00, 
Seq_94,0.00,0.00,0.00,0.00,0.00,1.48,0.00,0.00,1.00,0.00,1.00,0.00,1.00,1.00,1.00,0.00,0.00,0.00,1.00,1.00, 
Seq_95,1.00,1.29,1.00,0.00,1.00,1.40,1.00,1.00,1.00,1.00,0.00,1.00,1.00,1.00,1.00,1.50,1.00,1.00,0.00,1.00, 
Seq_96,1.50,1.00,0.00,1.00,0.00,1.00,0.00,1.00,1.00,0.00,0.00,1.00,1.00,0.00,1.00,1.00,0.00,1.00,1.00,1.00, 
Seq_97,1.00,1.00,0.00,0.00,0.00,1.00,0.00,0.00,0.00,0.00,0.00,0.00,0.00,0.00,0.00,1.00,0.00,0.00,0.00,0.00, 
Seq_98,1.00,0.00,1.00,0.00,1.00,1.00,0.00,1.00,1.00,1.00,1.00,1.00,0.00,1.00,0.00,1.00,1.00,1.00,1.00,0.00, 
Seq_99,0.00,0.00,0.00,0.00,1.67,1.00,0.00,1.00,1.00,1.50,0.00,0.00,1.00,0.00,1.00,0.00,0.00,1.00,0.00,1.00, 
Seq_100,1.40,0.00,0.00,0.00,0.00,0.00,0.00,1.00,1.50,1.67,1.00,1.00,0.00,0.00,0.00,1.00,0.00,1.00,0.00,0.00, 
Seq_101,0.00,1.00,0.00,0.00,1.00,1.50,0.00,0.00,0.00,1.00,0.00,0.00,0.00,0.00,1.89,0.00,0.00,1.00,0.00,1.00, 
Seq_102,1.00,1.00,0.00,1.00,1.00,1.29,0.00,1.00,1.00,1.00,0.00,1.00,1.50,1.00,1.00,1.00,1.00,1.00,0.00,1.00, 
Seq_103,0.00,0.00,0.00,0.00,1.67,1.00,0.00,1.00,1.00,1.00,0.00,0.00,1.00,0.00,0.00,1.00,0.00,1.00,0.00,0.00, 
Seq_104,1.40,0.00,1.00,1.71,1.33,3.48,1.29,1.00,1.22,1.00,0.00,1.50,0.00,1.20,1.00,1.00,0.00,0.00,0.00,1.00, 
Seq_105,1.00,1.00,1.00,1.00,1.00,1.00,0.00,1.00,1.00,0.00,0.00,1.00,1.00,0.00,1.00,1.33,1.00,0.00,0.00,1.00, 
Seq_106,1.00,0.00,0.00,1.00,1.00,1.00,0.00,1.25,1.33,1.00,1.00,1.00,1.00,1.00,1.00,1.00,1.00,1.00,1.00,1.67, 
Seq_107,0.00,0.00,0.00,1.00,0.00,0.00,0.00,1.00,1.00,1.00,0.00,1.00,1.00,0.00,1.67,0.00,0.00,0.00,0.00,1.00, 
Seq_108,1.00,1.29,0.00,0.00,0.00,1.00,1.00,1.00,1.00,1.50,1.00,1.00,1.00,1.00,0.00,1.00,1.00,1.00,1.00,1.00, 
Seq_109,1.00,1.00,1.00,1.00,1.00,1.00,0.00,1.00,1.71,1.00,1.00,1.00,1.00,1.00,0.00,1.00,1.00,1.00,0.00,0.00, 
Seq_110,1.00,0.00,1.00,0.00,0.00,1.00,0.00,1.00,1.00,1.00,0.00,1.00,0.00,0.00,1.00,1.00,0.00,1.00,0.00,0.00, 
Seq_111,1.00,0.00,0.00,1.00,1.00,1.00,1.00,0.00,1.67,0.00,1.00,0.00,1.67,1.00,1.00,0.00,0.00,1.00,1.00,0.00, 
Seq_112,1.00,1.00,1.00,1.50,1.00,1.29,1.00,1.00,1.00,1.00,0.00,1.00,0.00,0.00,1.67,1.00,1.00,1.00,1.00,1.00, 
Seq_113,0.00,0.00,0.00,0.00,0.00,1.00,0.00,1.00,1.00,1.67,0.00,0.00,0.00,0.00,1.00,0.00,1.00,0.00,0.00,0.00, 
Seq_114,1.00,0.00,0.00,0.00,1.00,1.00,1.00,1.00,1.00,1.00,0.00,0.00,1.00,0.00,0.00,1.00,0.00,1.00,0.00,0.00, 
Seq_115,1.50,0.00,0.00,0.00,1.00,1.00,0.00,1.00,1.25,1.00,1.00,1.00,1.00,1.00,1.00,0.00,1.00,1.00,1.00,0.00, 
Seq_116,1.00,0.00,0.00,1.40,1.00,1.00,0.00,1.00,1.22,1.00,1.00,0.00,1.00,1.40,1.00,1.00,0.00,1.00,0.00,0.00, 
Seq_117,1.44,1.00,1.00,0.00,1.00,1.29,1.00,1.00,1.00,1.67,0.00,1.00,0.00,0.00,1.50,1.00,1.00,1.00,0.00,1.00, 
Seq_118,0.00,0.00,1.00,0.00,0.00,1.33,0.00,1.00,1.50,1.33,0.00,0.00,1.00,0.00,0.00,0.00,0.00,1.00,0.00,0.00, 
Seq_119,0.00,0.00,0.00,0.00,1.00,0.00,0.00,1.00,1.00,1.00,0.00,0.00,1.00,0.00,0.00,1.00,1.00,1.00,0.00,0.00, 
Seq_120,1.40,1.00,1.00,1.00,1.00,1.00,1.00,1.00,1.33,1.00,0.00,1.00,0.00,0.00,1.00,1.00,1.00,1.00,0.00,0.00, 
Seq_121,1.50,1.00,1.00,0.00,1.00,1.00,1.00,1.00,1.40,1.00,0.00,1.40,1.00,1.00,1.00,1.00,1.00,0.00,1.00,1.00, 
Seq_122,1.50,1.00,1.00,1.00,1.00,1.36,0.00,0.00,0.00,1.00,1.00,0.00,1.00,0.00,0.00,1.00,0.00,1.00,1.00,1.00, 
Seq_123,2.60,0.00,1.00,0.00,0.00,1.00,1.00,1.00,1.00,1.00,0.00,1.00,1.00,1.00,1.00,1.00,1.00,1.00,1.00,0.00, 
Seq_124,1.00,0.00,0.00,0.00,1.00,0.00,1.00,1.00,1.44,1.00,0.00,0.00,1.00,0.00,0.00,0.00,0.00,0.00,1.00,0.00, 
Seq_125,0.00,0.00,0.00,0.00,1.00,0.00,0.00,1.00,1.00,1.00,0.00,0.00,1.00,0.00,0.00,1.00,1.00,1.00,0.00,0.00, 
Seq_126,1.00,1.29,1.00,1.00,1.00,1.50,0.00,1.00,1.50,1.00,0.00,1.00,1.00,1.00,1.00,1.00,1.25,1.50,1.00,1.00, 
Seq_127,1.50,0.00,0.00,0.00,1.00,1.00,1.00,1.00,1.00,1.33,0.00,0.00,1.00,1.67,1.00,1.00,0.00,1.00,0.00,0.00, 
Seq_128,0.00,0.00,0.00,1.00,1.00,1.00,1.00,1.00,1.00,1.40,0.00,1.00,1.00,1.00,1.00,0.00,0.00,1.00,0.00,0.00, 
Seq_129,1.00,1.00,1.00,1.00,1.00,1.40,1.00,1.40,1.46,1.00,1.00,1.00,1.00,1.00,1.00,1.00,1.00,1.29,0.00,1.00, 
Seq_130,0.00,0.00,1.00,0.00,1.00,1.50,1.00,1.89,1.50,0.00,0.00,1.00,1.00,1.00,1.00,1.00,1.00,1.00,1.00,0.00, 
Seq_131,1.00,1.00,0.00,1.00,0.00,1.00,1.00,1.00,1.00,1.00,0.00,0.00,1.00,1.00,1.00,1.00,1.20,0.00,0.00,1.00, 
Seq_132,1.00,0.00,1.00,0.00,1.00,1.00,1.00,1.00,1.00,1.00,1.00,0.00,1.00,0.00,0.00,1.00,0.00,1.00,0.00,1.00, 
Seq_133,0.00,1.00,0.00,0.00,1.50,1.00,0.00,1.00,1.00,1.00,0.00,0.00,1.50,0.00,1.00,1.00,0.00,0.00,0.00,0.00, 
Seq_134,1.00,0.00,1.00,1.00,1.00,1.00,0.00,0.00,0.00,0.00,1.00,0.00,2.33,0.00,0.00,1.00,0.00,0.00,0.00,1.00, 
Seq_135,1.00,1.29,0.00,0.00,1.00,1.00,1.00,1.29,1.00,0.00,1.00,1.40,1.00,1.00,1.00,0.00,1.00,1.00,1.00,0.00, 
Seq_136,1.00,0.00,1.00,1.00,1.00,1.00,1.67,1.00,1.00,1.29,0.00,1.00,1.00,0.00,1.00,1.00,1.00,1.00,1.00,1.00, 
Seq_137,1.40,0.00,1.00,0.00,1.00,1.00,1.00,1.00,1.00,1.00,0.00,1.00,0.00,0.00,0.00,1.00,0.00,1.00,0.00,0.00, 
Seq_138,1.00,1.00,1.00,0.00,1.00,1.00,0.00,1.00,1.00,1.33,0.00,1.00,0.00,0.00,0.00,1.00,1.50,1.00,1.00,0.00, 
Seq_139,1.00,1.00,0.00,0.00,1.00,0.00,1.00,1.00,0.00,1.00,0.00,0.00,1.00,0.00,1.00,0.00,0.00,1.00,0.00,0.00, 
Seq_140,1.29,0.00,0.00,1.00,0.00,1.33,0.00,1.00,1.00,1.33,0.00,1.00,0.00,0.00,0.00,1.00,0.00,1.00,0.00,1.00, 
Seq_141,1.00,0.00,0.00,0.00,0.00,1.00,0.00,1.00,1.29,0.00,0.00,0.00,0.00,0.00,0.00,0.00,0.00,0.00,0.00,0.00, 
Seq_142,1.00,1.00,1.00,1.00,1.00,0.00,1.00,0.00,1.00,1.00,1.00,0.00,1.00,2.14,0.00,1.00,0.00,0.00,0.00,1.00, 
Seq_143,1.00,0.00,0.00,0.00,1.00,1.00,1.00,1.00,0.00,1.00,0.00,1.00,0.00,0.00,0.00,1.00,0.00,0.00,0.00,0.00, 
Seq_144,1.00,0.00,1.00,0.00,1.00,1.00,0.00,1.00,1.67,1.50,0.00,0.00,0.00,0.00,0.00,1.00,0.00,1.50,0.00,0.00, 
Seq_145,1.29,1.00,1.00,1.00,1.00,1.00,1.00,1.00,0.00,1.17,0.00,1.00,1.17,1.25,1.53,1.00,1.00,1.00,1.00,1.00, 
Seq_146,1.00,0.00,1.00,1.00,0.00,1.00,1.00,1.00,1.00,1.40,0.00,0.00,0.00,0.00,0.00,1.00,0.00,1.40,0.00,0.00, 
Seq_147,1.00,0.00,0.00,1.00,0.00,1.00,0.00,1.00,1.00,1.00,0.00,0.00,1.00,1.00,0.00,1.00,1.00,1.00,1.00,0.00, 
Seq_148,1.40,0.00,0.00,0.00,1.00,1.00,0.00,1.00,1.00,1.00,0.00,1.00,1.00,0.00,1.57,0.00,1.00,1.00,1.00,1.00, 
Seq_149,0.00,1.00,0.00,0.00,1.00,1.50,0.00,0.00,0.00,1.00,0.00,0.00,1.00,0.00,1.00,0.00,0.00,1.00,0.00,1.00, 
Seq_150,0.00,1.00,0.00,1.00,0.00,1.33,0.00,0.00,0.00,1.00,0.00,1.00,1.00,0.00,1.00,1.00,1.00,1.00,1.00,0.00, 
Seq_151,1.00,0.00,0.00,1.00,1.00,1.00,1.00,1.00,1.00,1.00,0.00,0.00,1.00,0.00,0.00,1.00,0.00,1.33,0.00,0.00, 
Seq_152,1.00,1.00,1.00,1.00,1.00,0.00,1.00,1.00,0.00,1.00,0.00,1.00,0.00,0.00,0.00,1.00,0.00,0.00,0.00,0.00, 
Seq_153,0.00,1.00,0.00,1.00,0.00,1.00,1.00,0.00,0.00,1.00,1.00,0.00,1.00,1.00,1.82,1.00,1.00,0.00,1.00,0.00, 
Seq_154,1.00,1.29,0.00,1.00,1.00,1.00,0.00,1.00,0.00,1.00,0.00,0.00,0.00,0.00,1.00,1.00,1.00,1.00,0.00,1.00, 
Seq_155,1.00,1.00,0.00,1.00,1.00,1.00,0.00,1.00,1.00,1.00,0.00,1.00,1.00,0.00,1.00,1.00,1.67,1.00,0.00,1.00, 
Seq_156,1.00,0.00,0.00,1.00,1.00,1.89,1.00,1.00,0.00,0.00,0.00,0.00,1.00,0.00,0.00,1.00,1.00,1.00,0.00,1.00, 
Seq_157,1.73,0.00,0.00,0.00,0.00,1.00,0.00,0.00,1.40,1.29,1.00,1.00,0.00,0.00,0.00,0.00,1.00,1.00,1.00,0.00, 
Seq_158,0.00,1.00,1.00,1.00,1.00,1.25,0.00,1.00,1.00,1.00,0.00,1.00,0.00,0.00,0.00,1.00,1.00,0.00,1.00,1.00, 
Seq_159,1.57,1.00,0.00,1.00,1.00,0.00,1.67,1.00,1.00,0.00,1.67,0.00,1.00,0.00,1.00,1.00,0.00,1.00,0.00,1.00, 
Seq_160,1.36,1.00,0.00,1.00,0.00,1.40,1.00,1.00,1.00,1.00,0.00,0.00,1.00,0.00,1.00,1.00,1.00,1.00,1.00,1.00, 
Seq_161,1.00,1.00,1.00,0.00,1.00,2.43,1.00,0.00,1.00,1.00,1.00,0.00,1.00,0.00,0.00,1.33,1.00,1.00,1.00,1.00, 
Seq_162,1.00,0.00,0.00,0.00,1.00,1.00,1.00,1.40,1.00,1.00,1.00,0.00,0.00,0.00,2.33,0.00,1.00,1.00,0.00,0.00, 
Seq_163,0.00,1.29,1.00,0.00,1.00,1.00,1.00,1.00,1.00,1.18,1.00,0.00,1.00,1.00,1.00,1.00,0.00,1.00,1.00,1.00, 
Seq_164,1.00,0.00,1.00,0.00,0.00,0.00,1.00,1.00,1.40,1.91,1.00,0.00,0.00,1.00,1.00,0.00,1.00,1.00,0.00,0.00, 
Seq_165,1.00,0.00,0.00,0.00,1.00,0.00,1.00,1.00,0.00,0.00,1.00,0.00,1.89,1.00,1.33,0.00,1.00,1.00,0.00,1.00, 
Seq_166,1.00,0.00,1.00,1.22,1.00,1.00,0.00,1.00,1.22,1.00,0.00,1.25,1.00,2.00,0.00,1.00,1.00,1.00,0.00,1.00, 
Seq_167,0.00,1.00,0.00,0.00,1.00,1.00,0.00,1.00,1.00,1.50,1.00,0.00,1.00,1.00,0.00,0.00,0.00,0.00,0.00,0.00, 
Seq_168,1.00,0.00,0.00,0.00,1.50,1.00,1.50,1.00,1.00,1.67,0.00,0.00,1.00,0.00,1.00,0.00,0.00,1.00,0.00,0.00, 
Seq_169,1.00,1.29,1.00,0.00,0.00,1.00,0.00,1.50,1.00,1.00,0.00,1.00,1.00,0.00,1.00,1.00,1.33,0.00,0.00,1.00, 
Seq_170,0.00,0.00,0.00,0.00,1.00,1.00,1.00,0.00,1.00,0.00,0.00,1.00,1.25,1.00,0.00,0.00,1.00,1.00,0.00,1.00, 
Seq_171,1.29,1.00,0.00,0.00,1.00,1.83,0.00,1.00,1.00,1.00,0.00,1.00,0.00,1.00,1.00,1.00,1.00,1.00,1.00,1.00, 
Seq_172,1.00,1.00,1.00,1.50,1.00,1.40,1.50,1.00,1.00,1.00,1.00,1.00,1.00,1.00,1.00,1.00,1.00,1.00,1.00,1.00, 
Seq_173,2.11,1.00,1.00,1.00,1.00,1.33,1.00,1.00,1.00,1.00,1.00,1.00,1.25,1.00,1.00,1.00,1.00,1.00,1.00,1.00, 
Seq_174,1.00,0.00,1.00,0.00,0.00,1.00,0.00,0.00,0.00,0.00,1.00,1.00,0.00,0.00,1.00,0.00,1.00,0.00,0.00,0.00, 
Seq_175,0.00,1.00,0.00,0.00,0.00,1.00,0.00,1.00,0.00,0.00,0.00,0.00,0.00,0.00,1.29,0.00,0.00,0.00,0.00,0.00, 
Seq_176,1.00,0.00,0.00,1.00,1.50,1.00,0.00,1.50,1.00,1.33,0.00,0.00,1.00,1.00,0.00,1.91,1.00,1.00,0.00,0.00, 
Seq_177,1.00,0.00,1.00,1.00,1.00,1.00,0.00,0.00,1.00,1.00,0.00,0.00,0.00,1.00,0.00,1.00,1.00,1.00,0.00,1.00, 
Seq_178,0.00,0.00,0.00,0.00,1.00,1.00,0.00,1.00,1.00,1.50,0.00,0.00,1.00,0.00,0.00,1.00,0.00,1.00,0.00,0.00, 
Seq_179,1.00,0.00,0.00,0.00,0.00,0.00,0.00,1.00,0.00,1.00,0.00,0.00,2.47,1.00,1.00,0.00,1.00,0.00,0.00,1.40, 
Seq_180,1.00,0.00,0.00,1.00,1.67,1.40,0.00,1.00,1.00,1.00,0.00,0.00,0.00,1.00,0.00,1.00,1.00,1.00,0.00,1.00, 
Seq_181,0.00,0.00,0.00,1.00,0.00,1.00,1.00,1.00,1.00,1.00,0.00,1.00,1.67,1.00,1.00,1.00,0.00,1.00,1.00,1.00, 
Seq_182,1.00,1.00,0.00,0.00,1.50,1.00,0.00,1.00,1.67,1.67,0.00,1.00,1.00,1.00,0.00,1.00,0.00,1.00,0.00,0.00, 
Seq_183,1.00,1.00,0.00,0.00,1.00,1.00,0.00,0.00,1.50,1.73,0.00,0.00,1.00,0.00,0.00,0.00,0.00,0.00,0.00,0.00, 
Seq_184,1.00,0.00,0.00,0.00,0.00,1.00,0.00,1.00,1.00,1.00,0.00,0.00,1.00,1.67,1.00,1.00,1.67,1.00,1.00,0.00, 
Seq_185,1.00,0.00,0.00,0.00,0.00,0.00,0.00,0.00,1.57,1.00,0.00,0.00,1.67,0.00,1.67,0.00,1.00,0.00,1.00,0.00, 
Seq_186,0.00,0.00,4.33,0.00,0.00,0.00,0.00,0.00,0.00,0.00,0.00,0.00,0.00,0.00,0.00,0.00,0.00,0.00,0.00,0.00, 
Seq_187,1.00,0.00,1.00,1.00,1.00,0.00,1.00,1.29,1.00,1.00,0.00,0.00,1.00,1.00,1.33,1.00,1.00,1.00,1.00,1.00, 
Seq_188,1.00,1.00,1.50,1.00,1.00,1.40,1.00,1.00,1.00,0.00,1.00,1.00,1.00,1.00,0.00,1.00,0.00,1.00,1.00,1.00, 
Seq_189,1.00,0.00,1.00,0.00,0.00,1.00,0.00,1.50,1.00,1.00,0.00,1.00,0.00,0.00,0.00,0.00,0.00,0.00,1.00,0.00, 
Seq_190,0.00,0.00,1.00,0.00,0.00,1.00,1.67,0.00,0.00,1.00,0.00,0.00,0.00,0.00,1.00,0.00,0.00,1.00,0.00,1.00, 
Seq_191,1.00,1.00,0.00,1.00,1.00,1.29,1.00,1.00,1.00,1.00,1.00,1.00,0.00,1.00,0.00,1.00,1.00,0.00,0.00,0.00, 
Seq_192,1.00,1.00,1.00,1.40,0.00,1.33,0.00,1.00,1.25,1.00,0.00,1.00,1.00,1.00,1.00,1.00,1.00,1.00,1.00,1.00, 
Seq_193,1.00,0.00,0.00,0.00,0.00,1.00,0.00,1.50,1.33,1.00,0.00,1.00,0.00,0.00,0.00,0.00,0.00,1.00,1.00,0.00, 
Seq_194,1.00,0.00,1.00,0.00,1.00,1.40,0.00,1.00,1.67,1.00,0.00,1.00,0.00,0.00,1.00,0.00,0.00,1.50,0.00,0.00, 
Seq_195,1.00,1.00,1.00,1.44,1.00,1.00,1.00,1.40,1.13,1.00,1.00,1.00,1.00,1.00,1.25,1.00,1.50,1.00,1.00,1.00, 
Seq_196,1.50,1.00,1.00,1.00,1.00,1.00,0.00,1.17,1.31,1.00,1.00,1.00,1.00,1.00,1.33,1.00,1.00,1.00,1.00,0.00, 
Seq_197,1.00,0.00,0.00,1.00,1.00,1.00,1.00,1.00,1.40,1.00,1.00,1.00,0.00,0.00,0.00,1.00,0.00,1.00,0.00,0.00, 
Seq_198,1.00,0.00,0.00,1.00,1.00,1.00,0.00,1.33,1.25,1.00,0.00,1.00,1.00,0.00,1.00,0.00,0.00,1.00,1.00,0.00, 
Seq_199,0.00,0.00,0.00,0.00,0.00,0.00,0.00,1.00,1.00,1.00,0.00,0.00,1.00,0.00,1.67,0.00,0.00,0.00,1.33,0.00, 
Seq_200,1.00,0.00,0.00,0.00,1.00,1.00,0.00,1.00,1.00,1.00,0.00,0.00,1.00,0.00,0.00,1.00,1.00,1.00,0.00,0.00, 
Seq_201,0.00,0.00,0.00,0.00,2.14,0.00,0.00,1.00,0.00,1.00,0.00,0.00,0.00,0.00,1.00,1.00,0.00,0.00,0.00,0.00, 
Seq_202,0.00,1.00,0.00,0.00,1.00,1.00,0.00,1.00,1.00,0.00,0.00,0.00,0.00,0.00,1.33,0.00,0.00,1.00,1.00,1.00, 
Seq_203,1.40,0.00,0.00,1.00,0.00,1.33,1.00,1.00,1.00,1.00,0.00,0.00,0.00,0.00,0.00,1.00,1.00,0.00,0.00,1.00, 
Seq_204,1.00,0.00,1.00,0.00,1.00,1.00,1.00,1.00,1.00,0.00,0.00,0.00,0.00,0.00,0.00,1.00,0.00,1.50,1.00,0.00, 
Seq_205,1.00,1.29,0.00,1.67,0.00,1.33,0.00,1.50,1.29,1.00,0.00,1.00,1.00,1.00,1.25,1.00,1.00,1.00,0.00,1.67, 
Seq_206,1.00,1.00,1.50,1.00,1.00,1.29,1.00,0.00,1.00,1.00,0.00,0.00,1.00,1.40,1.00,1.80,1.00,1.00,1.00,1.00, 
Seq_207,1.67,0.00,1.00,0.00,1.00,1.00,1.00,1.00,1.40,1.00,1.00,1.00,1.00,1.00,1.00,1.00,0.00,0.00,0.00,1.00, 
Seq_208,0.00,1.00,0.00,0.00,1.00,0.00,0.00,1.67,0.00,0.00,0.00,0.00,0.00,0.00,1.00,3.00,1.40,0.00,0.00,0.00, 
Seq_209,1.00,1.00,1.00,0.00,1.00,1.00,0.00,1.00,0.00,1.00,0.00,1.00,0.00,0.00,0.00,1.00,0.00,1.00,1.00,1.00, 
Seq_210,0.00,1.00,0.00,0.00,0.00,1.00,0.00,1.67,1.50,0.00,1.00,1.00,1.00,1.00,1.50,1.00,1.00,1.00,0.00,1.00, 
Seq_211,1.67,1.00,0.00,1.00,0.00,1.00,0.00,1.00,1.00,0.00,0.00,1.00,1.00,0.00,1.00,1.00,0.00,1.00,1.00,1.00, 
Seq_212,1.00,0.00,0.00,1.00,0.00,1.00,1.00,1.00,1.00,1.33,0.00,0.00,0.00,0.00,0.00,1.00,0.00,1.00,0.00,0.00, 
Seq_213,0.00,1.29,1.00,1.00,1.00,1.00,0.00,1.00,1.00,1.67,0.00,0.00,1.00,1.00,1.22,1.00,0.00,1.00,0.00,1.00, 
Seq_214,1.00,0.00,1.00,0.00,1.00,2.46,1.14,0.00,0.00,0.00,0.00,1.00,1.00,1.00,1.00,1.00,1.00,0.00,0.00,1.00, 
Seq_215,0.00,0.00,0.00,0.00,0.00,0.00,0.00,0.00,0.00,0.00,0.00,0.00,0.00,0.00,1.63,0.00,0.00,1.40,1.00,0.00, 
Seq_216,1.00,1.00,0.00,1.00,1.00,1.00,0.00,1.00,1.20,1.00,0.00,0.00,1.00,1.00,1.00,0.00,1.00,1.00,1.00,1.00, 
Seq_217,1.00,0.00,0.00,0.00,1.00,1.00,0.00,0.00,1.00,1.00,0.00,0.00,1.00,0.00,0.00,1.00,0.00,1.33,0.00,0.00, 
Seq_218,1.00,1.29,1.00,0.00,1.00,1.00,1.00,1.00,1.33,1.00,0.00,0.00,1.00,1.00,1.67,1.00,1.00,1.00,0.00,1.00, 
Seq_219,1.00,1.29,0.00,1.00,1.00,1.40,1.00,1.00,0.00,1.00,0.00,1.00,1.00,1.00,1.00,1.00,1.00,1.00,1.00,1.00, 
Seq_220,1.22,1.22,1.00,1.00,1.00,1.00,0.00,1.00,1.00,1.00,1.00,1.00,1.00,0.00,1.33,1.71,1.00,1.00,0.00,1.00, 
Seq_221,0.00,0.00,0.00,0.00,1.00,1.50,0.00,1.00,0.00,1.40,0.00,1.00,0.00,0.00,0.00,0.00,1.00,0.00,0.00,0.00, 
Seq_222,1.40,0.00,0.00,0.00,0.00,0.00,0.00,1.00,1.50,1.00,0.00,1.00,0.00,0.00,0.00,0.00,0.00,0.00,0.00,0.00, 
Seq_223,0.00,0.00,0.00,0.00,0.00,1.00,1.00,1.00,0.00,0.00,0.00,1.67,1.29,1.00,1.00,0.00,0.00,1.00,0.00,1.00, 
Seq_224,0.00,1.00,0.00,0.00,1.00,1.00,0.00,1.00,1.44,1.00,0.00,0.00,1.50,0.00,1.29,1.00,1.00,1.00,1.00,0.00, 
Seq_225,1.00,1.00,0.00,1.00,1.00,1.00,1.00,1.00,1.00,1.00,0.00,1.00,1.00,1.00,1.00,1.00,1.00,1.00,1.00,0.00, 
Seq_226,0.00,0.00,0.00,1.00,1.00,1.00,0.00,0.00,0.00,0.00,0.00,0.00,1.50,0.00,1.00,1.00,0.00,0.00,0.00,0.00, 
Seq_227,1.33,0.00,1.00,0.00,1.00,1.29,0.00,1.00,1.50,1.00,1.00,1.00,0.00,1.00,0.00,1.00,1.00,1.00,1.00,1.00, 
Seq_228,0.00,0.00,1.00,1.00,0.00,1.00,0.00,1.89,1.22,1.00,0.00,2.00,1.00,0.00,1.50,1.00,1.00,1.00,0.00,0.00, 
Seq_229,1.80,1.00,0.00,0.00,1.00,1.38,0.00,1.00,1.00,1.00,1.00,1.00,1.00,0.00,1.00,0.00,1.00,1.00,0.00,0.00, 
Seq_230,1.00,0.00,0.00,0.00,1.00,1.00,0.00,1.00,1.00,1.00,0.00,1.00,1.00,0.00,1.00,1.00,0.00,1.00,0.00,0.00, 
Seq_231,1.00,1.00,0.00,0.00,0.00,1.00,1.00,1.00,1.00,1.00,1.00,1.00,1.00,0.00,0.00,1.00,1.00,1.00,0.00,0.00, 
Seq_232,0.00,1.00,1.00,1.00,1.00,1.22,0.00,1.00,0.00,1.00,0.00,1.00,1.00,0.00,0.00,1.00,1.00,0.00,0.00,1.00, 
Seq_233,1.00,0.00,1.00,0.00,1.00,1.00,0.00,1.00,1.00,1.00,0.00,1.00,0.00,0.00,1.00,0.00,1.00,1.57,0.00,0.00, 
Seq_234,0.00,1.00,1.00,1.00,1.00,1.00,1.00,1.00,1.00,0.00,0.00,1.00,1.00,0.00,0.00,1.00,1.00,1.00,1.00,1.00, 
Seq_235,1.00,0.00,0.00,0.00,0.00,1.00,0.00,1.00,1.00,1.33,1.00,0.00,1.00,0.00,0.00,1.00,0.00,1.00,0.00,0.00, 
Seq_236,1.00,0.00,1.00,0.00,1.00,1.40,1.00,0.00,1.33,1.00,0.00,0.00,0.00,0.00,1.00,1.00,1.00,1.00,1.00,1.00, 
Seq_237,0.00,1.00,0.00,0.00,1.00,1.00,0.00,0.00,1.00,1.00,0.00,0.00,1.00,0.00,1.00,1.00,2.14,1.00,1.00,1.00, 
Seq_238,0.00,0.00,0.00,0.00,1.67,1.00,0.00,0.00,1.00,1.00,1.00,0.00,1.00,1.67,1.00,0.00,0.00,0.00,0.00,0.00, 
Seq_239,1.00,1.00,0.00,1.00,1.00,1.00,1.00,1.00,1.00,1.40,0.00,0.00,1.00,1.00,1.00,1.00,1.00,1.00,0.00,1.33, 
Seq_240,1.40,0.00,0.00,1.00,0.00,0.00,1.00,1.00,1.00,1.00,0.00,0.00,0.00,0.00,0.00,0.00,1.00,1.00,0.00,1.00, 
Seq_241,1.00,0.00,0.00,0.00,1.00,1.00,1.40,1.00,0.00,1.00,0.00,0.00,0.00,0.00,1.00,1.00,0.00,1.00,0.00,0.00, 
Seq_242,1.40,0.00,0.00,1.00,1.00,1.00,0.00,1.00,1.00,1.00,1.00,0.00,0.00,1.00,0.00,0.00,1.00,0.00,0.00,0.00, 
Seq_243,1.40,1.00,1.00,1.00,1.00,1.50,0.00,0.00,1.00,1.33,1.00,1.00,0.00,0.00,1.00,1.00,1.50,1.50,1.00,0.00, 
Seq_244,1.00,0.00,0.00,0.00,0.00,1.00,0.00,1.00,1.00,1.33,1.00,0.00,1.00,0.00,0.00,1.00,0.00,0.00,0.00,0.00, 
Seq_245,0.00,0.00,0.00,0.00,1.00,0.00,0.00,0.00,1.67,0.00,0.00,0.00,0.00,0.00,1.00,0.00,0.00,0.00,1.00,0.00, 
Seq_246,1.40,1.00,0.00,1.00,0.00,1.50,0.00,1.00,1.00,0.00,1.00,0.00,1.00,0.00,1.00,1.00,0.00,1.00,1.00,1.00, 
Seq_247,1.00,1.00,1.00,1.00,1.00,1.25,1.00,1.00,1.00,1.00,0.00,1.00,0.00,0.00,1.67,1.00,1.00,1.00,1.00,1.00, 
Seq_248,1.00,1.00,1.00,1.00,1.00,1.59,1.00,1.00,1.00,1.00,1.00,1.00,1.00,0.00,1.00,1.00,1.00,1.00,0.00,1.00, 
Seq_249,1.00,1.00,1.00,1.00,1.00,0.00,0.00,1.00,1.00,1.00,0.00,0.00,1.00,0.00,1.00,1.00,1.00,1.00,1.00,0.00, 
Seq_250,1.50,1.00,1.00,1.00,0.00,1.00,1.00,1.00,1.00,1.40,0.00,1.00,0.00,0.00,1.00,1.00,1.00,1.00,0.00,0.00, 
Seq_251,1.00,0.00,0.00,0.00,0.00,1.00,1.00,1.50,1.00,1.00,1.00,0.00,0.00,0.00,0.00,0.00,1.00,0.00,0.00,0.00, 
Seq_252,1.00,1.50,0.00,0.00,1.00,1.33,1.00,1.00,1.00,1.00,0.00,1.00,1.62,1.00,1.00,1.00,1.00,1.00,0.00,1.00, 
Seq_253,1.00,0.00,1.00,0.00,1.00,1.33,1.00,1.00,1.00,1.00,0.00,1.00,0.00,0.00,1.00,1.00,0.00,1.40,0.00,1.00, 
Seq_254,1.00,1.25,1.00,1.33,1.00,1.00,1.00,1.00,1.00,1.00,1.00,1.00,1.00,1.40,1.40,1.00,1.00,1.00,1.00,1.00, 
Seq_255,1.00,0.00,1.00,1.50,1.00,1.00,0.00,1.00,1.50,1.00,1.00,1.00,1.00,1.00,0.00,1.00,1.00,1.00,0.00,1.00, 
Seq_256,1.00,0.00,1.00,0.00,1.00,1.50,0.00,1.50,1.67,1.00,0.00,0.00,0.00,0.00,0.00,1.00,0.00,1.00,0.00,0.00, 
Seq_257,1.00,1.00,1.00,1.00,0.00,1.00,1.00,0.00,1.00,1.00,1.00,0.00,1.00,1.00,1.44,1.00,1.00,1.00,0.00,0.00, 
Seq_258,1.36,1.00,1.22,0.00,1.00,1.40,1.00,1.00,1.00,1.00,0.00,1.14,1.00,1.00,1.00,1.00,1.00,1.00,0.00,1.00, 
Seq_259,1.00,1.00,1.00,1.00,1.00,1.00,1.00,1.00,1.00,1.17,0.00,1.00,0.00,1.00,0.00,1.50,1.29,1.00,0.00,1.00, 
Seq_260,1.50,0.00,0.00,0.00,1.00,1.40,1.00,0.00,1.00,1.00,0.00,0.00,1.00,1.00,1.50,1.00,1.00,1.00,0.00,1.00, 
Seq_261,1.00,0.00,0.00,0.00,1.40,1.00,1.00,1.67,1.00,1.00,0.00,0.00,1.00,1.00,0.00,1.00,1.00,0.00,0.00,0.00, 
Seq_262,1.67,1.00,0.00,1.00,1.00,1.00,0.00,1.00,1.00,0.00,0.00,1.00,1.00,1.00,1.00,1.50,0.00,0.00,0.00,1.00, 
Seq_263,1.00,1.29,1.00,0.00,1.00,1.00,0.00,1.00,0.00,1.00,0.00,1.50,1.00,1.00,1.25,1.00,1.00,0.00,1.00,1.67, 
Seq_264,1.00,1.00,1.00,1.00,1.00,1.00,0.00,1.00,1.00,0.00,1.00,1.00,1.40,1.00,2.43,1.00,1.00,1.00,1.00,0.00, 
Seq_265,1.00,0.00,1.50,0.00,0.00,1.00,1.00,1.00,2.14,1.00,0.00,1.00,0.00,1.00,1.00,1.00,1.00,1.00,1.00,1.00, 
Seq_266,1.00,0.00,0.00,0.00,1.00,1.00,0.00,1.00,0.00,1.00,0.00,0.00,1.00,1.00,0.00,1.00,0.00,0.00,0.00,0.00, 
Seq_267,1.00,1.00,0.00,1.00,1.00,1.00,1.00,1.00,1.00,1.00,1.00,1.00,1.00,1.00,0.00,1.00,1.00,1.00,0.00,1.00, 
Seq_268,1.00,0.00,0.00,0.00,1.00,1.33,1.40,1.00,1.00,1.00,1.00,1.00,0.00,1.00,1.00,0.00,0.00,0.00,0.00,0.00, 
Seq_269,0.00,1.00,1.00,0.00,0.00,1.00,0.00,0.00,1.00,1.00,0.00,1.00,1.00,1.00,1.00,1.00,0.00,1.67,0.00,1.00, 
Seq_270,0.00,1.00,0.00,0.00,1.00,0.00,0.00,1.00,1.00,1.00,1.00,0.00,1.00,0.00,1.00,1.00,0.00,0.00,0.00,0.00, 
Seq_271,1.00,1.00,1.00,1.00,1.00,1.40,0.00,1.00,1.29,1.00,0.00,1.00,1.00,0.00,1.00,1.00,1.00,1.00,1.00,0.00, 
Seq_272,1.00,0.00,0.00,0.00,1.00,0.00,0.00,1.00,1.00,1.00,0.00,0.00,1.00,0.00,1.00,0.00,1.00,1.00,0.00,0.00, 
Seq_273,1.67,0.00,1.00,0.00,0.00,1.33,1.00,1.50,1.00,1.00,0.00,0.00,0.00,0.00,1.57,0.00,0.00,1.00,1.00,0.00, 
Seq_274,1.00,1.29,0.00,1.00,1.89,1.00,0.00,1.00,1.00,1.00,0.00,1.00,1.00,0.00,1.00,1.00,0.00,1.67,1.00,1.00, 
Seq_275,1.00,1.00,0.00,0.00,1.00,2.00,1.00,1.00,1.00,1.40,1.00,0.00,1.00,1.00,1.00,1.00,0.00,1.00,1.00,0.00, 
Seq_276,0.00,1.29,0.00,1.00,1.00,1.50,0.00,1.00,0.00,1.00,0.00,1.00,0.00,0.00,1.33,1.00,1.00,1.00,0.00,1.00, 
Seq_277,1.00,0.00,0.00,0.00,1.00,1.20,1.00,0.00,1.00,1.40,0.00,1.00,1.00,1.00,1.00,1.50,1.00,1.00,0.00,1.00, 
Seq_278,1.00,1.00,1.00,1.00,1.00,1.00,1.00,1.00,1.00,1.00,1.00,1.31,1.00,1.00,1.00,1.00,1.00,1.33,1.00,1.00, 
Seq_279,1.00,0.00,1.40,1.00,1.00,3.06,1.00,1.00,1.00,1.00,1.00,1.00,1.73,1.00,1.00,1.00,1.00,1.00,1.00,1.00, 
Seq_280,0.00,0.00,0.00,0.00,1.00,1.00,0.00,1.00,1.00,1.00,0.00,0.00,0.00,1.00,1.00,1.00,0.00,1.00,1.00,0.00, 
Seq_281,1.40,0.00,1.00,0.00,0.00,1.00,0.00,1.00,1.00,1.00,0.00,1.00,1.00,1.00,1.00,1.00,1.00,1.00,1.00,0.00, 
Seq_282,1.00,0.00,0.00,1.00,0.00,1.00,0.00,0.00,1.83,1.00,1.00,1.00,0.00,0.00,1.50,1.00,0.00,0.00,1.00,0.00, 
Seq_283,1.00,1.29,1.00,1.00,1.00,1.00,1.00,1.00,1.40,1.00,1.00,1.00,1.00,1.00,1.00,1.00,1.00,1.00,1.00,1.00, 
Seq_284,0.00,0.00,0.00,0.00,1.00,1.00,0.00,1.00,1.00,1.00,0.00,0.00,1.00,0.00,0.00,1.00,0.00,1.00,0.00,0.00, 
Seq_285,1.00,0.00,1.29,1.00,0.00,1.00,1.00,1.40,1.00,1.00,0.00,1.00,1.00,0.00,1.50,1.00,1.67,1.00,1.00,1.00, 
Seq_286,1.00,0.00,0.00,0.00,1.00,1.00,0.00,1.00,0.00,0.00,0.00,1.00,2.33,0.00,1.00,0.00,0.00,1.00,1.00,0.00, 
Seq_287,1.00,0.00,1.00,0.00,1.00,1.00,0.00,1.00,1.67,1.00,0.00,0.00,0.00,0.00,0.00,1.00,0.00,1.00,0.00,0.00, 
Seq_288,1.00,0.00,0.00,1.00,1.00,1.00,1.00,1.00,1.00,1.00,0.00,0.00,1.00,0.00,0.00,1.00,0.00,1.29,0.00,0.00, 
Seq_289,0.00,1.00,1.00,1.00,0.00,1.00,1.00,1.00,1.00,1.00,0.00,1.40,0.00,1.00,0.00,1.00,1.00,1.00,1.67,0.00, 
Seq_290,0.00,1.00,0.00,0.00,1.00,1.00,1.00,1.00,1.00,1.00,1.00,0.00,0.00,0.00,1.00,1.00,1.00,0.00,0.00,0.00, 
Seq_291,1.00,1.00,1.00,0.00,0.00,1.00,0.00,1.33,1.00,1.00,0.00,1.00,1.00,0.00,1.00,1.67,1.00,1.00,1.00,0.00, 
Seq_292,0.00,1.55,1.00,0.00,1.00,1.00,1.00,1.00,1.00,0.00,1.00,0.00,1.00,0.00,1.00,1.00,1.00,0.00,0.00,0.00, 
Seq_293,0.00,0.00,1.00,1.00,0.00,1.00,0.00,0.00,1.00,0.00,0.00,0.00,1.00,0.00,1.00,0.00,0.00,0.00,1.00,0.00, 
Seq_294,1.00,0.00,0.00,0.00,1.00,1.00,1.00,1.00,1.44,1.00,0.00,0.00,0.00,0.00,1.00,1.00,0.00,1.00,0.00,1.00, 
Seq_295,1.00,1.00,0.00,1.00,1.00,1.44,0.00,1.00,1.29,1.33,0.00,1.00,0.00,1.00,0.00,1.00,1.00,1.29,0.00,0.00, 
Seq_296,0.00,0.00,1.00,0.00,1.00,1.00,0.00,1.00,1.00,1.00,1.00,1.00,1.73,0.00,1.00,0.00,1.00,1.00,0.00,1.00, 
Seq_297,1.00,1.00,0.00,1.00,0.00,1.00,1.00,1.00,1.50,0.00,0.00,1.00,0.00,0.00,1.00,1.00,1.00,1.00,1.00,1.00, 
Seq_298,0.00,0.00,0.00,0.00,1.50,0.00,1.00,0.00,0.00,1.00,0.00,0.00,0.00,0.00,0.00,0.00,0.00,0.00,0.00,1.00, 
Seq_299,0.00,1.00,0.00,0.00,0.00,5.41,1.00,1.00,0.00,0.00,0.00,1.00,0.00,1.00,0.00,1.00,0.00,1.00,0.00,0.00, 
Seq_300,2.00,1.00,0.00,1.00,1.00,1.00,0.00,1.40,1.40,1.00,0.00,0.00,1.00,0.00,0.00,1.00,0.00,1.67,0.00,0.00, 
Seq_301,0.00,1.00,0.00,0.00,1.00,1.25,1.00,1.00,1.00,0.00,0.00,1.00,1.00,1.00,1.00,1.00,1.00,0.00,0.00,1.00, 
Seq_302,1.00,1.00,0.00,1.00,1.00,1.00,0.00,1.00,1.00,0.00,0.00,1.00,1.00,0.00,1.00,1.00,1.00,1.00,0.00,1.00, 
Seq_303,1.67,1.00,1.40,1.00,1.00,1.00,0.00,1.00,1.00,1.00,0.00,1.00,1.00,0.00,1.00,1.00,1.00,1.00,0.00,1.00, 
Seq_304,1.00,1.29,0.00,0.00,1.00,1.00,1.00,0.00,1.00,1.00,1.00,1.00,1.00,1.00,1.00,1.00,1.00,0.00,1.00,1.00, 
Seq_305,0.00,1.00,0.00,0.00,1.00,1.00,0.00,1.00,0.00,0.00,0.00,0.00,0.00,0.00,1.00,0.00,1.00,0.00,0.00,0.00, 
Seq_306,1.83,0.00,1.00,0.00,0.00,1.00,1.00,1.00,1.40,1.00,1.00,0.00,0.00,1.00,0.00,1.00,1.00,0.00,1.00,0.00, 
Seq_307,0.00,1.00,0.00,1.00,1.00,1.00,1.00,0.00,1.40,1.00,1.00,1.00,0.00,1.00,1.00,1.00,1.40,1.00,1.00,1.00, 
Seq_308,1.25,1.00,0.00,1.40,1.00,1.38,1.00,1.00,1.20,1.18,0.00,1.00,1.00,1.00,0.00,1.00,1.40,1.00,1.00,1.00, 
Seq_309,0.00,1.29,1.00,1.00,1.00,1.00,0.00,1.00,1.40,1.00,1.00,1.00,1.00,0.00,1.00,1.00,0.00,1.00,1.00,1.00, 
Seq_310,1.00,0.00,1.00,1.00,1.00,1.00,0.00,1.00,1.00,1.00,0.00,1.00,0.00,1.00,1.00,2.00,1.00,0.00,1.00,0.00, 
Seq_311,1.50,1.00,1.00,0.00,0.00,1.00,0.00,1.00,1.00,1.00,1.00,0.00,0.00,0.00,0.00,1.00,1.00,1.00,1.00,0.00, 
Seq_312,0.00,1.29,1.00,0.00,1.50,1.29,0.00,1.00,1.00,1.00,0.00,1.00,1.00,0.00,1.25,1.00,0.00,1.00,0.00,1.00, 
Seq_313,1.67,0.00,0.00,0.00,1.00,1.00,0.00,1.40,1.50,1.00,0.00,0.00,1.00,1.00,1.29,1.00,0.00,1.00,0.00,0.00, 
Seq_314,1.00,1.22,1.00,1.00,0.00,1.00,0.00,1.40,1.33,1.00,0.00,1.00,1.00,0.00,1.00,1.00,1.40,1.00,1.00,1.00, 
Seq_315,1.50,0.00,1.00,1.00,0.00,1.00,1.00,1.00,1.57,1.00,0.00,1.00,0.00,1.40,1.00,0.00,1.00,1.00,1.00,0.00, 
Seq_316,0.00,0.00,0.00,1.00,0.00,1.00,0.00,1.00,1.00,1.00,1.40,0.00,1.00,0.00,1.50,1.00,1.00,0.00,0.00,0.00, 
Seq_317,1.00,0.00,0.00,0.00,1.50,1.00,0.00,1.00,1.59,1.00,0.00,1.00,1.00,0.00,1.00,1.00,0.00,1.00,0.00,0.00, 
Seq_318,1.00,1.00,0.00,0.00,1.00,1.00,0.00,1.00,1.50,1.00,1.00,1.00,1.00,0.00,0.00,1.00,1.00,1.00,1.00,1.00, 
Seq_319,1.00,1.00,1.00,1.00,1.00,1.00,0.00,1.29,1.00,1.00,1.00,1.50,1.00,0.00,1.00,1.00,1.00,1.00,0.00,0.00, 
Seq_320,1.00,1.00,1.00,1.00,0.00,0.00,0.00,0.00,1.00,1.00,0.00,1.00,0.00,0.00,0.00,0.00,1.00,0.00,0.00,1.00, 
Seq_321,0.00,0.00,1.00,1.40,1.67,1.40,0.00,1.00,1.00,1.00,0.00,1.00,1.00,1.00,1.33,1.00,1.67,0.00,0.00,0.00, 
Seq_322,0.00,1.29,1.00,1.00,1.00,1.33,1.00,1.00,1.36,1.00,1.00,0.00,1.50,1.00,1.00,1.50,0.00,0.00,1.00,1.00, 
Seq_323,1.00,0.00,1.00,0.00,1.00,1.00,0.00,1.00,0.00,0.00,0.00,1.00,1.00,1.00,1.00,1.00,1.00,1.00,0.00,0.00, 
Seq_324,1.00,1.00,1.00,1.00,1.00,1.00,0.00,1.29,1.67,1.00,1.00,1.00,1.00,0.00,1.00,0.00,1.00,1.00,0.00,0.00, 
Seq_325,0.00,0.00,0.00,0.00,0.00,1.00,1.00,0.00,1.00,1.00,0.00,1.50,1.00,0.00,1.00,0.00,1.00,1.00,0.00,0.00, 
Seq_326,0.00,1.00,0.00,0.00,1.00,2.14,0.00,0.00,0.00,1.00,0.00,0.00,0.00,0.00,2.00,0.00,0.00,1.00,0.00,1.00, 
Seq_327,1.00,0.00,0.00,0.00,0.00,1.00,1.00,1.00,1.00,1.00,1.00,0.00,0.00,0.00,0.00,0.00,1.67,1.00,0.00,0.00, 
Seq_328,1.00,0.00,0.00,1.00,0.00,1.00,1.00,1.00,1.00,1.40,0.00,0.00,1.00,0.00,0.00,1.00,0.00,1.44,0.00,0.00, 
Seq_329,0.00,1.55,0.00,0.00,1.00,1.40,0.00,1.00,1.00,0.00,0.00,0.00,1.00,0.00,1.00,0.00,1.00,1.00,0.00,0.00, 
Seq_330,1.20,1.00,1.00,1.00,1.00,1.18,1.00,1.00,1.00,1.00,0.00,1.40,1.00,1.00,1.00,1.20,1.00,1.00,1.00,1.00, 
Seq_331,1.24,1.00,1.00,1.00,0.00,1.00,1.00,1.00,1.00,1.00,1.00,1.00,1.00,0.00,1.00,1.00,1.00,1.00,1.00,1.00, 
Seq_332,1.00,0.00,1.00,1.00,0.00,1.00,0.00,0.00,0.00,1.00,0.00,0.00,1.00,0.00,0.00,1.00,0.00,1.00,0.00,0.00, 
Seq_333,1.00,0.00,0.00,1.00,1.00,1.00,0.00,1.00,1.00,1.00,0.00,1.00,0.00,0.00,0.00,1.00,0.00,1.00,0.00,0.00, 
Seq_334,1.00,1.00,0.00,0.00,1.00,1.50,0.00,1.00,0.00,0.00,0.00,1.00,1.00,1.00,1.25,1.00,0.00,1.00,0.00,1.00, 
Seq_335,0.00,0.00,0.00,0.00,0.00,1.00,0.00,1.50,1.50,1.40,0.00,0.00,0.00,0.00,0.00,1.00,1.00,0.00,0.00,0.00, 
Seq_336,1.00,0.00,1.00,0.00,1.00,1.00,0.00,1.40,1.50,1.00,0.00,1.00,0.00,0.00,0.00,1.00,0.00,1.00,0.00,0.00, 
Seq_337,1.00,1.00,1.00,0.00,0.00,1.00,0.00,0.00,1.00,1.50,0.00,0.00,0.00,0.00,1.00,1.67,0.00,1.00,1.00,1.67, 
Seq_338,1.00,1.00,1.00,1.00,1.00,1.40,0.00,1.00,1.00,1.00,0.00,1.00,0.00,0.00,1.00,1.00,1.00,1.00,1.00,0.00, 
Seq_339,0.00,1.00,0.00,0.00,0.00,1.00,0.00,0.00,0.00,0.00,0.00,0.00,0.00,0.00,1.50,0.00,0.00,1.00,0.00,0.00, 
Seq_340,1.00,0.00,1.00,0.00,1.00,1.00,0.00,1.00,1.67,1.00,0.00,0.00,0.00,0.00,0.00,0.00,1.00,1.50,0.00,0.00, 
Seq_341,0.00,1.29,0.00,0.00,1.00,1.00,0.00,1.00,0.00,1.00,0.00,1.00,1.00,1.00,1.00,1.00,1.00,1.67,0.00,1.00, 
Seq_342,0.00,1.00,0.00,0.00,1.00,1.40,0.00,1.00,0.00,1.00,0.00,0.00,0.00,0.00,1.00,0.00,0.00,1.00,1.00,1.00, 
Seq_343,1.00,1.29,1.00,1.00,1.00,1.00,0.00,1.00,1.40,1.40,0.00,1.00,1.00,1.00,1.00,1.00,1.00,0.00,1.00,1.00, 
Seq_344,1.00,0.00,1.00,1.00,1.00,1.00,1.00,0.00,1.00,1.50,1.00,1.00,1.00,1.00,1.00,1.67,0.00,1.00,0.00,1.00, 
Seq_345,1.40,1.00,1.00,1.00,1.00,1.40,1.00,1.00,1.00,1.00,1.00,1.40,1.00,0.00,1.00,1.00,0.00,1.00,1.00,1.00, 
Seq_346,1.00,1.00,1.00,0.00,1.00,1.36,1.00,1.00,1.00,1.00,1.00,1.00,1.00,0.00,0.00,1.00,0.00,1.00,1.00,1.00, 
Seq_347,1.00,0.00,0.00,0.00,1.00,1.00,0.00,1.00,1.67,1.33,0.00,0.00,1.00,0.00,0.00,1.00,0.00,1.00,0.00,0.00, 
Seq_348,0.00,1.00,0.00,1.00,1.00,1.00,1.00,1.00,0.00,0.00,0.00,0.00,1.00,0.00,0.00,1.00,1.00,1.00,0.00,0.00, 
Seq_349,1.00,0.00,1.00,0.00,1.00,1.00,0.00,1.00,1.33,1.00,1.00,1.00,1.00,1.00,1.00,1.00,1.00,0.00,1.00,1.00, 
Seq_350,1.00,1.00,1.00,1.29,1.00,1.18,1.00,1.00,1.15,1.00,1.00,1.33,1.00,1.00,0.00,1.00,1.00,1.50,1.00,1.00, 
Seq_351,1.00,0.00,1.00,1.00,0.00,0.00,1.00,1.00,1.00,1.25,0.00,1.00,0.00,1.00,1.00,1.00,0.00,0.00,0.00,0.00, 
Seq_352,1.00,0.00,1.33,1.00,1.00,1.38,1.00,1.00,1.00,1.00,0.00,1.00,1.00,1.25,1.33,2.20,1.00,1.00,1.00,1.00, 
Seq_353,1.00,1.00,1.00,1.00,1.00,1.00,1.00,1.00,1.00,1.00,0.00,1.00,1.50,1.00,1.00,1.00,1.00,1.00,1.00,1.50, 
Seq_354,0.00,0.00,1.00,1.00,1.00,0.00,1.00,0.00,1.00,1.00,0.00,0.00,1.00,1.00,1.57,1.00,0.00,0.00,1.00,0.00, 
Seq_355,1.00,0.00,0.00,0.00,0.00,0.00,0.00,1.00,1.40,1.00,0.00,0.00,0.00,0.00,0.00,1.00,0.00,1.00,1.00,0.00, 
Seq_356,1.00,1.00,0.00,1.00,0.00,1.00,0.00,1.00,1.00,0.00,0.00,1.00,1.00,0.00,1.00,1.00,1.00,1.00,1.00,1.00, 
Seq_357,1.00,1.00,1.00,1.00,0.00,1.00,1.00,1.00,1.00,1.00,0.00,1.67,1.29,1.00,1.00,1.00,1.00,1.00,1.00,1.00, 
Seq_358,1.00,1.00,1.00,1.00,1.00,1.00,1.00,1.00,1.00,1.00,1.00,1.00,1.00,1.00,1.00,1.00,1.00,1.00,1.00,1.00, 
Seq_359,0.00,0.00,0.00,0.00,1.00,1.00,0.00,1.67,1.00,1.00,0.00,0.00,0.00,0.00,1.00,0.00,1.00,1.00,0.00,0.00, 
Seq_360,1.40,1.00,1.00,1.00,1.00,1.00,0.00,1.00,1.00,1.29,0.00,0.00,1.00,0.00,0.00,0.00,1.00,1.00,0.00,0.00, 
Seq_361,1.00,1.29,0.00,0.00,1.00,1.00,0.00,1.00,0.00,1.00,0.00,0.00,1.00,1.00,1.33,1.00,0.00,1.00,1.00,0.00, 
Seq_362,1.00,1.00,0.00,0.00,1.00,1.67,0.00,1.00,1.50,1.00,1.00,0.00,1.00,0.00,0.00,0.00,1.00,1.00,0.00,0.00, 
Seq_363,1.00,0.00,0.00,0.00,1.00,1.00,1.00,1.00,1.50,1.40,1.00,0.00,1.00,1.00,1.40,1.00,1.67,1.00,0.00,1.00, 
Seq_364,1.00,1.00,0.00,0.00,0.00,1.00,0.00,1.67,1.40,1.25,0.00,1.00,0.00,0.00,1.00,0.00,0.00,0.00,0.00,0.00, 
Seq_365,1.00,1.00,0.00,0.00,1.67,1.00,0.00,1.00,1.67,1.00,0.00,0.00,1.00,1.00,0.00,1.00,1.00,1.00,0.00,1.00, 
Seq_366,0.00,1.00,0.00,0.00,0.00,1.00,0.00,1.00,0.00,0.00,0.00,0.00,0.00,0.00,1.33,0.00,0.00,0.00,0.00,0.00, 
Seq_367,1.50,1.00,1.00,0.00,0.00,1.00,0.00,1.00,1.00,1.00,0.00,1.00,0.00,1.00,0.00,1.50,1.00,1.00,0.00,1.00, 
Seq_368,1.00,0.00,0.00,1.00,0.00,1.00,0.00,1.00,1.40,1.00,0.00,1.00,0.00,0.00,0.00,1.00,0.00,1.00,1.00,0.00, 
Seq_369,0.00,0.00,1.00,1.00,0.00,1.00,1.00,1.00,1.00,1.00,0.00,0.00,1.00,1.00,1.33,1.33,1.00,1.00,1.00,1.00, 
Seq_370,0.00,0.00,0.00,0.00,1.00,1.00,1.00,1.00,1.00,1.40,0.00,0.00,1.50,0.00,0.00,1.00,0.00,1.00,0.00,0.00, 
Seq_371,1.00,1.00,0.00,0.00,1.00,1.00,0.00,1.00,1.57,1.00,1.00,1.00,0.00,1.00,1.00,1.00,0.00,1.00,0.00,1.00, 
Seq_372,0.00,1.00,1.00,1.42,0.00,0.00,1.00,0.00,1.00,0.00,1.00,1.00,1.00,1.70,1.29,0.00,1.00,0.00,0.00,1.00, 
Seq_373,1.67,1.00,0.00,0.00,1.00,1.00,0.00,1.00,1.00,1.00,0.00,0.00,1.50,0.00,1.00,1.00,1.00,0.00,1.00,0.00, 
Seq_374,1.00,0.00,0.00,0.00,1.00,1.00,0.00,0.00,0.00,1.00,0.00,0.00,1.00,0.00,1.00,1.00,0.00,1.00,0.00,0.00, 
Seq_375,1.00,1.00,1.57,1.73,1.00,1.33,1.67,1.00,1.47,1.15,1.00,1.00,1.00,0.00,0.00,1.00,1.00,1.00,1.00,0.00, 
Seq_376,1.00,1.00,1.00,0.00,1.00,1.40,0.00,1.00,0.00,1.00,0.00,1.00,1.00,1.00,1.22,1.00,1.00,1.00,0.00,1.00, 
Seq_377,1.50,1.00,0.00,0.00,1.00,1.00,0.00,1.00,0.00,1.00,0.00,0.00,1.00,1.00,0.00,1.00,1.00,1.00,0.00,0.00, 
Seq_378,0.00,0.00,0.00,0.00,0.00,1.00,0.00,1.00,1.00,1.33,0.00,0.00,0.00,0.00,0.00,1.00,1.00,0.00,0.00,0.00, 
Seq_379,0.00,1.22,1.33,1.00,1.00,1.00,0.00,1.00,1.22,1.00,0.00,1.00,1.22,1.50,1.00,1.00,0.00,1.00,0.00,1.00, 
Seq_380,1.00,1.29,1.00,1.00,1.50,1.00,1.00,1.00,1.22,1.00,0.00,1.00,1.00,0.00,1.00,1.00,1.00,1.00,1.00,1.00, 
Seq_381,0.00,0.00,0.00,1.00,1.00,1.00,0.00,0.00,1.00,1.00,0.00,0.00,0.00,0.00,0.00,1.00,0.00,1.50,1.00,0.00, 
Seq_382,1.00,1.00,1.00,0.00,1.00,1.00,0.00,1.00,1.00,0.00,0.00,1.00,1.15,0.00,1.00,1.00,0.00,0.00,1.00,1.00, 
Seq_383,1.00,1.40,0.00,0.00,1.00,1.00,0.00,0.00,1.00,0.00,0.00,1.00,1.00,0.00,0.00,1.00,1.00,0.00,1.00,1.00, 
Seq_384,1.00,1.00,1.00,1.00,1.00,1.40,1.00,1.00,1.50,1.00,0.00,1.00,0.00,1.00,1.00,1.00,1.00,1.00,0.00,0.00, 
Seq_385,1.00,0.00,1.00,0.00,1.00,1.00,0.00,1.00,1.00,1.00,1.00,1.00,0.00,1.00,1.00,1.00,0.00,1.00,0.00,0.00, 
Seq_386,1.00,1.00,1.00,0.00,1.00,1.00,1.00,1.33,1.00,0.00,1.00,1.00,1.00,1.00,1.40,1.44,1.50,0.00,0.00,1.00, 
Seq_387,1.67,1.00,0.00,1.00,1.00,1.00,0.00,1.00,1.00,0.00,0.00,1.00,1.00,0.00,1.00,1.00,0.00,1.00,0.00,1.00, 
Seq_388,1.00,1.00,1.00,0.00,0.00,1.00,1.00,1.00,1.00,1.00,1.00,1.00,0.00,0.00,0.00,0.00,1.00,1.00,0.00,0.00, 
Seq_389,1.50,1.00,1.00,1.00,1.00,1.00,0.00,1.00,1.00,1.00,0.00,0.00,1.00,0.00,0.00,0.00,1.00,1.00,0.00,0.00, 
Seq_390,0.00,0.00,0.00,0.00,0.00,1.00,0.00,1.50,1.33,1.00,0.00,1.00,0.00,0.00,0.00,0.00,0.00,1.50,1.00,0.00, 
Seq_391,1.40,0.00,0.00,0.00,0.00,1.00,1.00,1.00,1.33,1.00,0.00,0.00,0.00,1.00,1.00,1.00,0.00,0.00,1.00,0.00, 
Seq_392,1.00,0.00,0.00,0.00,0.00,1.00,1.00,0.00,1.00,1.29,0.00,0.00,1.00,0.00,1.33,1.00,1.00,0.00,1.00,0.00, 
Seq_393,1.00,0.00,1.00,1.40,1.00,1.29,0.00,0.00,1.31,1.25,1.00,0.00,1.00,1.00,1.00,1.00,0.00,1.00,1.00,1.00, 
Seq_394,1.00,0.00,0.00,0.00,1.00,0.00,1.00,1.00,1.44,1.00,0.00,0.00,0.00,0.00,0.00,1.00,0.00,0.00,1.00,0.00, 
Seq_395,0.00,0.00,1.00,0.00,0.00,1.00,0.00,1.00,1.00,1.00,0.00,1.00,1.33,0.00,1.00,1.00,1.00,1.00,0.00,1.00, 
Seq_396,0.00,0.00,0.00,0.00,1.00,1.00,0.00,0.00,0.00,1.00,0.00,0.00,0.00,1.00,1.00,1.00,0.00,1.00,0.00,0.00, 
Seq_397,1.00,0.00,0.00,1.00,0.00,1.00,0.00,1.00,1.00,1.00,0.00,0.00,1.00,1.67,0.00,1.00,1.00,0.00,0.00,0.00, 
Seq_398,1.67,0.00,0.00,0.00,0.00,1.00,0.00,1.00,1.00,1.67,0.00,1.00,1.00,0.00,0.00,1.00,0.00,1.00,0.00,0.00, 
Seq_399,0.00,1.00,0.00,1.00,1.00,1.00,0.00,1.00,0.00,1.00,0.00,1.00,1.00,0.00,0.00,1.40,1.00,1.00,0.00,1.00, 
Seq_400,1.50,1.00,0.00,0.00,1.00,0.00,1.00,1.00,1.00,0.00,0.00,1.00,1.00,0.00,1.00,0.00,1.00,1.00,0.00,0.00, 
Seq_401,0.00,1.00,1.00,0.00,1.00,1.00,0.00,0.00,1.00,0.00,0.00,1.00,1.00,1.00,0.00,1.00,1.00,1.00,0.00,0.00, 
Seq_402,1.20,0.00,1.00,1.00,1.00,1.00,0.00,1.00,1.20,1.25,1.00,1.00,1.00,1.50,1.00,1.00,0.00,1.00,0.00,0.00, 
Seq_403,1.00,1.00,1.00,0.00,1.00,1.00,0.00,1.00,1.40,1.00,0.00,0.00,1.00,1.00,1.00,1.00,1.00,1.00,0.00,0.00, 
Seq_404,0.00,0.00,0.00,0.00,1.00,1.00,1.50,1.00,1.00,0.00,0.00,1.00,0.00,1.00,0.00,0.00,0.00,1.50,0.00,0.00, 
Seq_405,1.44,0.00,1.00,1.00,1.00,1.00,1.00,1.00,1.00,1.00,0.00,1.00,0.00,1.40,1.00,0.00,1.00,1.00,1.00,0.00, 
Seq_406,1.00,1.00,1.00,1.00,0.00,1.00,0.00,1.00,1.00,1.00,0.00,1.00,1.00,0.00,0.00,1.00,1.00,1.00,1.00,1.00, 
Seq_407,1.00,1.29,1.00,1.00,1.00,1.00,1.00,1.00,1.00,1.00,0.00,1.00,1.00,1.00,1.00,1.00,1.00,1.33,0.00,1.00, 
Seq_408,1.00,0.00,0.00,0.00,1.00,1.00,1.00,0.00,1.40,0.00,0.00,1.00,0.00,0.00,0.00,1.00,1.00,1.00,0.00,0.00, 
Seq_409,1.40,1.00,0.00,0.00,1.00,1.00,0.00,1.40,1.40,1.00,0.00,0.00,1.00,0.00,0.00,1.00,0.00,1.00,0.00,0.00, 
Seq_410,0.00,1.00,0.00,0.00,1.00,0.00,0.00,1.00,0.00,0.00,1.00,0.00,1.00,0.00,1.00,0.00,1.00,0.00,0.00,1.00, 
Seq_411,1.00,1.25,0.00,1.00,0.00,1.00,1.00,1.00,1.40,1.00,0.00,1.33,1.00,1.00,1.00,0.00,0.00,1.00,1.00,1.00, 
Seq_412,0.00,1.00,0.00,0.00,1.00,0.00,0.00,0.00,1.00,0.00,1.00,0.00,0.00,1.00,1.50,0.00,0.00,0.00,1.00,0.00, 
Seq_413,1.00,0.00,1.00,0.00,0.00,1.00,1.00,1.00,1.00,1.40,0.00,0.00,0.00,0.00,0.00,1.00,0.00,1.00,0.00,0.00, 
Seq_414,1.40,1.00,1.00,1.00,1.00,1.00,0.00,1.00,1.40,1.00,1.00,1.00,1.00,1.29,1.14,1.00,1.00,1.00,1.00,1.00, 
Seq_415,1.89,1.00,0.00,1.00,1.00,1.33,0.00,1.00,1.22,1.00,1.00,1.00,1.00,1.00,1.00,1.29,1.00,1.29,1.00,2.43, 
Seq_416,1.00,0.00,1.00,0.00,1.00,1.00,0.00,0.00,1.00,1.00,0.00,1.00,0.00,0.00,0.00,1.00,0.00,1.40,0.00,0.00, 
Seq_417,1.00,0.00,0.00,0.00,1.00,1.00,1.00,1.00,1.00,1.00,0.00,1.00,0.00,0.00,1.00,1.00,1.00,1.00,1.00,0.00, 
Seq_418,1.00,0.00,0.00,0.00,1.40,1.00,1.00,0.00,1.00,1.33,0.00,0.00,1.00,0.00,0.00,1.67,0.00,0.00,0.00,0.00, 
Seq_419,1.00,0.00,0.00,1.00,0.00,1.00,0.00,0.00,0.00,1.00,0.00,0.00,1.00,0.00,1.00,0.00,0.00,1.00,0.00,1.00, 
Seq_420,1.00,0.00,0.00,0.00,1.00,0.00,0.00,0.00,0.00,1.50,0.00,0.00,1.00,0.00,1.00,1.00,0.00,0.00,0.00,0.00, 
Seq_421,1.00,1.00,0.00,1.00,0.00,0.00,0.00,1.50,1.00,1.00,1.00,1.00,1.00,1.00,1.00,1.00,1.00,0.00,1.00,1.00, 
Seq_422,0.00,1.29,0.00,0.00,1.00,1.00,0.00,1.00,0.00,1.00,0.00,1.00,1.00,1.00,1.29,0.00,1.33,1.00,0.00,1.00, 
Seq_423,1.00,1.00,0.00,0.00,1.00,1.00,0.00,1.00,1.50,1.00,1.00,0.00,1.00,1.00,1.57,1.00,1.00,1.00,1.00,0.00, 
Seq_424,1.00,1.00,0.00,0.00,0.00,1.00,0.00,0.00,0.00,1.00,0.00,0.00,0.00,0.00,1.29,0.00,0.00,1.00,1.00,1.00, 
Seq_425,1.00,1.00,1.00,0.00,1.00,1.00,1.00,1.00,1.00,1.50,0.00,0.00,1.00,0.00,1.00,1.00,1.00,1.00,0.00,0.00, 
Seq_426,1.00,0.00,0.00,0.00,1.00,1.00,0.00,1.50,0.00,1.00,0.00,0.00,1.00,0.00,0.00,1.00,0.00,0.00,0.00,0.00, 
Seq_427,1.00,0.00,0.00,0.00,1.00,1.00,0.00,0.00,1.50,1.40,1.00,0.00,0.00,0.00,0.00,0.00,0.00,1.00,0.00,0.00, 
Seq_428,0.00,0.00,0.00,0.00,1.00,1.00,1.40,1.67,1.00,1.00,0.00,1.00,0.00,1.00,0.00,1.00,0.00,1.00,0.00,0.00, 
Seq_429,0.00,0.00,0.00,0.00,1.00,0.00,1.00,0.00,1.00,1.00,0.00,0.00,1.00,0.00,0.00,1.00,1.00,0.00,0.00,0.00, 
Seq_430,0.00,0.00,0.00,1.00,1.00,1.00,0.00,1.00,1.40,1.40,1.00,1.00,0.00,1.00,1.00,1.00,0.00,1.00,1.00,0.00, 
Seq_431,1.00,1.29,1.00,1.00,0.00,1.00,1.00,1.00,1.00,1.00,0.00,0.00,0.00,1.00,1.40,1.00,1.00,0.00,1.00,1.00, 
Seq_432,1.18,0.00,1.00,0.00,1.00,1.00,1.00,1.00,1.00,1.00,1.00,1.00,1.00,1.00,1.00,1.67,1.00,1.00,0.00,0.00, 
Seq_433,1.00,0.00,0.00,0.00,1.67,1.00,1.00,1.00,1.00,1.00,0.00,0.00,0.00,0.00,2.33,0.00,0.00,0.00,1.00,0.00, 
Seq_434,1.00,1.00,1.00,0.00,1.00,1.00,0.00,0.00,0.00,1.00,0.00,1.00,0.00,0.00,0.00,1.00,0.00,1.50,1.00,1.00, 
Seq_435,1.57,0.00,1.00,1.00,1.00,1.00,1.00,1.00,1.00,1.00,0.00,0.00,0.00,1.00,0.00,0.00,0.00,1.00,0.00,0.00, 
Seq_436,1.40,0.00,0.00,0.00,0.00,0.00,0.00,1.00,1.40,1.40,0.00,0.00,0.00,0.00,1.00,0.00,0.00,1.00,0.00,0.00, 
Seq_437,1.00,0.00,1.44,1.00,0.00,1.62,1.00,1.00,1.50,1.00,1.00,1.00,1.00,1.00,1.00,1.00,1.00,1.00,1.00,1.00, 
Seq_438,0.00,0.00,1.00,0.00,1.00,1.00,0.00,1.00,1.00,1.00,0.00,1.00,1.00,0.00,1.50,1.00,1.00,1.00,1.00,0.00, 
Seq_439,1.00,0.00,1.00,0.00,1.00,1.00,0.00,1.00,1.00,1.00,0.00,1.00,0.00,1.00,1.00,1.00,1.00,1.00,0.00,0.00, 
Seq_440,1.00,1.00,1.00,1.00,1.50,1.00,0.00,0.00,1.00,1.00,0.00,1.00,1.00,1.00,1.00,1.00,1.00,1.00,0.00,0.00, 
Seq_441,1.00,0.00,0.00,0.00,1.00,1.00,0.00,1.00,1.67,1.00,0.00,0.00,1.00,0.00,0.00,1.00,1.00,1.00,1.00,0.00, 
Seq_442,1.00,0.00,0.00,0.00,0.00,1.00,0.00,0.00,0.00,0.00,1.00,0.00,0.00,0.00,0.00,0.00,1.00,1.00,0.00,0.00, 
Seq_443,1.00,0.00,0.00,1.00,1.00,1.40,0.00,0.00,1.00,1.33,0.00,0.00,1.00,0.00,0.00,1.00,0.00,1.00,0.00,1.00, 
Seq_444,0.00,1.00,0.00,1.00,1.00,3.00,0.00,1.00,0.00,1.00,0.00,0.00,1.00,0.00,0.00,1.00,1.00,1.00,0.00,0.00, 
Seq_445,1.00,1.00,0.00,0.00,1.00,1.00,0.00,1.00,1.33,1.00,0.00,1.00,0.00,1.00,0.00,1.00,1.00,1.00,0.00,0.00, 
Seq_446,1.00,1.00,1.00,0.00,1.00,1.33,1.00,1.00,1.00,1.00,0.00,0.00,0.00,0.00,1.00,1.00,1.67,1.00,0.00,1.00, 
Seq_447,1.00,0.00,1.00,1.00,0.00,1.00,0.00,1.00,1.00,1.00,0.00,1.00,1.00,1.00,1.29,0.00,0.00,1.00,0.00,0.00, 
Seq_448,0.00,1.00,0.00,0.00,1.00,1.00,0.00,0.00,1.00,0.00,0.00,0.00,0.00,0.00,1.33,0.00,0.00,1.00,1.00,1.00, 
Seq_449,2.00,1.00,0.00,0.00,1.00,1.00,0.00,1.00,1.40,1.00,0.00,0.00,1.00,0.00,0.00,1.00,0.00,1.00,0.00,0.00, 
Seq_450,1.00,1.00,1.00,1.00,0.00,1.29,1.00,1.00,1.33,1.00,1.00,1.00,0.00,0.00,1.00,1.00,1.33,1.00,1.00,1.00, 
Seq_451,0.00,1.33,0.00,1.00,0.00,2.00,1.00,1.00,0.00,0.00,0.00,0.00,1.00,0.00,0.00,1.00,1.00,1.00,1.00,0.00, 
Seq_452,1.00,0.00,0.00,0.00,1.00,0.00,0.00,0.00,1.91,1.33,0.00,0.00,0.00,0.00,1.00,1.00,0.00,0.00,0.00,1.00, 
Seq_453,1.00,1.00,0.00,1.00,1.00,1.00,0.00,0.00,1.00,1.00,0.00,1.00,1.00,1.00,0.00,1.50,1.00,1.00,0.00,1.00, 
Seq_454,1.00,1.29,1.00,0.00,1.00,1.50,1.00,1.00,1.00,1.00,0.00,0.00,1.00,1.00,1.00,1.29,1.00,1.00,1.00,0.00, 
Seq_455,1.00,0.00,0.00,1.00,0.00,1.33,0.00,1.00,1.00,1.00,0.00,1.00,1.00,0.00,0.00,0.00,0.00,1.00,0.00,0.00, 
Seq_456,1.00,0.00,0.00,0.00,0.00,1.00,1.00,1.40,1.50,1.00,0.00,0.00,1.00,0.00,1.29,0.00,1.00,1.00,0.00,1.00, 
Seq_457,1.00,0.00,1.00,1.00,1.00,1.00,1.00,1.33,1.00,2.14,1.00,0.00,1.00,1.50,1.00,1.00,1.00,1.00,0.00,0.00, 
Seq_458,1.00,1.00,1.00,1.00,0.00,1.29,1.00,1.00,1.33,1.50,1.00,1.00,0.00,1.00,1.40,1.00,1.33,0.00,1.00,1.00, 
Seq_459,1.00,0.00,0.00,0.00,0.00,1.00,0.00,0.00,0.00,1.00,0.00,0.00,0.00,0.00,0.00,0.00,0.00,2.14,1.00,0.00, 
Seq_460,1.00,1.00,0.00,1.00,0.00,1.00,0.00,1.00,1.00,0.00,0.00,1.00,1.00,0.00,1.00,1.33,0.00,1.00,1.00,1.00, 
Seq_461,0.00,1.00,0.00,0.00,0.00,1.00,0.00,1.00,0.00,0.00,0.00,0.00,0.00,0.00,1.00,0.00,0.00,0.00,0.00,0.00, 
Seq_462,0.00,1.00,1.00,1.00,1.00,1.00,1.00,1.00,1.00,1.00,0.00,1.00,1.00,0.00,0.00,1.00,1.00,1.00,1.00,1.00, 
Seq_463,1.00,1.00,1.67,1.40,0.00,1.00,1.00,0.00,1.00,1.00,0.00,1.00,1.00,0.00,1.40,1.33,1.00,1.00,1.00,1.00, 
Seq_464,1.00,1.00,1.67,1.00,0.00,0.00,1.67,1.00,1.67,1.40,0.00,1.00,0.00,0.00,1.67,0.00,0.00,1.00,0.00,0.00, 
Seq_465,1.00,0.00,0.00,1.00,0.00,1.00,0.00,1.00,1.00,1.50,0.00,0.00,0.00,0.00,0.00,0.00,1.00,1.00,1.00,0.00, 
Seq_466,1.00,0.00,0.00,0.00,1.00,1.00,0.00,1.00,1.67,1.00,1.00,1.67,0.00,0.00,0.00,0.00,1.00,0.00,0.00,0.00, 
Seq_467,1.00,0.00,1.00,0.00,1.00,1.00,0.00,1.00,1.67,1.00,0.00,0.00,0.00,0.00,0.00,1.00,0.00,1.50,0.00,0.00, 
Seq_468,1.44,0.00,1.00,1.59,1.00,1.00,1.00,1.00,1.33,1.00,1.00,1.00,1.00,1.00,1.00,1.00,1.00,1.00,0.00,1.00, 
Seq_469,1.00,1.00,1.00,1.00,1.67,1.00,1.00,1.00,1.20,1.29,1.00,1.00,1.33,0.00,1.25,1.00,1.00,1.00,1.00,1.00, 
Seq_470,0.00,0.00,0.00,1.00,1.00,1.00,0.00,0.00,0.00,0.00,1.00,0.00,0.00,0.00,0.00,1.00,1.00,1.00,0.00,1.00, 
Seq_471,1.00,0.00,1.00,1.00,1.00,1.00,0.00,1.00,1.20,1.00,0.00,1.00,1.00,1.00,1.00,0.00,1.00,1.00,0.00,1.00, 
Seq_472,0.00,0.00,0.00,1.00,1.00,1.00,1.00,0.00,1.00,0.00,1.00,0.00,1.00,0.00,1.00,1.00,0.00,1.00,1.00,1.00, 
Seq_473,0.00,1.29,1.50,0.00,1.00,1.36,1.00,1.00,0.00,1.50,0.00,0.00,1.00,0.00,1.00,1.40,1.00,1.00,1.00,0.00, 
Seq_474,1.00,1.00,1.00,1.00,1.00,1.00,0.00,1.00,1.00,1.00,0.00,1.29,1.00,1.00,1.00,1.00,1.00,1.00,1.00,1.00, 
Seq_475,0.00,0.00,0.00,0.00,1.00,1.00,0.00,1.00,1.00,1.00,0.00,0.00,1.00,0.00,0.00,0.00,1.00,0.00,0.00,0.00, 
Seq_476,1.00,0.00,0.00,0.00,1.00,1.00,0.00,1.67,1.67,1.00,0.00,0.00,1.00,0.00,0.00,0.00,1.00,0.00,0.00,1.00, 
Seq_477,1.00,1.00,1.00,1.00,1.00,1.00,1.00,1.00,1.25,1.00,0.00,1.00,1.00,1.00,1.00,1.00,0.00,1.00,0.00,1.00, 
Seq_478,1.00,0.00,0.00,0.00,1.00,0.00,1.00,1.00,1.00,1.00,0.00,1.00,1.00,0.00,0.00,1.00,0.00,1.00,0.00,0.00, 
Seq_479,1.00,1.00,1.67,1.00,1.00,1.00,0.00,1.00,1.00,1.00,1.00,0.00,1.00,1.00,1.25,1.00,1.00,1.00,1.00,0.00, 
Seq_480,0.00,1.00,0.00,0.00,0.00,1.00,0.00,1.00,1.00,1.00,1.00,1.00,1.00,1.00,1.00,1.00,1.00,1.00,0.00,0.00, 
Seq_481,1.29,1.15,1.00,1.00,0.00,1.29,1.00,1.00,1.40,1.00,0.00,1.00,1.33,0.00,1.00,1.33,1.29,1.00,0.00,1.00, 
Seq_482,1.00,1.00,0.00,1.00,0.00,1.00,1.00,1.00,1.00,1.00,1.00,1.00,1.00,1.00,1.00,1.00,1.00,0.00,1.00,1.00, 
Seq_483,0.00,0.00,0.00,0.00,1.00,1.00,0.00,1.00,1.00,1.33,0.00,0.00,1.00,0.00,0.00,1.00,0.00,1.00,0.00,0.00, 
Seq_484,0.00,0.00,1.00,1.50,1.00,1.00,1.46,0.00,1.00,1.00,0.00,1.00,0.00,0.00,1.00,1.00,0.00,0.00,0.00,1.00, 
Seq_485,1.57,1.00,1.00,1.00,1.00,1.33,1.00,1.00,1.00,1.00,0.00,1.00,0.00,0.00,1.00,1.00,1.00,1.00,0.00,1.00, 
Seq_486,1.00,1.00,1.00,1.00,1.00,1.00,0.00,1.00,1.14,0.00,0.00,1.44,1.00,0.00,0.00,1.00,1.00,1.00,0.00,1.00, 
Seq_487,1.33,1.00,0.00,1.00,1.00,1.33,1.00,1.00,1.00,1.00,1.00,1.00,1.00,0.00,1.00,1.00,1.00,1.00,1.00,1.00, 
Seq_488,1.00,1.00,1.00,1.00,1.00,1.00,1.00,0.00,1.00,0.00,1.00,0.00,0.00,1.00,0.00,1.00,0.00,0.00,0.00,0.00, 
Seq_489,1.00,0.00,1.00,0.00,1.00,1.00,0.00,1.00,1.00,1.50,0.00,0.00,0.00,1.00,0.00,0.00,1.00,1.00,0.00,0.00, 
Seq_490,1.50,0.00,1.00,1.00,0.00,1.00,0.00,1.00,1.00,1.00,0.00,0.00,0.00,1.00,0.00,1.00,0.00,1.00,1.00,0.00, 
Seq_491,0.00,0.00,1.00,1.00,1.00,1.00,1.00,0.00,0.00,1.00,1.00,0.00,1.00,0.00,0.00,0.00,0.00,1.00,0.00,0.00, 
Seq_492,1.00,1.29,0.00,0.00,1.00,1.33,1.00,1.00,1.00,0.00,0.00,0.00,1.00,1.00,1.00,1.00,1.00,1.00,0.00,1.00, 
Seq_493,1.00,0.00,1.00,0.00,1.50,0.00,0.00,1.00,1.00,0.00,1.00,1.00,1.00,1.00,1.00,1.00,1.00,1.00,0.00,0.00, 
Seq_494,0.00,0.00,0.00,0.00,0.00,1.00,0.00,1.00,1.00,1.67,0.00,1.00,1.00,0.00,0.00,1.00,0.00,1.00,0.00,0.00, 
Seq_495,1.00,0.00,0.00,0.00,1.00,1.00,0.00,1.00,1.00,1.57,0.00,0.00,0.00,0.00,0.00,1.00,1.00,0.00,0.00,0.00, 
Seq_496,1.00,1.00,1.00,0.00,1.00,1.00,0.00,1.00,0.00,0.00,1.00,0.00,1.40,1.00,1.44,1.00,1.00,1.00,0.00,1.00, 
Seq_497,1.00,1.00,1.00,0.00,1.00,1.00,1.00,1.00,1.00,1.00,1.00,1.50,1.00,1.00,1.00,1.00,1.00,1.00,0.00,1.00, 
Seq_498,1.00,1.00,1.00,0.00,1.00,1.00,1.00,1.00,1.00,1.00,0.00,1.00,1.00,0.00,1.00,0.00,1.00,0.00,1.00,0.00, 
Seq_499,1.00,1.00,1.00,1.00,1.00,1.00,0.00,1.25,1.00,1.00,1.00,1.33,1.00,0.00,0.00,1.00,1.00,1.00,0.00,0.00, 
Seq_500,1.00,1.00,0.00,0.00,0.00,1.00,0.00,1.00,1.73,1.00,0.00,0.00,1.00,0.00,1.00,0.00,0.00,1.00,0.00,0.00, 
Seq_501,0.00,1.00,0.00,0.00,1.00,0.00,0.00,1.00,1.00,1.00,1.00,1.00,1.00,0.00,1.00,1.00,1.00,1.00,1.00,0.00, 
Seq_502,1.00,0.00,0.00,0.00,0.00,1.33,0.00,1.50,1.50,1.00,0.00,0.00,1.00,0.00,1.00,1.00,0.00,1.00,1.00,1.00, 
Seq_503,1.40,1.00,0.00,0.00,1.00,1.00,0.00,1.40,1.50,1.00,1.00,0.00,1.00,0.00,0.00,0.00,1.00,1.00,0.00,0.00, 
Seq_504,1.00,0.00,1.00,0.00,1.00,1.00,1.00,1.00,1.67,1.00,0.00,0.00,0.00,0.00,0.00,1.00,0.00,1.00,0.00,0.00, 
Seq_505,2.33,0.00,0.00,1.67,1.00,1.00,0.00,0.00,1.40,1.00,0.00,0.00,0.00,1.00,2.00,1.00,0.00,1.00,0.00,0.00, 
Seq_506,0.00,0.00,0.00,0.00,1.00,0.00,0.00,0.00,0.00,1.00,0.00,0.00,1.00,0.00,1.67,0.00,0.00,1.00,2.33,0.00, 
Seq_507,1.00,0.00,0.00,1.00,1.00,1.00,0.00,1.00,1.00,1.00,0.00,1.00,0.00,0.00,1.00,1.00,0.00,1.00,0.00,0.00, 
Seq_508,0.00,0.00,1.50,0.00,0.00,1.00,0.00,1.00,0.00,1.00,0.00,0.00,1.00,0.00,0.00,1.00,1.00,1.00,0.00,0.00, 
Seq_509,1.00,1.00,0.00,0.00,0.00,1.00,0.00,1.00,1.00,0.00,0.00,1.00,1.00,0.00,1.00,1.00,1.00,1.40,0.00,0.00, 
Seq_510,2.00,1.00,1.00,1.00,0.00,0.00,0.00,0.00,0.00,1.50,0.00,0.00,0.00,0.00,0.00,1.00,1.00,1.00,1.00,0.00, 
Seq_511,0.00,0.00,0.00,0.00,1.00,1.00,1.00,1.00,1.00,1.00,0.00,1.00,1.14,1.00,1.00,1.00,0.00,1.00,1.00,1.00, 
Seq_512,1.00,0.00,0.00,0.00,0.00,1.00,0.00,1.67,1.33,1.00,0.00,1.00,0.00,0.00,0.00,0.00,0.00,1.00,1.00,0.00, 
Seq_513,1.00,0.00,0.00,0.00,1.00,0.00,1.00,1.00,1.40,1.00,1.00,1.00,1.00,0.00,1.00,0.00,1.00,0.00,0.00,0.00, 
Seq_514,1.50,1.00,0.00,0.00,1.00,1.00,0.00,1.33,1.40,1.00,0.00,0.00,1.00,0.00,0.00,1.00,1.00,0.00,0.00,0.00, 
Seq_515,1.00,0.00,0.00,1.00,1.29,1.00,0.00,0.00,1.44,1.00,1.00,1.00,0.00,0.00,1.50,1.00,0.00,0.00,0.00,1.00, 
Seq_516,1.00,1.00,0.00,1.00,1.00,1.00,1.00,0.00,1.00,0.00,0.00,1.00,1.00,0.00,1.00,1.00,1.67,0.00,0.00,0.00, 
Seq_517,0.00,0.00,0.00,1.00,1.00,1.00,0.00,0.00,1.00,1.00,0.00,1.00,1.67,1.00,0.00,1.00,0.00,0.00,0.00,0.00, 
Seq_518,1.00,1.00,0.00,0.00,1.00,1.00,0.00,0.00,1.00,0.00,0.00,0.00,0.00,0.00,1.29,1.00,0.00,0.00,1.00,1.00, 
Seq_519,1.00,1.55,0.00,0.00,1.00,1.00,0.00,0.00,0.00,0.00,1.00,1.00,1.00,0.00,1.00,1.00,0.00,1.00,0.00,0.00, 
Seq_520,1.00,0.00,0.00,0.00,1.00,1.00,0.00,1.00,1.00,1.00,0.00,0.00,1.00,0.00,0.00,0.00,1.00,1.00,0.00,0.00, 
Seq_521,0.00,0.00,0.00,0.00,1.00,0.00,0.00,0.00,0.00,0.00,0.00,0.00,0.00,0.00,1.50,0.00,0.00,0.00,1.67,0.00, 
Seq_522,1.00,1.00,1.00,1.22,1.00,1.00,1.00,1.22,1.29,1.00,1.00,1.00,1.00,1.25,1.00,1.36,1.00,1.00,0.00,1.00, 
Seq_523,0.00,1.00,0.00,0.00,1.00,1.00,0.00,0.00,1.00,0.00,0.00,0.00,0.00,0.00,1.29,0.00,0.00,1.00,1.00,1.00, 
Seq_524,0.00,0.00,0.00,0.00,1.00,0.00,1.00,1.00,0.00,1.00,0.00,0.00,1.92,0.00,1.44,0.00,0.00,0.00,0.00,1.00, 
Seq_525,1.50,0.00,1.00,0.00,1.00,1.00,0.00,1.00,1.00,1.00,0.00,1.00,0.00,0.00,1.00,1.00,1.00,1.00,0.00,0.00, 
Seq_526,1.86,0.00,0.00,0.00,1.00,1.44,1.00,1.00,1.33,1.00,0.00,1.00,0.00,1.00,0.00,1.00,0.00,1.00,1.00,0.00, 
Seq_527,1.00,1.29,1.00,1.00,1.00,1.25,1.00,0.00,1.00,1.00,0.00,1.00,1.29,1.00,1.00,1.00,1.00,1.00,0.00,0.00, 
Seq_528,1.00,0.00,1.00,0.00,1.00,1.00,1.00,1.00,1.67,1.00,0.00,0.00,0.00,0.00,0.00,1.67,0.00,1.00,0.00,0.00, 
Seq_529,1.00,0.00,0.00,0.00,0.00,1.00,0.00,0.00,0.00,1.00,0.00,0.00,2.33,0.00,0.00,1.00,0.00,1.00,0.00,0.00, 
Seq_530,0.00,1.00,1.00,0.00,1.00,1.50,1.00,1.67,0.00,1.00,0.00,1.40,1.00,0.00,0.00,0.00,1.33,1.40,1.67,1.00, 
Seq_531,1.36,0.00,1.00,1.00,1.00,1.00,0.00,1.00,1.00,1.00,1.00,1.00,1.00,1.00,1.00,1.25,1.00,1.00,1.00,1.67, 
Seq_532,0.00,0.00,0.00,0.00,1.00,1.00,0.00,1.50,1.67,1.00,0.00,1.00,1.00,0.00,1.00,1.00,0.00,0.00,0.00,0.00, 
Seq_533,1.00,1.00,1.00,0.00,1.00,1.00,0.00,1.00,0.00,1.00,0.00,1.00,0.00,0.00,0.00,1.00,0.00,1.67,1.00,1.00, 
Seq_534,0.00,0.00,0.00,0.00,0.00,1.57,0.00,1.00,1.00,1.33,0.00,1.00,1.00,0.00,0.00,1.00,1.00,1.00,0.00,0.00, 
Seq_535,1.00,1.00,0.00,0.00,0.00,1.00,0.00,1.00,1.00,1.00,0.00,0.00,1.00,0.00,0.00,0.00,0.00,1.00,1.00,0.00, 
Seq_536,1.00,0.00,0.00,0.00,1.00,1.00,1.00,0.00,1.00,1.00,0.00,0.00,0.00,0.00,1.33,1.00,0.00,1.00,0.00,0.00, 
Seq_537,1.00,1.00,1.00,0.00,1.40,1.50,1.00,1.00,1.40,1.00,0.00,0.00,1.00,1.00,1.00,1.00,1.00,1.00,0.00,1.50, 
Seq_538,0.00,0.00,0.00,0.00,1.33,1.00,0.00,1.00,0.00,1.00,0.00,0.00,1.71,0.00,1.62,0.00,0.00,0.00,0.00,1.00, 
Seq_539,1.00,1.00,0.00,0.00,1.00,1.25,1.00,1.50,1.00,1.00,0.00,1.00,1.00,1.00,1.40,1.00,1.00,0.00,0.00,1.00, 
Seq_540,0.00,0.00,0.00,1.00,1.00,0.00,0.00,0.00,1.00,1.00,0.00,0.00,1.50,0.00,1.00,1.00,1.00,0.00,1.00,0.00, 
Seq_541,1.00,0.00,1.00,1.00,0.00,1.22,1.00,0.00,1.25,1.25,0.00,0.00,0.00,0.00,0.00,1.40,0.00,1.00,0.00,0.00, 
Seq_542,1.00,0.00,0.00,1.00,0.00,1.00,1.00,1.00,1.00,1.33,0.00,0.00,1.00,0.00,0.00,1.00,0.00,1.29,0.00,0.00, 
Seq_543,1.00,0.00,1.00,0.00,1.00,1.00,1.00,0.00,1.00,1.00,0.00,0.00,1.00,1.00,0.00,1.00,1.50,1.00,0.00,1.00, 
Seq_544,1.00,0.00,1.00,1.50,1.40,1.00,1.00,1.00,1.00,1.00,0.00,1.50,1.00,1.00,1.00,1.00,1.00,1.50,1.00,1.00, 
Seq_545,1.00,1.29,0.00,1.00,1.00,1.00,1.00,1.00,0.00,1.00,0.00,0.00,1.00,0.00,1.50,0.00,0.00,1.67,0.00,0.00, 
Seq_546,1.67,1.00,1.00,1.00,0.00,1.29,1.00,1.00,1.00,1.29,1.00,0.00,1.00,0.00,0.00,1.00,1.00,1.00,1.00,1.00, 
Seq_547,1.00,1.00,1.00,1.00,1.00,1.15,1.00,1.00,1.22,1.00,1.00,1.40,1.00,1.00,1.00,1.00,1.00,1.00,1.00,1.00, 
Seq_548,1.00,0.00,1.00,1.00,1.00,1.67,0.00,1.00,1.00,1.00,1.00,0.00,0.00,1.00,0.00,1.00,1.00,0.00,1.00,1.00, 
Seq_549,1.00,1.00,0.00,0.00,0.00,1.40,0.00,1.00,1.29,1.00,0.00,1.00,0.00,0.00,0.00,1.00,1.00,1.00,0.00,1.00, 
Seq_550,1.00,0.00,1.00,0.00,1.00,1.00,0.00,0.00,1.50,1.00,1.00,1.00,1.00,0.00,0.00,0.00,0.00,1.67,0.00,1.00, 
Seq_551,0.00,1.00,1.00,1.00,1.00,1.33,1.00,0.00,0.00,1.00,0.00,1.00,1.00,0.00,0.00,0.00,1.00,1.00,1.00,0.00, 
Seq_552,1.00,1.00,0.00,0.00,1.50,0.00,0.00,0.00,1.50,1.50,0.00,0.00,1.00,0.00,0.00,0.00,0.00,1.00,0.00,0.00, 
Seq_553,0.00,0.00,0.00,0.00,1.50,1.00,1.40,1.00,1.00,1.00,0.00,0.00,0.00,0.00,1.00,0.00,1.00,1.00,0.00,0.00, 
Seq_554,1.00,1.00,1.33,1.25,1.00,1.00,1.00,1.00,1.40,1.00,1.00,1.00,1.00,1.00,1.00,1.50,1.00,1.00,0.00,1.00, 
Seq_555,0.00,1.00,0.00,0.00,1.00,1.67,0.00,1.00,0.00,1.00,0.00,0.00,0.00,0.00,2.00,0.00,0.00,1.00,0.00,1.00, 
Seq_556,1.00,0.00,0.00,0.00,1.00,1.00,0.00,1.00,1.00,1.00,1.00,0.00,0.00,1.67,0.00,1.00,1.00,0.00,1.00,0.00, 
Seq_557,1.00,0.00,0.00,1.00,0.00,1.33,0.00,1.00,1.00,1.00,0.00,1.00,0.00,0.00,0.00,1.00,1.00,1.00,0.00,1.00, 
Seq_558,1.00,0.00,0.00,0.00,1.00,1.00,0.00,1.00,1.50,1.40,0.00,1.00,0.00,0.00,0.00,1.00,1.00,1.00,0.00,0.00, 
Seq_559,1.00,0.00,0.00,1.00,1.00,1.25,0.00,1.00,1.36,1.00,0.00,0.00,1.00,0.00,1.00,1.00,0.00,1.00,0.00,0.00, 
Seq_560,1.00,0.00,0.00,0.00,1.00,1.00,0.00,1.00,1.00,1.50,1.00,0.00,1.00,0.00,1.29,1.00,0.00,0.00,0.00,0.00, 
Seq_561,0.00,0.00,0.00,0.00,1.00,1.00,0.00,0.00,1.00,1.00,0.00,0.00,1.00,1.00,1.00,1.00,1.00,0.00,0.00,0.00, 
Seq_562,0.00,1.33,1.00,0.00,1.00,1.33,1.00,1.00,1.00,1.00,0.00,1.00,1.00,1.00,1.00,1.00,1.00,1.00,0.00,1.00, 
Seq_563,0.00,1.00,0.00,1.00,0.00,1.33,0.00,1.00,0.00,1.00,0.00,1.00,1.00,0.00,1.00,1.00,1.00,1.00,1.00,0.00, 
Seq_564,1.00,0.00,0.00,0.00,1.00,1.00,1.00,1.00,1.40,1.00,1.00,0.00,1.00,0.00,0.00,1.00,0.00,1.00,0.00,0.00, 
Seq_565,1.00,1.29,0.00,1.00,1.00,1.00,0.00,1.00,0.00,1.00,0.00,0.00,1.00,1.00,1.40,0.00,1.00,0.00,1.00,1.00, 
Seq_566,1.00,0.00,0.00,0.00,1.00,1.00,0.00,1.00,1.00,1.00,0.00,0.00,1.00,0.00,1.67,1.00,0.00,0.00,0.00,0.00, 
Seq_567,1.00,1.00,0.00,1.00,0.00,1.00,0.00,1.00,1.00,0.00,0.00,1.00,1.00,0.00,0.00,1.00,1.00,1.00,1.00,1.00, 
Seq_568,1.40,0.00,1.00,0.00,0.00,1.00,0.00,1.00,1.00,1.00,1.00,1.00,0.00,1.00,0.00,0.00,1.00,1.00,1.00,0.00, 
Seq_569,1.00,1.00,1.67,1.00,1.00,1.00,1.00,0.00,1.00,1.00,0.00,1.00,1.00,0.00,1.00,1.00,1.33,0.00,1.00,1.00, 
Seq_570,0.00,0.00,0.00,0.00,1.00,1.00,0.00,1.00,1.00,1.00,1.00,0.00,0.00,0.00,0.00,1.00,0.00,1.00,0.00,0.00, 
Seq_571,1.47,0.00,1.00,0.00,1.00,1.00,0.00,1.43,1.33,1.00,0.00,1.00,0.00,1.00,1.00,1.00,1.00,1.25,1.00,1.00, 
Seq_572,1.00,0.00,0.00,0.00,1.00,1.00,0.00,1.00,1.67,1.00,0.00,1.00,0.00,0.00,0.00,0.00,1.00,1.00,0.00,0.00, 
Seq_573,1.00,1.00,1.00,1.00,1.00,0.00,1.00,1.00,1.00,1.29,1.00,1.00,0.00,1.00,1.00,1.40,1.00,1.22,1.00,1.00, 
Seq_574,1.00,1.00,1.00,1.00,1.00,1.00,1.00,0.00,1.00,1.00,1.00,1.00,0.00,0.00,0.00,1.00,1.00,0.00,1.00,1.00, 
Seq_575,1.00,0.00,0.00,0.00,0.00,1.00,0.00,1.00,1.50,1.00,0.00,1.00,0.00,1.00,0.00,1.00,1.00,1.00,0.00,1.00, 
Seq_576,1.00,1.00,1.00,1.00,1.00,1.00,0.00,1.00,1.22,1.40,1.00,1.00,0.00,0.00,1.00,1.00,1.00,1.40,0.00,0.00, 
Seq_577,1.25,0.00,0.00,1.00,1.00,1.00,0.00,0.00,1.22,1.00,1.00,1.00,0.00,1.00,0.00,0.00,1.00,1.40,0.00,1.00, 
Seq_578,1.00,1.00,0.00,0.00,0.00,1.00,1.00,1.00,0.00,0.00,0.00,1.00,1.00,1.00,1.00,1.00,1.00,1.00,1.00,0.00, 
Seq_579,1.00,0.00,1.00,1.00,1.00,1.29,1.00,1.00,1.00,1.00,1.00,1.00,1.00,1.00,1.00,1.00,1.00,1.00,0.00,1.00, 
Seq_580,1.00,0.00,0.00,1.00,1.00,1.00,1.00,1.00,1.00,1.40,0.00,0.00,1.00,0.00,0.00,1.00,0.00,1.33,0.00,0.00, 
Seq_581,1.00,1.00,1.00,1.00,1.00,1.00,1.00,1.00,1.00,1.00,1.00,1.00,0.00,0.00,1.00,1.00,0.00,1.00,0.00,0.00, 
Seq_582,0.00,0.00,1.00,0.00,1.00,1.00,1.00,1.00,0.00,0.00,0.00,1.00,1.00,1.00,1.00,1.00,1.00,0.00,0.00,1.00, 
Seq_583,1.00,1.00,0.00,0.00,1.00,0.00,1.00,1.00,1.00,1.00,0.00,0.00,1.00,1.00,1.00,1.00,0.00,0.00,0.00,1.00, 
Seq_584,1.00,1.00,1.67,1.00,0.00,1.86,1.00,0.00,0.00,0.00,1.00,1.00,1.00,1.00,1.00,1.33,0.00,1.00,0.00,1.00, 
Seq_585,1.00,0.00,1.00,0.00,1.00,0.00,1.00,1.00,1.50,1.00,1.00,1.00,0.00,1.00,1.00,1.00,1.00,1.00,0.00,1.00, 
Seq_586,1.00,0.00,0.00,0.00,0.00,1.00,0.00,1.00,2.67,1.00,1.00,0.00,1.00,1.00,1.00,1.00,1.00,1.00,1.00,0.00, 
Seq_587,1.00,1.40,1.00,0.00,1.00,1.00,1.00,1.00,1.33,1.00,0.00,0.00,1.00,1.00,0.00,1.00,1.00,1.00,0.00,1.00, 
Seq_588,1.00,0.00,1.00,1.00,0.00,1.00,0.00,1.00,1.00,1.00,0.00,1.00,0.00,0.00,0.00,1.00,1.00,1.00,0.00,0.00, 
Seq_589,1.00,0.00,1.00,0.00,1.00,1.00,1.00,1.00,1.00,0.00,0.00,1.00,0.00,1.00,0.00,1.00,0.00,0.00,1.00,0.00, 
Seq_590,1.00,1.00,1.00,0.00,1.00,1.00,0.00,1.00,1.00,1.00,0.00,1.00,0.00,1.00,1.00,1.40,0.00,1.00,0.00,0.00, 
Seq_591,1.00,0.00,0.00,1.00,0.00,1.00,0.00,1.00,1.00,1.33,0.00,0.00,0.00,1.00,0.00,1.00,1.00,1.00,0.00,0.00, 
Seq_592,1.67,1.29,1.00,1.50,1.00,1.29,1.00,1.00,1.00,1.00,0.00,0.00,1.00,1.00,1.00,1.00,1.25,1.00,1.00,1.00, 
Seq_593,1.67,1.00,1.00,0.00,1.50,1.50,0.00,0.00,1.00,1.00,0.00,0.00,1.00,0.00,1.00,0.00,0.00,0.00,0.00,0.00, 
Seq_594,1.00,1.00,1.00,1.00,1.00,2.07,1.00,1.29,1.00,1.00,0.00,1.00,1.29,0.00,1.00,1.00,0.00,1.00,0.00,0.00, 
Seq_595,1.00,1.00,1.00,0.00,1.00,1.00,1.00,1.00,1.00,0.00,0.00,1.00,0.00,1.00,1.40,1.00,1.00,1.00,1.00,1.00, 
Seq_596,1.00,0.00,0.00,0.00,0.00,1.29,0.00,1.00,1.00,0.00,0.00,1.40,1.00,0.00,1.00,1.21,1.00,0.00,0.00,0.00, 
Seq_597,1.00,1.29,1.00,1.00,1.00,1.00,0.00,1.00,1.00,0.00,0.00,1.00,1.67,1.00,1.00,1.00,0.00,1.00,1.00,1.00, 
Seq_598,1.00,1.00,1.00,0.00,1.67,1.40,0.00,1.00,1.00,1.00,0.00,1.00,0.00,0.00,1.00,1.00,1.00,1.00,0.00,0.00, 
Seq_599,0.00,1.29,1.00,1.00,1.00,1.29,1.00,1.00,1.00,1.00,0.00,0.00,1.50,1.00,1.33,1.00,0.00,0.00,1.00,1.00, 
Seq_600,1.00,0.00,1.00,1.00,1.00,1.00,1.44,0.00,1.00,0.00,0.00,0.00,0.00,0.00,1.00,1.00,0.00,0.00,0.00,1.00, 
Seq_601,1.00,1.29,1.00,1.00,1.50,1.00,1.00,1.00,1.00,1.00,0.00,1.00,1.43,1.00,1.00,1.00,1.00,1.00,1.00,1.00, 
Seq_602,1.33,0.00,0.00,0.00,1.00,1.00,0.00,1.00,0.00,0.00,1.00,1.00,1.00,0.00,1.00,1.00,1.00,0.00,0.00,1.00, 
Seq_603,1.44,1.00,1.00,0.00,1.00,1.29,1.00,1.00,1.00,1.00,1.00,1.00,1.00,0.00,1.00,1.00,1.00,1.00,1.00,1.00, 
Seq_604,1.33,1.18,0.00,1.00,0.00,1.00,0.00,1.00,0.00,1.00,0.00,1.00,1.00,1.00,1.00,1.00,1.00,0.00,0.00,1.00, 
Seq_605,1.00,1.00,1.00,1.00,1.00,1.00,0.00,1.00,1.00,0.00,1.00,1.00,1.00,0.00,1.89,1.29,1.00,0.00,0.00,1.00, 
Seq_606,0.00,0.00,0.00,0.00,0.00,1.00,1.00,1.00,1.00,1.50,1.00,0.00,0.00,0.00,0.00,1.00,0.00,0.00,1.00,0.00, 
Seq_607,1.62,1.29,1.00,1.00,1.00,1.00,1.00,1.00,1.00,1.00,0.00,1.00,1.00,0.00,1.22,1.25,1.00,1.00,1.00,1.29, 
Seq_608,1.00,0.00,0.00,0.00,1.00,1.00,1.50,1.00,0.00,1.00,0.00,0.00,0.00,0.00,1.00,1.00,1.00,1.00,0.00,0.00, 
Seq_609,0.00,1.00,0.00,0.00,1.00,0.00,0.00,1.00,1.00,1.00,0.00,0.00,1.00,0.00,1.00,1.00,0.00,0.00,1.00,0.00, 
Seq_610,1.00,1.00,1.00,1.00,1.00,1.00,1.00,1.00,1.00,1.29,1.00,1.00,1.00,1.00,1.00,1.00,1.00,1.00,0.00,1.00, 
Seq_611,1.50,1.00,1.00,0.00,0.00,1.00,0.00,1.00,1.00,1.44,0.00,0.00,0.00,1.00,0.00,1.00,1.00,1.00,0.00,0.00, 
Seq_612,1.00,1.00,0.00,0.00,1.00,1.00,0.00,1.00,1.00,1.57,1.00,0.00,1.00,0.00,1.00,1.00,1.00,1.00,0.00,0.00, 
Seq_613,1.00,0.00,1.00,1.00,1.00,1.00,1.00,1.00,1.00,1.00,1.00,1.00,1.00,1.00,1.00,1.52,1.33,1.00,1.00,1.00, 
Seq_614,1.00,1.00,1.00,0.00,0.00,1.22,0.00,1.40,1.00,1.00,1.00,1.00,1.00,0.00,1.00,1.62,1.00,1.00,1.00,1.00, 
Seq_615,1.00,1.00,1.67,1.00,0.00,1.00,0.00,1.00,1.00,1.50,1.00,0.00,0.00,0.00,0.00,1.00,1.00,1.00,0.00,0.00, 
Seq_616,1.83,0.00,1.00,1.00,1.00,1.00,1.67,1.00,1.40,1.00,0.00,1.00,1.00,1.00,1.00,1.00,1.00,1.00,1.00,1.00, 
Seq_617,1.57,0.00,0.00,0.00,1.00,1.00,1.00,1.00,1.00,1.00,0.00,0.00,0.00,1.00,1.00,1.00,0.00,1.00,1.00,1.67, 
Seq_618,1.46,0.00,1.00,1.00,1.00,1.19,1.00,1.00,0.00,1.20,1.00,1.25,1.00,1.00,0.00,1.62,1.00,1.00,1.00,1.00, 
Seq_619,0.00,1.00,0.00,0.00,1.40,1.00,0.00,1.00,1.00,0.00,0.00,0.00,1.00,0.00,0.00,0.00,1.00,1.00,0.00,0.00, 
Seq_620,0.00,0.00,0.00,0.00,0.00,0.00,0.00,1.00,1.00,1.40,0.00,0.00,0.00,0.00,1.00,1.00,1.00,0.00,0.00,0.00, 
Seq_621,0.00,1.29,1.00,1.00,1.00,2.00,0.00,1.00,1.00,1.00,0.00,1.00,1.00,1.00,1.50,1.00,1.00,1.00,1.00,1.00, 
Seq_622,1.00,1.00,1.67,1.00,0.00,1.40,0.00,0.00,0.00,0.00,0.00,1.00,0.00,0.00,1.50,1.00,1.00,1.57,0.00,1.50, 
Seq_623,0.00,0.00,1.00,0.00,0.00,1.00,1.00,1.00,1.00,1.00,0.00,0.00,1.00,0.00,0.00,1.00,0.00,0.00,0.00,1.00, 
Seq_624,1.44,0.00,1.00,0.00,0.00,1.33,0.00,0.00,1.83,1.00,1.00,0.00,1.00,1.00,0.00,0.00,0.00,0.00,1.00,0.00, 
Seq_625,1.00,0.00,1.00,1.00,0.00,1.00,0.00,1.00,1.00,1.67,0.00,1.00,1.00,1.33,1.50,0.00,1.00,1.00,1.00,1.00, 
Seq_626,0.00,0.00,0.00,0.00,0.00,1.00,0.00,0.00,0.00,1.44,0.00,1.00,0.00,0.00,0.00,0.00,1.00,0.00,0.00,0.00, 
Seq_627,1.00,1.00,1.00,1.00,0.00,1.00,1.00,1.00,1.00,1.00,1.00,1.00,1.00,1.00,1.00,1.50,1.00,1.00,1.00,1.00, 
Seq_628,1.29,0.00,1.00,1.00,0.00,1.00,0.00,1.00,1.22,1.00,0.00,1.00,1.00,0.00,0.00,1.00,1.00,1.00,1.00,0.00, 
Seq_629,1.00,0.00,0.00,1.00,1.57,1.00,0.00,1.00,1.50,1.00,0.00,0.00,1.00,0.00,1.00,1.00,0.00,1.00,0.00,0.00, 
Seq_630,0.00,1.00,0.00,0.00,0.00,1.00,0.00,1.00,1.00,0.00,0.00,0.00,0.00,0.00,1.50,1.00,2.00,1.67,0.00,1.00, 
Seq_631,0.00,1.29,0.00,1.00,1.00,1.00,0.00,1.00,1.00,1.00,1.00,1.00,1.00,1.00,1.00,1.00,1.00,0.00,1.00,1.00, 
Seq_632,0.00,0.00,0.00,0.00,0.00,1.00,0.00,1.00,1.00,0.00,0.00,0.00,0.00,1.00,1.00,1.00,1.00,1.00,1.00,0.00, 
Seq_633,0.00,1.00,1.00,0.00,0.00,1.00,1.00,1.40,0.00,0.00,0.00,0.00,0.00,1.00,1.00,1.00,0.00,0.00,1.00,0.00, 
Seq_634,1.67,0.00,0.00,0.00,1.00,0.00,0.00,0.00,1.00,1.33,0.00,1.00,1.00,0.00,0.00,0.00,0.00,0.00,0.00,0.00, 
Seq_635,1.00,0.00,0.00,1.00,1.00,1.67,1.00,1.00,1.22,1.00,1.00,0.00,0.00,1.00,0.00,1.00,1.00,0.00,1.00,0.00, 
Seq_636,1.40,1.00,0.00,0.00,1.00,1.40,0.00,1.67,1.50,1.00,0.00,1.00,1.00,1.00,0.00,1.00,1.00,1.00,0.00,1.00, 
Seq_637,1.52,0.00,1.00,0.00,1.00,1.00,1.00,1.00,1.00,1.22,1.00,0.00,1.00,1.00,1.00,1.00,1.00,1.00,1.00,1.00, 
Seq_638,1.00,1.20,1.50,1.00,1.00,1.00,1.00,0.00,1.00,1.00,0.00,1.00,1.00,0.00,1.00,1.00,1.00,1.00,1.00,1.00, 
Seq_639,0.00,0.00,0.00,0.00,1.00,1.00,0.00,1.00,1.00,0.00,1.00,0.00,1.00,0.00,1.00,0.00,0.00,0.00,0.00,1.00, 
Seq_640,0.00,1.29,0.00,0.00,1.00,1.00,0.00,1.00,0.00,1.00,0.00,1.00,1.00,1.00,1.44,0.00,1.33,1.00,0.00,1.00, 
Seq_641,1.00,1.00,1.00,1.00,1.00,1.00,0.00,1.00,1.29,0.00,0.00,1.00,1.00,1.00,1.00,1.00,1.00,1.00,0.00,1.00, 
Seq_642,0.00,1.29,1.00,1.00,0.00,1.00,1.00,0.00,1.00,1.00,1.00,1.00,0.00,0.00,1.22,0.00,1.00,1.00,0.00,1.00, 
Seq_643,1.50,0.00,0.00,0.00,1.67,1.00,0.00,0.00,0.00,0.00,1.00,0.00,0.00,0.00,1.00,0.00,0.00,0.00,0.00,0.00, 
Seq_644,0.00,0.00,0.00,0.00,1.00,0.00,1.00,0.00,0.00,0.00,0.00,0.00,0.00,0.00,1.00,0.00,0.00,0.00,1.67,0.00, 
Seq_645,1.00,0.00,0.00,0.00,1.00,1.00,0.00,1.00,1.33,0.00,0.00,0.00,1.00,0.00,1.44,0.00,1.00,1.33,1.00,1.00, 
Seq_646,0.00,0.00,0.00,0.00,0.00,1.50,0.00,1.00,1.00,1.33,0.00,0.00,1.00,0.00,0.00,1.00,0.00,0.00,0.00,0.00, 
Seq_647,0.00,1.00,1.00,1.71,0.00,1.44,1.00,0.00,1.00,1.00,1.67,1.00,1.00,1.47,1.53,1.00,0.00,0.00,0.00,1.00, 
Seq_648,1.40,1.00,0.00,0.00,1.00,1.00,0.00,1.00,1.50,1.00,0.00,1.00,1.00,0.00,0.00,1.00,0.00,1.00,0.00,0.00, 
Seq_649,0.00,0.00,1.00,0.00,1.00,1.00,0.00,1.50,1.00,1.00,0.00,1.00,0.00,0.00,0.00,1.00,1.00,1.00,0.00,0.00, 
Seq_650,1.00,1.29,0.00,1.00,0.00,1.00,0.00,1.00,0.00,1.00,0.00,0.00,0.00,0.00,1.00,1.00,1.00,1.00,0.00,1.00, 
Seq_651,1.00,0.00,0.00,0.00,1.00,1.25,1.00,0.00,1.00,1.50,0.00,1.00,1.00,1.00,1.00,1.67,1.00,1.00,0.00,1.00, 
Seq_652,1.00,1.00,1.00,1.00,0.00,1.00,1.00,1.40,1.00,1.00,1.00,1.00,1.00,1.00,0.00,1.00,1.00,1.00,1.00,1.00, 
Seq_653,1.00,1.00,1.00,2.06,1.40,1.00,0.00,1.00,1.40,1.89,0.00,1.00,1.00,1.00,1.40,1.00,1.00,1.00,0.00,1.00, 
Seq_654,0.00,1.00,0.00,0.00,1.00,1.00,0.00,1.50,1.50,1.00,0.00,1.00,1.00,0.00,0.00,0.00,1.00,1.00,0.00,0.00, 
Seq_655,1.00,1.00,1.00,1.00,1.00,1.80,1.00,1.00,1.00,1.00,1.00,1.00,1.00,1.00,1.00,1.14,1.00,1.00,0.00,1.00, 
Seq_656,1.00,1.00,1.50,1.22,1.00,1.22,1.00,1.00,1.25,1.00,0.00,0.00,1.32,1.67,1.00,1.29,1.00,1.00,1.00,1.00, 
Seq_657,1.25,0.00,1.00,1.40,1.67,1.50,0.00,1.50,1.00,1.00,0.00,1.00,1.00,1.00,1.00,1.00,1.00,1.00,0.00,0.00, 
Seq_658,1.00,1.00,0.00,0.00,1.00,1.00,1.00,0.00,1.00,1.00,0.00,1.00,1.00,0.00,1.00,1.00,1.00,1.00,0.00,1.50, 
Seq_659,1.50,1.00,1.00,0.00,0.00,1.20,0.00,1.50,1.33,1.00,0.00,1.33,0.00,0.00,0.00,1.00,1.00,1.00,1.00,1.67, 
Seq_660,1.25,0.00,0.00,0.00,0.00,1.00,0.00,1.00,1.00,1.00,1.00,0.00,0.00,0.00,0.00,0.00,1.00,1.00,0.00,0.00, 
Seq_661,0.00,0.00,0.00,0.00,0.00,0.00,0.00,1.00,1.00,1.00,0.00,0.00,1.00,1.00,1.19,1.00,0.00,0.00,0.00,0.00, 
Seq_662,1.33,0.00,0.00,1.00,1.00,0.00,0.00,1.33,0.00,0.00,0.00,0.00,1.00,0.00,0.00,0.00,1.00,1.00,0.00,0.00, 
Seq_663,1.57,1.00,1.00,1.00,1.00,1.67,1.00,1.00,1.00,1.00,0.00,1.00,1.00,1.33,1.00,1.33,1.22,1.00,1.00,1.33, 
Seq_664,1.00,0.00,0.00,1.00,1.00,1.00,1.00,1.00,1.50,1.00,0.00,1.50,0.00,1.00,0.00,0.00,1.00,1.00,0.00,0.00, 
Seq_665,1.50,0.00,0.00,0.00,0.00,1.00,1.00,1.00,1.00,1.00,0.00,0.00,0.00,0.00,1.00,1.00,1.00,0.00,1.00,1.00, 
Seq_666,1.00,0.00,0.00,0.00,0.00,1.00,0.00,0.00,0.00,0.00,1.00,0.00,0.00,1.00,1.00,1.00,0.00,1.00,0.00,0.00, 
Seq_667,1.33,0.00,0.00,1.00,1.00,1.00,0.00,1.00,1.33,1.00,2.00,1.00,1.00,1.00,0.00,1.00,1.00,1.00,1.00,1.00, 
Seq_668,1.67,0.00,1.00,0.00,0.00,0.00,0.00,1.00,1.50,1.50,0.00,0.00,0.00,1.00,0.00,0.00,0.00,0.00,1.00,0.00, 
Seq_669,1.00,0.00,1.00,0.00,1.00,0.00,0.00,1.00,1.00,0.00,1.00,1.00,1.50,1.00,0.00,1.00,1.00,0.00,0.00,1.00, 
Seq_670,0.00,1.00,0.00,0.00,0.00,1.00,0.00,1.67,1.33,1.00,0.00,0.00,0.00,1.00,0.00,1.00,1.00,1.00,0.00,0.00, 
Seq_671,1.00,1.00,1.00,1.00,1.00,1.62,1.00,1.00,1.00,1.00,1.00,1.00,1.00,1.00,1.20,1.50,1.00,1.00,1.00,0.00, 
Seq_672,1.00,1.00,0.00,1.00,1.00,1.00,0.00,1.00,1.00,0.00,0.00,1.00,1.00,1.00,1.50,1.00,1.00,1.00,1.00,1.00, 
Seq_673,1.00,0.00,0.00,0.00,1.00,1.00,0.00,1.00,1.00,1.00,1.00,0.00,1.00,0.00,0.00,0.00,0.00,0.00,0.00,0.00, 
Seq_674,1.50,1.00,0.00,1.00,1.00,1.00,0.00,1.00,0.00,1.00,0.00,1.00,0.00,0.00,0.00,1.00,1.00,1.00,0.00,0.00, 
Seq_675,1.00,0.00,1.00,1.00,1.50,1.29,1.50,1.50,1.00,1.00,1.00,1.00,0.00,1.00,1.00,1.00,0.00,1.29,0.00,1.00, 
Seq_676,1.31,1.00,1.40,1.00,1.00,1.15,0.00,1.00,1.00,1.33,0.00,1.00,1.00,1.00,1.00,1.00,1.00,1.00,0.00,1.00, 
Seq_677,1.00,1.29,0.00,1.00,1.00,1.00,0.00,1.00,0.00,1.00,0.00,1.00,0.00,0.00,1.00,1.40,1.00,0.00,0.00,1.00, 
Seq_678,1.67,1.00,0.00,1.00,0.00,1.00,0.00,1.00,1.00,1.00,0.00,1.00,1.00,0.00,1.00,1.00,0.00,1.00,1.00,1.00, 
Seq_679,1.00,0.00,0.00,1.00,0.00,1.50,0.00,1.00,1.57,1.00,0.00,1.00,1.00,1.00,1.00,1.40,1.00,0.00,1.00,0.00, 
Seq_680,1.62,0.00,0.00,1.00,1.00,1.36,0.00,1.00,1.83,1.33,1.00,1.00,1.00,0.00,1.00,1.00,1.40,1.22,1.00,1.00, 
Seq_681,1.89,0.00,0.00,0.00,1.00,1.00,1.00,1.00,0.00,1.00,0.00,1.00,1.00,0.00,0.00,0.00,1.00,1.00,0.00,0.00, 
Seq_682,1.00,0.00,1.00,0.00,0.00,1.00,0.00,0.00,1.50,0.00,0.00,0.00,1.00,0.00,0.00,1.00,1.00,1.00,0.00,0.00, 
Seq_683,1.00,0.00,1.00,0.00,1.50,1.67,1.00,1.00,1.00,1.00,0.00,1.00,1.00,1.00,0.00,1.00,1.00,1.00,0.00,0.00, 
Seq_684,1.00,0.00,0.00,0.00,1.00,1.00,0.00,0.00,1.00,1.00,1.00,0.00,1.00,1.00,1.00,1.50,0.00,0.00,0.00,1.00, 
Seq_685,1.50,1.00,1.00,1.00,0.00,1.00,0.00,1.00,1.36,1.00,1.00,0.00,0.00,1.67,0.00,0.00,0.00,1.00,1.00,1.00, 
Seq_686,0.00,1.00,0.00,0.00,1.00,1.00,0.00,1.00,1.50,1.29,0.00,0.00,1.00,0.00,0.00,1.00,1.00,1.00,0.00,0.00, 
Seq_687,1.25,0.00,1.67,1.33,1.00,1.00,1.00,1.00,1.36,1.00,0.00,1.00,1.00,1.00,0.00,1.00,1.00,1.00,0.00,1.00, 
Seq_688,1.00,0.00,1.00,1.50,1.00,1.33,1.00,1.00,1.00,1.00,0.00,0.00,1.00,1.00,1.44,1.67,1.00,1.00,1.00,1.00, 
Seq_689,1.00,1.00,0.00,0.00,1.00,1.00,0.00,1.00,1.00,1.00,0.00,1.00,1.00,1.00,1.00,1.00,1.00,1.00,0.00,0.00, 
Seq_690,1.33,1.00,1.00,1.00,1.00,1.00,0.00,1.00,1.00,1.00,0.00,1.00,1.00,0.00,0.00,1.00,1.00,1.00,1.00,0.00, 
Seq_691,1.00,1.29,0.00,1.00,1.00,1.00,0.00,1.00,1.00,1.33,0.00,1.00,1.00,1.00,1.40,1.00,1.00,1.00,0.00,0.00, 
Seq_692,1.40,1.00,1.00,0.00,1.00,1.00,0.00,1.00,1.00,1.00,0.00,0.00,0.00,1.00,1.00,1.00,1.00,1.00,0.00,0.00, 
Seq_693,1.00,0.00,0.00,0.00,1.00,1.00,0.00,1.00,1.00,1.00,0.00,1.00,1.00,0.00,0.00,0.00,0.00,0.00,0.00,0.00, 
Seq_694,1.00,0.00,1.00,1.00,1.00,1.00,1.00,1.00,1.00,1.00,1.00,1.00,1.50,1.29,1.00,1.00,1.00,1.00,0.00,1.00, 
Seq_695,0.00,0.00,1.00,1.00,1.40,1.00,0.00,1.00,1.00,1.40,0.00,1.00,1.00,1.00,1.00,1.00,1.00,1.00,0.00,0.00, 
Seq_696,1.00,0.00,0.00,1.00,0.00,1.00,0.00,1.67,1.00,1.33,0.00,1.00,0.00,0.00,0.00,1.00,1.00,1.00,0.00,0.00, 
Seq_697,1.67,0.00,1.00,0.00,1.00,2.00,0.00,1.00,1.50,1.00,0.00,1.00,0.00,0.00,0.00,0.00,0.00,1.40,0.00,0.00, 
Seq_698,1.00,0.00,1.00,1.00,1.50,1.00,0.00,0.00,0.00,1.00,1.00,1.00,2.14,0.00,0.00,1.00,0.00,1.00,0.00,1.00, 
Seq_699,1.00,0.00,0.00,0.00,0.00,1.00,0.00,1.40,1.00,1.50,0.00,1.00,0.00,0.00,0.00,1.00,0.00,0.00,0.00,0.00, 
Seq_700,1.00,0.00,1.00,1.00,1.00,1.00,0.00,1.00,1.00,1.50,0.00,1.00,1.00,0.00,1.25,1.00,1.00,0.00,0.00,0.00, 
Seq_701,1.00,1.00,1.00,0.00,1.00,1.00,0.00,1.00,1.00,1.33,0.00,1.00,0.00,0.00,0.00,1.00,1.00,1.00,0.00,0.00, 
Seq_702,1.00,1.00,0.00,0.00,1.00,1.00,0.00,0.00,1.00,1.00,1.00,1.00,1.00,0.00,1.00,1.00,0.00,0.00,0.00,0.00, 
Seq_703,1.00,1.00,0.00,0.00,1.00,1.00,0.00,1.00,1.00,1.29,1.00,0.00,1.00,0.00,1.00,1.00,0.00,0.00,0.00,0.00, 
Seq_704,1.40,0.00,0.00,0.00,1.00,1.00,1.00,1.00,1.00,1.00,0.00,0.00,0.00,1.67,0.00,1.00,1.00,0.00,1.00,0.00, 
Seq_705,1.00,1.00,0.00,1.00,0.00,1.00,1.00,1.00,1.00,1.00,0.00,1.00,0.00,1.00,1.00,1.00,0.00,1.00,0.00,1.00, 
Seq_706,1.00,1.00,1.00,1.00,1.00,1.50,0.00,0.00,1.00,0.00,0.00,1.00,1.00,0.00,1.00,1.00,1.00,1.00,0.00,1.00, 
Seq_707,0.00,1.29,1.00,0.00,1.00,1.50,1.00,0.00,1.00,1.00,0.00,1.00,1.00,1.00,1.00,1.40,1.00,0.00,0.00,1.00, 
Seq_708,1.00,0.00,0.00,0.00,1.00,1.00,1.00,0.00,1.00,1.50,0.00,0.00,1.00,1.00,1.00,1.67,1.00,1.00,0.00,0.00, 
Seq_709,1.50,0.00,1.00,1.00,0.00,1.00,0.00,1.00,1.25,1.00,0.00,1.00,1.00,1.00,0.00,1.40,1.00,1.00,1.00,1.00, 
Seq_710,1.00,0.00,0.00,0.00,1.00,1.00,0.00,1.00,1.00,1.40,0.00,0.00,1.00,0.00,0.00,1.00,0.00,0.00,0.00,1.00, 
Seq_711,1.00,0.00,0.00,0.00,1.00,1.00,0.00,1.67,1.00,1.00,0.00,0.00,0.00,0.00,0.00,1.00,0.00,1.00,0.00,0.00, 
Seq_712,1.00,1.00,1.00,1.00,1.00,1.00,1.00,1.00,1.00,1.00,0.00,1.50,0.00,1.00,1.00,1.00,1.50,1.00,0.00,0.00, 
Seq_713,1.00,0.00,0.00,0.00,1.00,1.00,0.00,1.00,2.67,1.33,0.00,0.00,1.00,1.00,0.00,1.00,0.00,1.67,1.00,0.00, 
Seq_714,0.00,0.00,0.00,0.00,1.29,1.67,0.00,1.40,0.00,1.00,0.00,0.00,1.86,0.00,1.00,0.00,0.00,1.00,0.00,0.00, 
Seq_715,1.00,1.00,1.50,1.00,1.00,1.00,0.00,1.00,1.00,1.00,0.00,1.00,1.00,0.00,1.00,1.00,0.00,1.00,1.00,0.00, 
Seq_716,1.00,0.00,0.00,1.00,1.00,1.00,1.00,1.00,1.00,1.00,0.00,0.00,0.00,0.00,1.00,1.00,0.00,0.00,0.00,0.00, 
Seq_717,1.00,1.29,0.00,1.00,1.00,1.00,0.00,1.00,0.00,1.00,0.00,0.00,0.00,0.00,1.20,1.00,1.00,1.00,0.00,1.00, 
Seq_718,0.00,1.00,0.00,1.00,1.00,1.00,0.00,1.00,1.00,1.67,0.00,1.00,1.00,0.00,1.00,1.00,1.00,1.00,0.00,1.00, 
Seq_719,1.40,1.00,1.00,1.00,1.00,1.00,1.00,1.00,1.00,1.00,1.00,1.00,1.00,1.00,1.73,1.57,1.00,1.00,1.00,1.00, 
Seq_720,1.33,0.00,0.00,1.00,1.00,1.67,1.00,1.00,1.00,1.00,0.00,0.00,1.00,0.00,0.00,0.00,0.00,1.33,0.00,0.00, 
Seq_721,1.00,0.00,0.00,0.00,1.00,1.00,0.00,1.00,1.00,1.67,0.00,1.00,0.00,0.00,0.00,0.00,0.00,0.00,0.00,0.00, 
Seq_722,1.00,1.00,1.00,0.00,1.00,1.00,0.00,1.00,1.50,1.00,1.00,0.00,0.00,0.00,0.00,1.00,1.00,1.00,1.00,0.00, 
Seq_723,1.00,0.00,0.00,1.00,0.00,1.33,1.00,1.40,1.33,1.00,0.00,1.00,0.00,1.40,1.00,1.00,1.00,1.00,0.00,1.00, 
Seq_724,0.00,0.00,0.00,0.00,1.00,1.00,1.00,1.00,1.00,1.33,0.00,1.00,1.00,0.00,0.00,0.00,0.00,0.00,0.00,0.00, 
Seq_725,1.25,0.00,0.00,0.00,1.00,1.00,1.00,1.00,1.00,1.40,1.00,1.00,0.00,0.00,0.00,0.00,1.00,0.00,1.00,1.00, 
Seq_726,0.00,0.00,0.00,0.00,1.00,1.00,1.00,1.00,1.60,1.33,0.00,0.00,1.00,0.00,1.00,1.00,0.00,1.00,0.00,0.00, 
Seq_727,1.00,1.00,1.00,1.29,0.00,1.00,1.00,1.00,1.31,1.00,1.00,1.00,1.00,1.00,1.00,1.00,1.40,1.00,0.00,1.00, 
Seq_728,1.40,0.00,1.00,1.00,1.00,1.00,1.00,1.00,1.29,1.00,0.00,1.00,0.00,0.00,1.00,1.00,1.00,1.29,0.00,0.00, 
Seq_729,1.67,1.00,0.00,1.00,1.00,1.00,0.00,1.00,1.00,0.00,0.00,1.00,1.00,0.00,1.00,1.00,1.00,1.00,0.00,1.00, 
Seq_730,1.67,1.00,1.00,1.00,1.00,1.57,1.50,0.00,1.22,1.00,0.00,1.00,1.00,1.00,1.00,1.00,1.00,1.40,0.00,1.00, 
Seq_731,1.33,0.00,0.00,1.00,1.00,1.00,0.00,1.00,1.29,1.00,1.00,1.00,1.00,1.67,1.00,0.00,1.50,1.00,1.00,1.00, 
Seq_732,1.00,0.00,1.00,1.00,1.00,1.40,1.25,1.00,1.00,0.00,0.00,1.00,0.00,1.00,1.00,1.00,0.00,1.67,0.00,0.00, 
Seq_733,1.50,1.00,0.00,0.00,1.00,1.00,0.00,1.00,1.40,1.00,0.00,0.00,1.00,0.00,0.00,1.00,1.00,1.00,0.00,0.00, 
Seq_734,1.00,1.00,0.00,0.00,1.00,1.00,1.00,0.00,1.00,1.00,1.00,0.00,1.00,0.00,1.00,1.00,1.00,1.00,1.00,1.00, 
Seq_735,0.00,0.00,0.00,0.00,1.00,1.00,0.00,1.00,1.50,1.00,0.00,1.00,1.00,0.00,1.00,1.00,0.00,1.67,0.00,0.00, 
Seq_736,1.00,1.40,1.50,0.00,1.00,1.40,0.00,1.00,1.40,1.00,0.00,1.00,1.40,1.00,1.00,1.00,1.00,1.00,0.00,1.00, 
Seq_737,1.00,0.00,0.00,0.00,0.00,1.00,1.00,0.00,1.00,1.00,0.00,1.00,1.00,1.00,1.50,1.00,1.00,1.00,1.00,1.00, 
Seq_738,1.00,1.29,0.00,1.00,0.00,1.00,0.00,1.00,0.00,1.00,0.00,1.00,0.00,0.00,1.00,1.00,1.00,1.00,0.00,1.00, 
Seq_739,0.00,0.00,0.00,0.00,1.00,1.00,0.00,0.00,1.00,1.00,0.00,0.00,0.00,0.00,0.00,0.00,0.00,1.00,0.00,0.00, 
Seq_740,1.40,1.00,0.00,0.00,1.00,1.00,0.00,1.00,1.40,1.00,0.00,0.00,1.00,0.00,0.00,0.00,1.00,1.50,0.00,0.00, 
Seq_741,1.00,0.00,1.00,0.00,1.00,1.00,0.00,1.00,1.33,1.00,1.00,0.00,1.00,0.00,0.00,1.00,1.00,1.00,0.00,0.00, 
Seq_742,1.00,1.00,1.00,1.00,1.00,1.00,1.67,0.00,1.00,1.40,1.00,0.00,1.00,0.00,0.00,1.00,1.00,1.00,0.00,1.00, 
Seq_743,1.00,0.00,1.00,1.00,1.00,1.00,0.00,1.40,1.67,1.00,0.00,0.00,0.00,0.00,0.00,1.00,0.00,0.00,0.00,0.00, 
Seq_744,1.00,1.00,0.00,0.00,1.00,1.33,1.00,1.00,1.40,1.00,0.00,0.00,0.00,1.00,1.00,1.00,1.00,1.00,1.00,0.00, 
Seq_745,0.00,1.00,0.00,0.00,1.00,0.00,0.00,1.00,1.67,0.00,0.00,0.00,0.00,0.00,1.50,1.00,2.00,0.00,0.00,1.00, 
Seq_746,1.00,0.00,1.00,0.00,1.00,1.50,0.00,1.00,1.67,1.00,0.00,0.00,0.00,0.00,0.00,1.00,0.00,1.00,0.00,0.00, 
Seq_747,1.00,1.29,1.33,1.00,1.00,1.00,1.33,1.00,1.00,1.00,0.00,1.67,1.46,1.00,1.00,1.33,1.00,1.00,1.00,1.00, 
Seq_748,1.67,0.00,0.00,0.00,1.00,1.00,1.00,1.00,1.00,1.40,0.00,0.00,0.00,0.00,0.00,1.00,0.00,0.00,0.00,0.00, 
Seq_749,1.00,1.00,1.00,1.00,0.00,1.00,1.00,1.00,1.00,1.29,0.00,0.00,0.00,1.50,1.00,1.00,1.00,1.00,0.00,1.00, 
Seq_750,1.00,1.00,0.00,1.00,1.00,1.00,0.00,1.00,1.00,1.00,1.00,1.00,1.50,1.00,1.00,1.40,0.00,1.00,1.00,0.00, 
Seq_751,1.00,0.00,1.00,1.00,1.00,1.00,0.00,1.00,1.00,1.00,0.00,1.00,0.00,0.00,1.40,1.67,0.00,0.00,1.00,1.00, 
Seq_752,1.00,1.00,0.00,0.00,0.00,1.00,1.00,1.00,1.00,1.00,0.00,1.00,0.00,0.00,1.00,1.00,1.00,1.00,1.00,0.00, 
Seq_753,1.29,0.00,0.00,1.00,0.00,1.00,0.00,1.00,1.00,1.00,1.00,1.00,0.00,1.00,0.00,0.00,1.00,1.00,1.00,0.00, 
Seq_754,1.00,1.00,1.00,1.00,1.00,1.00,0.00,1.00,1.17,0.00,0.00,1.00,1.00,1.00,1.00,1.00,1.00,1.00,0.00,1.00, 
Seq_755,0.00,1.29,1.00,1.00,1.00,1.00,1.00,1.00,1.29,1.00,1.00,1.00,1.00,1.00,1.00,0.00,1.00,1.00,1.00,1.00, 
Seq_756,1.00,0.00,0.00,0.00,0.00,1.00,1.00,1.00,1.00,1.29,0.00,1.00,0.00,0.00,0.00,1.00,0.00,1.00,0.00,0.00, 
Seq_757,1.00,0.00,0.00,0.00,0.00,1.33,0.00,0.00,0.00,1.50,0.00,0.00,1.33,0.00,0.00,1.50,0.00,1.00,0.00,0.00, 
Seq_758,0.00,1.00,0.00,1.00,0.00,1.00,0.00,0.00,1.00,1.00,0.00,0.00,0.00,1.00,1.33,0.00,1.00,1.00,0.00,1.00, 
Seq_759,1.50,1.22,1.00,1.00,0.00,1.00,0.00,1.00,1.00,1.00,0.00,1.00,1.33,0.00,1.00,1.00,1.00,1.00,0.00,1.00, 
Seq_760,1.57,1.00,0.00,1.00,1.00,0.00,1.00,1.00,1.67,0.00,1.67,0.00,1.00,1.00,0.00,1.00,0.00,1.00,0.00,1.00, 
Seq_761,1.00,1.29,1.00,1.67,0.00,1.00,1.00,1.00,1.83,1.00,1.00,1.00,1.00,0.00,1.00,0.00,0.00,1.00,1.00,1.00, 
Seq_762,0.00,0.00,1.00,1.00,1.50,1.00,0.00,1.00,1.00,1.67,0.00,0.00,0.00,1.00,1.00,1.00,0.00,1.00,0.00,0.00, 
Seq_763,1.40,1.00,0.00,0.00,0.00,1.40,0.00,1.00,1.00,1.00,0.00,1.00,0.00,0.00,0.00,0.00,1.00,1.00,1.00,0.00, 
Seq_764,1.00,1.00,0.00,1.00,1.00,1.18,1.00,1.00,0.00,1.00,0.00,1.00,1.33,1.00,1.17,1.00,1.00,1.00,0.00,1.00, 
Seq_765,0.00,0.00,0.00,1.00,1.67,1.00,0.00,0.00,0.00,1.00,1.00,1.00,1.00,0.00,0.00,0.00,0.00,0.00,0.00,0.00, 
Seq_766,1.00,1.29,0.00,1.00,1.00,1.00,1.00,1.00,0.00,1.00,1.00,1.00,0.00,0.00,1.50,1.00,1.00,1.00,0.00,1.00, 
Seq_767,1.29,0.00,0.00,1.00,1.00,1.00,1.00,1.00,1.00,1.00,0.00,1.67,1.00,1.00,0.00,0.00,0.00,1.00,0.00,0.00, 
Seq_768,1.00,1.00,0.00,0.00,1.00,1.00,0.00,1.00,1.00,1.00,0.00,1.00,1.00,0.00,1.00,0.00,1.00,1.33,0.00,0.00, 
Seq_769,1.00,1.15,1.00,1.50,1.00,1.00,1.00,1.00,1.17,1.00,0.00,1.00,1.00,0.00,1.00,1.00,1.00,1.00,0.00,1.00, 
Seq_770,0.00,0.00,0.00,0.00,1.00,1.00,0.00,1.67,0.00,1.00,1.00,0.00,1.00,0.00,1.00,1.00,0.00,0.00,0.00,0.00, 
Seq_771,1.00,1.50,1.00,0.00,1.00,1.00,1.00,1.00,1.00,1.00,0.00,0.00,1.00,0.00,1.00,1.57,1.00,1.00,0.00,1.00, 
Seq_772,1.00,1.00,1.00,1.00,1.00,1.00,0.00,0.00,1.00,1.00,0.00,1.00,1.00,0.00,1.00,1.00,1.00,0.00,0.00,0.00, 
Seq_773,0.00,0.00,0.00,0.00,0.00,1.00,1.74,0.00,0.00,0.00,0.00,0.00,1.00,0.00,0.00,0.00,0.00,0.00,0.00,0.00, 
Seq_774,1.00,1.29,0.00,1.00,1.00,1.00,0.00,1.00,0.00,1.00,0.00,0.00,1.00,1.00,1.40,0.00,1.00,0.00,1.00,1.00, 
Seq_775,1.00,1.00,1.00,0.00,1.00,1.00,0.00,1.00,1.00,1.44,0.00,1.00,0.00,1.00,0.00,1.00,1.00,1.00,0.00,0.00, 
Seq_776,1.00,0.00,0.00,0.00,1.67,1.67,0.00,1.00,1.00,1.40,0.00,0.00,1.00,0.00,0.00,1.00,0.00,1.00,0.00,0.00, 
Seq_777,1.00,1.29,3.00,1.00,1.00,1.00,0.00,1.00,0.00,1.00,0.00,0.00,1.00,1.00,1.40,0.00,1.00,0.00,1.00,1.00, 
Seq_778,1.00,0.00,1.00,1.40,0.00,1.00,1.00,1.00,1.00,1.00,1.00,1.00,1.33,1.00,1.00,1.00,1.00,1.00,0.00,1.00, 
Seq_779,1.40,0.00,1.00,1.00,1.00,1.00,1.00,1.00,1.00,1.00,0.00,1.00,1.00,1.00,0.00,0.00,0.00,1.00,0.00,0.00, 
Seq_780,1.00,0.00,0.00,1.00,0.00,1.00,1.00,1.00,0.00,1.33,0.00,0.00,1.00,1.00,0.00,1.00,0.00,1.29,0.00,0.00, 
Seq_781,1.00,0.00,0.00,0.00,1.00,1.00,0.00,1.00,1.50,1.00,1.00,0.00,0.00,1.00,0.00,1.50,1.00,1.00,1.00,1.00, 
Seq_782,1.00,0.00,0.00,0.00,1.00,0.00,0.00,1.00,1.00,1.00,0.00,0.00,1.67,0.00,1.00,1.00,0.00,1.00,0.00,1.00, 
Seq_783,1.50,0.00,1.00,1.00,1.00,1.00,0.00,1.00,1.00,1.00,0.00,1.00,1.00,1.00,1.00,1.33,1.00,1.00,1.00,1.40, 
Seq_784,1.00,1.00,1.00,1.00,1.00,1.50,1.00,0.00,1.00,1.00,1.00,1.00,1.00,1.00,1.89,1.00,1.33,1.50,0.00,0.00, 
Seq_785,0.00,1.50,0.00,1.00,1.00,1.00,1.00,0.00,0.00,0.00,1.00,1.00,1.00,1.00,1.00,1.00,1.00,1.40,1.50,1.00, 
Seq_786,1.00,1.00,1.00,0.00,1.00,1.00,1.00,1.00,1.20,1.25,0.00,1.00,1.00,1.00,1.00,1.00,1.00,1.00,1.00,1.67, 
Seq_787,1.00,1.40,0.00,0.00,0.00,1.00,1.00,0.00,1.00,0.00,0.00,0.00,1.00,1.00,1.00,0.00,0.00,0.00,1.00,1.00, 
Seq_788,0.00,1.29,1.00,1.00,1.00,1.00,1.00,1.00,1.00,1.00,1.00,1.00,1.00,1.00,1.00,2.00,1.00,1.00,1.00,0.00, 
Seq_789,0.00,0.00,1.00,1.00,1.50,1.00,0.00,1.00,1.00,1.29,0.00,0.00,0.00,1.00,1.29,1.00,0.00,0.00,0.00,0.00, 
Seq_790,1.00,0.00,0.00,0.00,1.00,1.40,0.00,1.00,1.00,1.33,0.00,0.00,0.00,1.00,0.00,1.00,1.00,1.00,0.00,0.00, 
Seq_791,0.00,0.00,1.00,0.00,1.00,1.00,1.00,0.00,1.00,1.00,1.00,0.00,1.00,0.00,1.50,1.00,1.00,1.00,0.00,1.00, 
Seq_792,1.00,0.00,0.00,1.00,0.00,1.50,0.00,1.00,1.57,1.00,0.00,1.00,1.00,1.00,1.00,1.40,1.00,0.00,1.00,1.00, 
Seq_793,1.00,1.29,0.00,1.40,1.00,1.50,0.00,1.00,1.00,0.00,1.00,1.00,1.00,1.00,1.00,1.00,1.00,1.00,0.00,1.00, 
Seq_794,1.00,1.00,0.00,1.00,1.00,1.00,1.00,1.00,1.00,1.00,0.00,1.89,1.00,1.00,1.00,1.00,1.00,1.00,1.00,1.00, 
Seq_795,1.40,1.29,1.00,0.00,1.00,1.29,1.00,0.00,1.00,1.57,0.00,1.00,1.40,1.00,1.00,1.00,1.00,1.00,0.00,0.00, 
Seq_796,2.00,1.00,0.00,0.00,1.00,1.00,0.00,1.40,1.40,1.00,0.00,0.00,1.00,1.00,0.00,1.00,0.00,1.67,0.00,0.00, 
Seq_797,1.00,0.00,1.00,1.00,0.00,1.00,0.00,0.00,1.40,1.00,0.00,1.00,0.00,0.00,1.00,1.00,0.00,1.00,0.00,0.00, 
Seq_798,2.14,0.00,1.00,1.22,1.00,1.33,1.00,1.00,1.00,1.00,0.00,1.00,1.36,1.00,1.00,1.00,1.00,1.00,1.00,1.00, 
Seq_799,1.00,0.00,1.00,0.00,0.00,0.00,1.00,1.00,1.00,1.00,0.00,0.00,0.00,1.00,0.00,1.00,1.00,1.67,0.00,0.00, 
Seq_800,1.00,0.00,0.00,0.00,0.00,1.00,0.00,1.00,1.50,1.00,0.00,0.00,1.00,1.00,0.00,1.00,1.00,1.22,0.00,0.00, 
Seq_801,0.00,1.00,1.00,0.00,0.00,0.00,1.00,0.00,0.00,1.00,1.00,1.00,1.00,0.00,0.00,1.00,1.00,0.00,0.00,0.00, 
Seq_802,1.82,0.00,0.00,1.00,0.00,1.00,0.00,1.00,1.00,1.00,0.00,0.00,0.00,0.00,0.00,1.00,0.00,1.00,1.00,0.00, 
Seq_803,1.00,1.00,0.00,1.00,0.00,1.00,0.00,1.50,0.00,1.00,0.00,0.00,0.00,0.00,1.00,3.22,1.00,0.00,1.00,0.00, 
Seq_804,1.00,1.00,1.00,1.00,1.00,1.00,1.00,1.00,1.00,0.00,0.00,1.00,0.00,1.00,1.00,1.00,1.00,1.00,1.00,0.00, 
Seq_805,1.00,1.00,1.00,0.00,1.00,1.40,1.00,0.00,1.00,1.50,0.00,1.50,1.00,0.00,1.00,1.00,1.00,1.33,0.00,0.00, 
Seq_806,1.00,1.50,1.00,0.00,1.00,1.33,1.00,1.00,1.00,1.00,0.00,1.00,1.91,0.00,1.00,1.00,1.00,1.40,0.00,1.00, 
Seq_807,1.50,1.00,1.00,0.00,0.00,1.00,0.00,1.00,1.00,1.40,1.00,1.00,0.00,1.00,0.00,1.00,1.00,1.00,0.00,0.00, 
Seq_808,1.00,1.29,0.00,1.00,1.00,1.00,1.00,1.00,0.00,1.00,0.00,0.00,1.00,0.00,1.46,0.00,0.00,1.67,0.00,0.00, 
Seq_809,1.94,0.00,0.00,0.00,0.00,0.00,0.00,0.00,1.62,0.00,0.00,0.00,1.00,0.00,0.00,1.00,1.00,1.00,0.00,0.00, 
Seq_810,1.00,1.00,1.00,0.00,1.00,1.36,1.00,1.00,1.00,1.00,1.00,1.00,1.00,0.00,0.00,1.00,1.50,1.00,1.00,1.50, 
Seq_811,1.00,1.00,0.00,0.00,0.00,1.00,1.00,0.00,1.00,1.00,0.00,0.00,0.00,0.00,1.25,1.00,0.00,1.00,0.00,1.40, 
Seq_812,1.00,1.00,0.00,1.00,1.00,1.57,0.00,1.00,1.40,1.00,0.00,1.00,1.00,0.00,0.00,1.00,1.00,1.00,1.00,0.00, 
Seq_813,1.00,0.00,0.00,1.00,0.00,1.00,1.00,1.00,1.00,1.33,0.00,0.00,1.00,0.00,0.00,1.00,0.00,1.29,0.00,0.00, 
Seq_814,1.00,1.29,0.00,1.00,1.00,1.00,0.00,1.00,1.44,1.00,0.00,1.00,0.00,0.00,1.00,1.00,1.00,1.00,0.00,1.00, 
Seq_815,1.00,0.00,0.00,0.00,0.00,1.00,0.00,0.00,0.00,0.00,0.00,0.00,2.67,0.00,1.00,0.00,0.00,0.00,0.00,0.00, 
Seq_816,1.00,1.22,1.00,1.00,1.00,1.00,0.00,1.40,1.33,1.00,1.00,1.00,1.22,1.00,1.00,1.00,1.00,1.00,0.00,0.00, 
Seq_817,1.00,0.00,1.00,0.00,1.67,1.00,1.00,0.00,1.33,1.00,0.00,1.50,0.00,0.00,1.29,0.00,1.00,1.00,1.00,1.00, 
Seq_818,1.50,1.00,1.00,0.00,1.00,1.50,0.00,1.00,0.00,1.00,0.00,1.00,1.00,1.00,0.00,1.00,1.00,1.00,0.00,0.00, 
Seq_819,1.00,0.00,1.00,0.00,1.00,1.50,0.00,1.67,1.67,1.00,0.00,0.00,0.00,0.00,0.00,1.00,0.00,1.50,0.00,0.00, 
Seq_820,0.00,0.00,0.00,0.00,0.00,1.00,1.00,1.00,1.00,1.00,1.00,0.00,0.00,0.00,1.00,1.00,0.00,0.00,1.00,0.00, 
Seq_821,0.00,0.00,1.00,0.00,1.00,0.00,0.00,1.00,1.00,1.00,0.00,0.00,0.00,1.00,1.00,0.00,0.00,1.00,0.00,0.00, 
Seq_822,1.25,0.00,1.00,1.33,1.00,1.00,0.00,1.00,1.18,1.00,1.00,1.00,1.57,1.00,1.00,1.00,1.00,1.00,1.00,1.00, 
Seq_823,0.00,1.00,0.00,0.00,1.00,1.00,0.00,1.00,0.00,1.00,0.00,0.00,0.00,0.00,1.33,0.00,1.00,1.00,0.00,0.00, 
Seq_824,1.00,1.29,0.00,0.00,1.00,1.00,0.00,1.00,1.00,1.00,1.00,1.00,1.00,1.00,1.44,1.00,1.00,1.00,0.00,0.00, 
Seq_825,1.00,1.18,1.00,1.00,1.00,1.00,1.00,1.00,1.00,1.00,0.00,1.00,1.00,1.00,1.67,1.00,1.00,1.00,1.00,0.00, 
Seq_826,1.00,0.00,1.00,0.00,1.00,1.00,0.00,1.00,1.67,1.00,0.00,1.00,0.00,0.00,0.00,0.00,1.00,1.40,0.00,0.00, 
Seq_827,1.00,1.00,0.00,1.00,1.00,1.00,0.00,1.00,1.00,1.00,1.00,1.00,0.00,0.00,0.00,1.00,1.00,1.00,0.00,1.00, 
Seq_828,1.00,0.00,0.00,0.00,1.00,0.00,0.00,1.00,1.00,1.00,0.00,1.00,0.00,0.00,1.00,0.00,1.67,0.00,1.00,0.00, 
Seq_829,0.00,0.00,0.00,1.00,0.00,1.00,0.00,1.00,0.00,0.00,0.00,0.00,1.00,1.00,1.00,1.00,0.00,0.00,0.00,0.00, 
Seq_830,1.00,1.00,1.00,1.00,1.00,1.00,1.00,1.00,1.00,1.00,1.00,1.29,1.00,1.00,1.67,1.00,1.00,1.00,1.00,1.00, 
Seq_831,1.67,1.00,1.00,0.00,0.00,1.00,0.00,0.00,1.00,1.67,0.00,1.00,1.00,1.00,1.29,1.00,0.00,0.00,1.00,0.00, 
Seq_832,0.00,1.00,1.00,1.00,0.00,1.00,0.00,0.00,1.00,1.50,0.00,1.00,0.00,0.00,1.00,1.00,1.29,1.00,0.00,1.00, 
Seq_833,1.00,0.00,0.00,0.00,1.00,1.00,0.00,1.00,1.40,1.29,1.00,0.00,1.00,0.00,1.00,1.00,0.00,1.00,0.00,0.00, 
Seq_834,0.00,0.00,0.00,1.00,1.00,1.00,0.00,1.00,1.00,1.00,0.00,0.00,0.00,0.00,0.00,1.00,0.00,0.00,1.00,0.00, 
Seq_835,0.00,1.00,0.00,0.00,1.00,1.00,0.00,1.00,1.50,1.00,0.00,0.00,0.00,0.00,0.00,1.00,0.00,1.00,0.00,0.00, 
Seq_836,1.44,0.00,0.00,0.00,1.00,1.22,0.00,1.25,1.00,1.00,1.00,1.00,0.00,1.00,1.00,1.00,1.20,1.00,1.00,1.00, 
Seq_837,0.00,0.00,0.00,0.00,1.00,1.00,1.00,1.00,1.33,1.00,1.00,0.00,0.00,0.00,1.00,1.00,1.00,1.00,0.00,1.00, 
Seq_838,0.00,1.00,0.00,0.00,0.00,0.00,0.00,1.00,0.00,1.00,0.00,0.00,0.00,0.00,1.00,0.00,0.00,1.50,0.00,0.00, 
Seq_839,0.00,0.00,0.00,0.00,0.00,1.00,0.00,0.00,1.44,1.86,0.00,0.00,0.00,0.00,0.00,0.00,0.00,0.00,0.00,0.00, 
Seq_840,0.00,1.00,1.00,1.00,1.00,1.33,0.00,1.00,0.00,1.00,0.00,1.00,1.00,0.00,1.00,1.00,1.00,1.00,1.00,0.00, 
Seq_841,1.00,0.00,0.00,1.00,0.00,0.00,0.00,0.00,1.29,1.00,1.00,0.00,0.00,1.00,1.00,1.00,0.00,0.00,1.00,1.00, 
Seq_842,1.00,1.00,0.00,1.00,1.33,1.00,1.00,0.00,1.00,1.00,0.00,0.00,1.00,0.00,1.00,1.00,1.00,1.00,1.00,0.00, 
Seq_843,1.00,1.00,0.00,1.00,1.00,1.00,0.00,1.00,1.00,0.00,0.00,1.00,1.00,0.00,1.00,1.00,1.00,1.00,0.00,1.00, 
Seq_844,1.00,0.00,1.00,1.00,1.00,1.00,1.40,0.00,1.00,1.00,0.00,1.89,0.00,1.00,1.00,1.29,1.00,1.33,1.00,1.33, 
Seq_845,0.00,1.00,0.00,0.00,1.00,0.00,0.00,1.00,1.00,1.00,1.00,0.00,1.00,0.00,1.00,0.00,0.00,1.00,0.00,0.00, 
Seq_846,0.00,1.50,0.00,0.00,0.00,1.00,1.00,0.00,1.00,1.00,0.00,1.00,0.00,1.00,1.00,1.00,0.00,0.00,1.00,0.00, 
Seq_847,1.50,1.00,0.00,0.00,1.00,0.00,0.00,1.40,1.50,1.00,1.00,0.00,1.00,0.00,1.00,1.00,1.00,1.67,0.00,0.00, 
Seq_848,1.56,0.00,1.00,1.00,0.00,1.00,0.00,0.00,1.33,1.00,0.00,1.00,1.00,1.00,1.33,1.00,1.00,1.00,0.00,0.00, 
