ID,PCP_SS_HE,PCP_SS_ST
Seq_1,0.667,0.152
Seq_2,0.235,0.294
Seq_3,0.333,0.333
Seq_4,0.347,0.367
Seq_5,0.412,0.324
Seq_6,0.278,0.222
Seq_7,0.333,0.167
Seq_8,0.417,0.583
Seq_9,0.233,0.279
Seq_10,0.541,0.243
Seq_11,0.385,0.385
Seq_12,0.385,0.385
Seq_13,0.375,0.312
Seq_14,0.375,0.312
Seq_15,0.312,0.375
Seq_16,0.375,0.375
Seq_17,0.312,0.375
Seq_18,0.312,0.375
Seq_19,0.353,0.353
Seq_20,0.353,0.353
Seq_21,0.294,0.412
Seq_22,0.333,0.167
Seq_23,0.385,0.154
Seq_24,0.52,0.36
Seq_25,0.647,0.294
Seq_26,0.524,0.238
Seq_27,0.25,0.386
Seq_28,0.514,0.243
Seq_29,0.541,0.243
Seq_30,0.556,0.25
Seq_31,0.538,0.269
Seq_32,0.289,0.395
Seq_33,0.275,0.475
Seq_34,0.286,0.452
Seq_35,0.341,0.39
Seq_36,0.262,0.405
Seq_37,0.286,0.476
Seq_38,0.325,0.425
Seq_39,0.316,0.447
Seq_40,0.35,0.425
Seq_41,0.4,0.325
Seq_42,0.263,0.368
Seq_43,0.237,0.395
Seq_44,0.214,0.381
Seq_45,0.625,0.083
Seq_46,0.556,0.111
Seq_47,0.556,0.111
Seq_48,0.6,0.12
Seq_49,0.48,0.2
Seq_50,0.593,0.074
Seq_51,0.4,0.25
Seq_52,0.45,0.2
Seq_53,0.4,0.25
Seq_54,0.481,0.259
Seq_55,0.444,0.296
Seq_56,0.556,0.185
Seq_57,0.593,0.148
Seq_58,0.481,0.296
Seq_59,0.4,0.25
Seq_60,0.4,0.2
Seq_61,0.45,0.15
Seq_62,0.588,0.353
Seq_63,0.529,0.294
Seq_64,0.588,0.294
Seq_65,0.471,0.353
Seq_66,0.529,0.176
Seq_67,0.375,0.5
Seq_68,0.478,0.391
Seq_69,0.5,0.333
Seq_70,0.458,0.417
Seq_71,0.515,0.212
Seq_72,0.391,0.304
Seq_73,0.413,0.283
Seq_74,0.568,0.216
Seq_75,0.576,0.212
Seq_76,0.545,0.242
Seq_77,0.545,0.273
Seq_78,0.459,0.297
Seq_79,0.417,0.417
Seq_80,0.417,0.375
Seq_81,0.394,0.303
Seq_82,0.576,0.212
Seq_83,0.459,0.27
Seq_84,0.385,0.308
Seq_85,0.538,0.154
Seq_86,0.385,0.231
Seq_87,0.385,0.308
Seq_88,0.231,0.462
Seq_89,0.385,0.462
Seq_90,0.381,0.333
Seq_91,0.467,0.356
Seq_92,0.462,0.385
Seq_93,0.538,0.231
Seq_94,0.538,0.231
Seq_95,0.538,0.308
Seq_96,0.615,0.154
Seq_97,0.5,0.286
Seq_98,0.5,0.286
Seq_99,0.462,0.231
Seq_100,0.455,0.212
Seq_101,0.44,0.28
Seq_102,0.516,0.226
Seq_103,0.312,0.344
Seq_104,0.375,0.458
Seq_105,0.469,0.25
Seq_106,0.438,0.312
Seq_107,0.464,0.286
Seq_108,0.5,0.25
Seq_109,0.48,0.24
Seq_110,0.556,0.185
Seq_111,0.548,0.194
Seq_112,0.514,0.27
Seq_113,0.583,0.167
Seq_114,0.543,0.286
Seq_115,0.514,0.286
Seq_116,0.538,0.282
Seq_117,0.59,0.231
Seq_118,0.556,0.25
Seq_119,0.564,0.308
Seq_120,0.564,0.308
Seq_121,0.543,0.2
Seq_122,0.516,0.194
Seq_123,0.538,0.308
Seq_124,0.538,0.385
Seq_125,0.514,0.343
Seq_126,0.543,0.314
Seq_127,0.486,0.324
Seq_128,0.842,0.0
Seq_129,0.909,0.091
Seq_130,0.435,0.261
Seq_131,0.25,0.333
Seq_132,0.5,0.308
Seq_133,0.476,0.286
Seq_134,0.373,0.392
Seq_135,0.281,0.406
Seq_136,0.308,0.462
Seq_137,0.278,0.611
Seq_138,0.385,0.462
Seq_139,0.36,0.44
Seq_140,0.273,0.432
Seq_141,0.517,0.276
Seq_142,0.333,0.556
Seq_143,0.647,0.176
Seq_144,0.618,0.206
Seq_145,0.633,0.133
Seq_146,0.714,0.179
Seq_147,0.552,0.276
Seq_148,0.577,0.192
Seq_149,0.464,0.286
Seq_150,0.533,0.167
Seq_151,0.607,0.179
Seq_152,0.52,0.28
Seq_153,0.368,0.263
Seq_154,0.312,0.125
Seq_155,0.25,0.25
Seq_156,0.25,0.25
Seq_157,0.269,0.231
Seq_158,0.316,0.211
Seq_159,0.3,0.6
Seq_160,0.29,0.613
Seq_161,0.579,0.132
Seq_162,0.367,0.5
Seq_163,0.345,0.517
Seq_164,0.333,0.5
Seq_165,0.273,0.545
Seq_166,0.406,0.406
Seq_167,0.281,0.531
Seq_168,0.342,0.368
Seq_169,0.486,0.286
Seq_170,0.636,0.182
Seq_171,0.364,0.394
Seq_172,0.412,0.382
Seq_173,0.545,0.333
Seq_174,0.545,0.333
Seq_175,0.303,0.424
Seq_176,0.417,0.333
Seq_177,0.5,0.444
Seq_178,0.25,0.6
Seq_179,0.24,0.56
Seq_180,0.267,0.367
Seq_181,0.389,0.444
Seq_182,0.405,0.333
Seq_183,0.477,0.341
Seq_184,0.27,0.324
Seq_185,0.571,0.286
Seq_186,0.786,0.143
Seq_187,0.222,0.333
Seq_188,0.243,0.324
Seq_189,0.294,0.412
Seq_190,0.324,0.412
Seq_191,0.344,0.438
Seq_192,0.471,0.324
Seq_193,0.562,0.281
Seq_194,0.458,0.25
Seq_195,0.667,0.143
Seq_196,0.389,0.556
Seq_197,0.389,0.556
Seq_198,0.353,0.588
Seq_199,0.353,0.588
Seq_200,0.353,0.588
Seq_201,0.35,0.3
Seq_202,0.353,0.382
Seq_203,0.375,0.5
Seq_204,0.333,0.444
Seq_205,0.278,0.5
Seq_206,0.333,0.444
Seq_207,0.406,0.438
Seq_208,0.375,0.438
Seq_209,0.379,0.345
Seq_210,0.387,0.387
Seq_211,0.392,0.314
Seq_212,0.375,0.3
Seq_213,0.529,0.353
Seq_214,0.325,0.375
Seq_215,0.564,0.256
Seq_216,0.538,0.308
Seq_217,0.564,0.282
Seq_218,0.5,0.325
Seq_219,0.511,0.149
Seq_220,0.316,0.395
Seq_221,0.277,0.426
Seq_222,0.52,0.24
Seq_223,0.48,0.28
Seq_224,0.48,0.28
Seq_225,0.48,0.28
Seq_226,0.48,0.24
Seq_227,0.4,0.36
Seq_228,0.458,0.333
Seq_229,0.542,0.25
Seq_230,0.5,0.292
Seq_231,0.417,0.333
Seq_232,0.44,0.16
Seq_233,0.48,0.16
Seq_234,0.48,0.2
Seq_235,0.48,0.16
Seq_236,0.455,0.273
Seq_237,0.5,0.273
Seq_238,0.5,0.273
Seq_239,0.5,0.273
Seq_240,0.435,0.217
Seq_241,0.478,0.217
Seq_242,0.435,0.217
Seq_243,0.5,0.364
Seq_244,0.565,0.217
Seq_245,0.278,0.5
Seq_246,0.577,0.192
Seq_247,0.385,0.359
Seq_248,0.364,0.364
Seq_249,0.4,0.375
Seq_250,0.306,0.417
Seq_251,0.421,0.289
Seq_252,0.32,0.28
Seq_253,0.366,0.293
Seq_254,0.233,0.256
Seq_255,0.351,0.27
Seq_256,0.324,0.412
Seq_257,0.233,0.433
Seq_258,0.194,0.484
Seq_259,0.304,0.478
Seq_260,0.304,0.478
Seq_261,0.304,0.478
Seq_262,0.348,0.435
Seq_263,0.391,0.391
Seq_264,0.588,0.176
Seq_265,0.226,0.484
Seq_266,0.467,0.333
Seq_267,0.576,0.212
Seq_268,0.438,0.375
Seq_269,0.333,0.353
Seq_270,0.353,0.353
Seq_271,0.333,0.286
Seq_272,0.28,0.44
Seq_273,0.348,0.391
Seq_274,0.333,0.375
Seq_275,0.237,0.368
Seq_276,0.548,0.258
Seq_277,0.318,0.386
Seq_278,0.348,0.261
Seq_279,0.404,0.319
Seq_280,0.383,0.319
Seq_281,0.25,0.389
Seq_282,0.359,0.385
Seq_283,0.385,0.385
Seq_284,0.39,0.293
Seq_285,0.143,0.524
Seq_286,0.182,0.636
Seq_287,0.333,0.5
Seq_288,0.25,0.583
Seq_289,0.273,0.545
Seq_290,0.564,0.154
Seq_291,0.571,0.19
Seq_292,0.556,0.259
Seq_293,0.514,0.27
Seq_294,0.391,0.348
Seq_295,0.543,0.286
Seq_296,0.303,0.424
Seq_297,0.394,0.242
Seq_298,0.316,0.368
Seq_299,0.368,0.316
Seq_300,0.368,0.316
Seq_301,0.316,0.368
Seq_302,0.316,0.368
Seq_303,0.316,0.368
Seq_304,0.421,0.316
Seq_305,0.353,0.471
Seq_306,0.294,0.412
Seq_307,0.412,0.353
Seq_308,0.294,0.412
Seq_309,0.308,0.462
Seq_310,0.474,0.263
Seq_311,0.421,0.263
Seq_312,0.562,0.312
Seq_313,0.562,0.312
Seq_314,0.441,0.353
Seq_315,0.412,0.412
Seq_316,0.538,0.077
Seq_317,0.5,0.25
Seq_318,0.529,0.176
Seq_319,0.526,0.158
Seq_320,0.56,0.28
Seq_321,0.56,0.28
Seq_322,0.55,0.25
Seq_323,0.342,0.342
Seq_324,0.529,0.265
Seq_325,0.333,0.167
Seq_326,0.48,0.28
Seq_327,0.486,0.314
Seq_328,0.543,0.257
Seq_329,0.486,0.314
Seq_330,0.457,0.371
Seq_331,0.432,0.351
Seq_332,0.312,0.375
Seq_333,0.312,0.375
Seq_334,0.312,0.375
Seq_335,0.395,0.349
Seq_336,0.525,0.175
Seq_337,0.455,0.273
Seq_338,0.143,0.714
Seq_339,0.571,0.238
Seq_340,0.281,0.281
Seq_341,0.312,0.281
Seq_342,0.344,0.25
Seq_343,0.333,0.133
Seq_344,0.267,0.2
Seq_345,0.312,0.25
Seq_346,0.312,0.188
Seq_347,0.593,0.222
Seq_348,0.393,0.321
Seq_349,0.588,0.206
Seq_350,0.435,0.435
Seq_351,0.459,0.297
Seq_352,0.541,0.162
Seq_353,0.463,0.293
Seq_354,0.476,0.286
Seq_355,0.477,0.25
Seq_356,0.667,0.1
Seq_357,0.6,0.2
Seq_358,0.6,0.167
Seq_359,0.586,0.207
Seq_360,0.567,0.2
Seq_361,0.444,0.222
Seq_362,0.421,0.211
Seq_363,0.667,0.167
Seq_364,0.625,0.208
Seq_365,0.644,0.111
Seq_366,0.56,0.2
Seq_367,0.56,0.2
Seq_368,0.5,0.308
Seq_369,0.538,0.269
Seq_370,0.5,0.292
Seq_371,0.4,0.4
Seq_372,0.3,0.36
Seq_373,0.26,0.36
Seq_374,0.255,0.383
Seq_375,0.308,0.179
Seq_376,0.308,0.385
Seq_377,0.385,0.385
Seq_378,0.72,0.2
Seq_379,0.472,0.222
Seq_380,0.378,0.333
Seq_381,0.34,0.362
Seq_382,0.389,0.444
Seq_383,0.462,0.308
Seq_384,0.545,0.152
Seq_385,0.385,0.385
Seq_386,0.357,0.429
Seq_387,0.255,0.4
Seq_388,0.586,0.172
Seq_389,0.586,0.172
Seq_390,0.406,0.312
Seq_391,0.417,0.361
Seq_392,0.595,0.216
Seq_393,0.519,0.148
Seq_394,0.277,0.383
Seq_395,0.234,0.404
Seq_396,0.327,0.418
Seq_397,0.327,0.4
Seq_398,0.556,0.185
Seq_399,0.4,0.28
Seq_400,0.5,0.182
Seq_401,0.556,0.111
Seq_402,0.385,0.385
Seq_403,0.643,0.214
Seq_404,0.5,0.286
Seq_405,0.468,0.149
Seq_406,0.4,0.2
Seq_407,0.452,0.323
Seq_408,0.4,0.32
Seq_409,0.351,0.405
Seq_410,0.256,0.385
Seq_411,0.303,0.485
Seq_412,0.394,0.455
Seq_413,0.323,0.452
Seq_414,0.364,0.455
Seq_415,0.367,0.5
Seq_416,0.382,0.412
Seq_417,0.333,0.556
Seq_418,0.7,0.1
Seq_419,0.786,0.143
Seq_420,0.385,0.308
Seq_421,0.417,0.583
Seq_422,0.306,0.417
Seq_423,0.417,0.417
Seq_424,0.417,0.375
Seq_425,0.417,0.375
Seq_426,0.333,0.5
Seq_427,0.3,0.5
Seq_428,0.414,0.345
Seq_429,0.379,0.345
Seq_430,0.412,0.529
Seq_431,0.375,0.458
Seq_432,0.542,0.292
Seq_433,0.5,0.333
Seq_434,0.458,0.375
Seq_435,0.5,0.333
Seq_436,0.417,0.417
Seq_437,0.458,0.375
Seq_438,0.417,0.417
Seq_439,0.417,0.375
Seq_440,0.375,0.458
Seq_441,0.375,0.458
Seq_442,0.333,0.458
Seq_443,0.364,0.5
Seq_444,0.364,0.409
Seq_445,0.542,0.25
Seq_446,0.542,0.25
Seq_447,0.478,0.304
Seq_448,0.478,0.304
Seq_449,0.263,0.342
Seq_450,0.143,0.429
Seq_451,0.355,0.29
Seq_452,0.571,0.179
Seq_453,0.348,0.413
Seq_454,0.5,0.333
Seq_455,0.629,0.257
Seq_456,0.629,0.229
Seq_457,0.6,0.257
Seq_458,0.629,0.229
Seq_459,0.529,0.176
Seq_460,0.4,0.25
Seq_461,0.4,0.25
Seq_462,0.762,0.095
Seq_463,0.64,0.2
Seq_464,0.667,0.278
Seq_465,0.267,0.244
Seq_466,0.632,0.211
Seq_467,0.3,0.3
Seq_468,0.647,0.206
Seq_469,0.4,0.533
Seq_470,0.529,0.118
Seq_471,0.565,0.087
Seq_472,0.391,0.391
Seq_473,0.35,0.45
Seq_474,0.65,0.25
Seq_475,0.667,0.125
Seq_476,1.0,0.0
Seq_477,0.381,0.286
Seq_478,0.515,0.182
Seq_479,0.733,0.267
Seq_480,0.5,0.3
Seq_481,0.286,0.036
Seq_482,0.211,0.079
Seq_483,0.4,0.45
Seq_484,0.5,0.35
Seq_485,0.45,0.4
Seq_486,0.76,0.16
Seq_487,0.63,0.259
Seq_488,0.45,0.4
Seq_489,0.35,0.4
Seq_490,0.562,0.156
Seq_491,0.5,0.25
Seq_492,0.5,0.286
Seq_493,0.667,0.167
Seq_494,0.293,0.39
Seq_495,0.4,0.25
Seq_496,0.4,0.25
Seq_497,0.35,0.25
Seq_498,0.25,0.531
Seq_499,0.276,0.483
Seq_500,0.571,0.143
Seq_501,0.3,0.4
Seq_502,0.52,0.2
Seq_503,0.25,0.45
Seq_504,0.589,0.196
Seq_505,0.7,0.033
Seq_506,0.611,0.167
Seq_507,0.316,0.368
Seq_508,0.56,0.16
Seq_509,0.643,0.214
Seq_510,0.5,0.25
Seq_511,0.48,0.24
Seq_512,0.636,0.227
Seq_513,0.619,0.19
Seq_514,0.474,0.263
Seq_515,0.444,0.222
Seq_516,0.444,0.37
Seq_517,0.275,0.35
Seq_518,0.283,0.435
Seq_519,0.37,0.37
Seq_520,0.5,0.262
Seq_521,0.579,0.105
Seq_522,0.381,0.333
Seq_523,0.462,0.423
Seq_524,0.326,0.349
Seq_525,0.2,0.44
Seq_526,0.171,0.457
Seq_527,0.5,0.25
Seq_528,0.432,0.295
Seq_529,0.362,0.34
Seq_530,0.412,0.412
Seq_531,0.412,0.471
Seq_532,0.424,0.242
Seq_533,0.4,0.467
Seq_534,0.395,0.289
Seq_535,0.6,0.25
Seq_536,0.5,0.385
Seq_537,0.462,0.385
Seq_538,0.393,0.393
Seq_539,0.457,0.304
Seq_540,0.37,0.348
Seq_541,0.455,0.212
Seq_542,0.424,0.242
Seq_543,0.541,0.297
Seq_544,0.5,0.333
Seq_545,0.381,0.238
Seq_546,0.381,0.286
Seq_547,0.333,0.238
Seq_548,0.559,0.176
Seq_549,0.567,0.267
Seq_550,0.692,0.192
Seq_551,0.323,0.323
Seq_552,0.538,0.231
Seq_553,0.424,0.303
Seq_554,0.409,0.227
Seq_555,0.385,0.385
Seq_556,0.469,0.281
Seq_557,0.542,0.333
Seq_558,0.462,0.231
Seq_559,0.462,0.231
Seq_560,0.5,0.286
Seq_561,0.538,0.231
Seq_562,0.381,0.333
Seq_563,0.478,0.261
Seq_564,0.6,0.3
Seq_565,0.6,0.3
Seq_566,0.6,0.25
Seq_567,0.457,0.304
Seq_568,0.429,0.214
Seq_569,0.455,0.212
Seq_570,0.583,0.333
Seq_571,0.394,0.273
Seq_572,0.378,0.297
Seq_573,0.286,0.357
Seq_574,0.448,0.379
Seq_575,0.5,0.286
Seq_576,0.63,0.222
Seq_577,0.63,0.222
Seq_578,0.258,0.452
Seq_579,0.29,0.419
Seq_580,0.271,0.354
Seq_581,0.271,0.354
Seq_582,0.526,0.263
Seq_583,0.5,0.3
Seq_584,0.533,0.267
Seq_585,0.548,0.258
Seq_586,0.565,0.261
Seq_587,0.552,0.276
Seq_588,0.279,0.279
Seq_589,0.25,0.318
Seq_590,0.256,0.326
Seq_591,0.295,0.364
Seq_592,0.297,0.297
Seq_593,0.349,0.326
Seq_594,0.317,0.293
Seq_595,0.455,0.182
Seq_596,0.5,0.154
Seq_597,0.333,0.333
Seq_598,0.394,0.242
Seq_599,0.333,0.273
Seq_600,0.364,0.273
Seq_601,0.364,0.242
Seq_602,0.333,0.273
Seq_603,0.36,0.4
Seq_604,0.458,0.375
Seq_605,0.417,0.458
Seq_606,0.37,0.37
Seq_607,0.348,0.413
Seq_608,0.486,0.216
Seq_609,0.5,0.286
Seq_610,0.5,0.25
Seq_611,0.464,0.286
Seq_612,0.429,0.286
Seq_613,0.464,0.286
Seq_614,0.481,0.259
Seq_615,0.385,0.308
Seq_616,0.435,0.348
Seq_617,0.458,0.208
Seq_618,0.486,0.243
Seq_619,0.432,0.27
Seq_620,0.341,0.318
Seq_621,0.217,0.565
Seq_622,0.083,0.458
Seq_623,0.46,0.32
Seq_624,0.459,0.243
Seq_625,0.535,0.302
Seq_626,0.553,0.237
Seq_627,0.432,0.243
Seq_628,0.545,0.242
Seq_629,0.256,0.256
Seq_630,0.481,0.077
Seq_631,0.429,0.357
Seq_632,0.692,0.154
Seq_633,0.593,0.222
Seq_634,0.575,0.225
Seq_635,0.486,0.297
Seq_636,0.433,0.333
Seq_637,0.435,0.261
Seq_638,0.462,0.231
Seq_639,0.231,0.462
Seq_640,0.231,0.385
Seq_641,0.391,0.348
Seq_642,0.435,0.304
Seq_643,0.391,0.348
Seq_644,0.4,0.2
Seq_645,0.429,0.19
Seq_646,0.6,0.1
Seq_647,0.524,0.143
Seq_648,0.619,0.095
Seq_649,0.571,0.143
Seq_650,0.421,0.105
Seq_651,0.471,0.353
Seq_652,0.324,0.324
Seq_653,0.282,0.436
Seq_654,0.378,0.351
Seq_655,0.378,0.378
Seq_656,0.27,0.432
Seq_657,0.333,0.422
Seq_658,0.326,0.435
Seq_659,0.708,0.125
Seq_660,0.545,0.273
Seq_661,0.444,0.444
Seq_662,0.222,0.667
Seq_663,0.182,0.273
Seq_664,0.381,0.571
Seq_665,0.381,0.571
Seq_666,0.103,0.517
Seq_667,0.368,0.395
Seq_668,0.368,0.368
Seq_669,0.541,0.27
Seq_670,0.568,0.27
Seq_671,0.514,0.216
Seq_672,0.568,0.216
Seq_673,0.346,0.231
Seq_674,0.435,0.217
Seq_675,0.391,0.217
Seq_676,0.391,0.217
Seq_677,0.286,0.381
Seq_678,0.342,0.395
Seq_679,0.317,0.293
Seq_680,0.4,0.325
Seq_681,0.265,0.324
Seq_682,0.265,0.324
Seq_683,0.27,0.324
Seq_684,0.405,0.238
Seq_685,0.31,0.31
Seq_686,0.256,0.395
Seq_687,0.273,0.386
Seq_688,0.647,0.196
Seq_689,0.538,0.256
Seq_690,0.583,0.167
Seq_691,0.421,0.368
Seq_692,0.474,0.211
Seq_693,0.4,0.3
Seq_694,0.474,0.263
Seq_695,0.471,0.294
Seq_696,0.474,0.316
Seq_697,0.56,0.2
Seq_698,0.542,0.292
Seq_699,0.348,0.391
Seq_700,0.534,0.259
Seq_701,0.48,0.32
Seq_702,0.476,0.238
Seq_703,0.435,0.261
Seq_704,0.688,0.125
Seq_705,0.432,0.297
Seq_706,0.459,0.243
Seq_707,0.541,0.189
Seq_708,0.405,0.297
Seq_709,0.458,0.208
Seq_710,0.5,0.25
Seq_711,0.577,0.192
Seq_712,0.449,0.306
Seq_713,0.5,0.25
Seq_714,0.52,0.24
Seq_715,0.56,0.32
Seq_716,0.526,0.316
Seq_717,0.48,0.28
Seq_718,0.44,0.32
Seq_719,0.696,0.217
Seq_720,0.423,0.308
Seq_721,0.571,0.19
Seq_722,0.684,0.158
Seq_723,0.652,0.13
Seq_724,0.5,0.292
Seq_725,0.4,0.25
Seq_726,0.4,0.25
Seq_727,0.412,0.176
Seq_728,0.444,0.222
Seq_729,0.444,0.222
Seq_730,0.474,0.211
Seq_731,0.407,0.259
Seq_732,0.524,0.19
Seq_733,0.68,0.12
Seq_734,0.692,0.154
Seq_735,0.714,0.143
Seq_736,0.222,0.667
Seq_737,0.35,0.5
Seq_738,0.136,0.636
Seq_739,0.35,0.35
Seq_740,0.425,0.3
Seq_741,0.517,0.138
Seq_742,0.278,0.306
Seq_743,0.387,0.258
Seq_744,0.387,0.258
Seq_745,0.355,0.29
Seq_746,0.615,0.154
Seq_747,0.385,0.385
Seq_748,0.538,0.231
Seq_749,0.462,0.231
Seq_750,0.438,0.25
Seq_751,0.455,0.273
Seq_752,0.214,0.5
Seq_753,0.286,0.429
Seq_754,0.286,0.5
Seq_755,0.429,0.357
Seq_756,0.4,0.32
Seq_757,0.45,0.4
Seq_758,0.548,0.226
Seq_759,0.435,0.261
Seq_760,0.3,0.3
Seq_761,0.442,0.186
Seq_762,0.487,0.256
Seq_763,0.465,0.256
Seq_764,0.447,0.289
Seq_765,0.474,0.263
Seq_766,0.447,0.289
Seq_767,0.447,0.289
Seq_768,0.474,0.211
Seq_769,0.255,0.426
Seq_770,0.209,0.419
Seq_771,0.209,0.419
Seq_772,0.295,0.386
Seq_773,0.279,0.302
Seq_774,0.279,0.279
Seq_775,0.256,0.302
Seq_776,0.256,0.302
Seq_777,0.27,0.378
Seq_778,0.216,0.351
Seq_779,0.27,0.351
Seq_780,0.324,0.351
Seq_781,0.295,0.318
Seq_782,0.326,0.372
Seq_783,0.278,0.611
Seq_784,0.278,0.611
Seq_785,0.476,0.143
Seq_786,0.5,0.333
Seq_787,0.458,0.375
Seq_788,0.438,0.188
Seq_789,0.385,0.308
Seq_790,0.34,0.426
Seq_791,0.462,0.308
Seq_792,0.462,0.308
Seq_793,0.462,0.154
Seq_794,0.429,0.393
Seq_795,0.462,0.308
Seq_796,0.462,0.154
Seq_797,0.385,0.308
Seq_798,0.385,0.231
Seq_799,0.385,0.385
Seq_800,0.571,0.19
Seq_801,0.5,0.333
Seq_802,0.526,0.184
Seq_803,0.485,0.152
Seq_804,0.438,0.219
Seq_805,0.542,0.292
Seq_806,0.542,0.292
Seq_807,0.438,0.281
Seq_808,0.464,0.214
Seq_809,0.143,0.0
Seq_810,0.481,0.37
Seq_811,0.435,0.435
Seq_812,0.5,0.306
Seq_813,0.568,0.27
Seq_814,0.381,0.381
Seq_815,0.5,0.324
Seq_816,0.529,0.324
Seq_817,0.5,0.353
Seq_818,0.385,0.308
Seq_819,0.385,0.308
Seq_820,0.385,0.308
Seq_821,0.526,0.263
Seq_822,0.3,0.333
Seq_823,0.3,0.45
Seq_824,0.35,0.4
Seq_825,0.378,0.333
Seq_826,0.263,0.342
Seq_827,0.297,0.351
Seq_828,0.38,0.32
Seq_829,0.319,0.383
Seq_830,0.311,0.378
Seq_831,0.426,0.298
Seq_832,0.383,0.383
Seq_833,0.349,0.326
Seq_834,0.297,0.432
Seq_835,0.27,0.405
Seq_836,0.27,0.405
Seq_837,0.345,0.431
Seq_838,0.286,0.343
Seq_839,0.256,0.372
Seq_840,0.517,0.276
Seq_841,0.348,0.261
Seq_842,0.56,0.2
Seq_843,0.571,0.19
Seq_844,0.645,0.194
Seq_845,0.571,0.214
Seq_846,0.6,0.167
Seq_847,0.531,0.156
Seq_848,0.697,0.121
Seq_849,0.52,0.24
Seq_850,0.474,0.316
Seq_851,0.556,0.167
Seq_852,0.333,0.4
Seq_853,0.362,0.404
Seq_854,0.375,0.3
Seq_855,0.404,0.404
Seq_856,0.388,0.408
Seq_857,0.44,0.34
Seq_858,0.404,0.362
Seq_859,0.362,0.404
Seq_860,0.375,0.375
Seq_861,0.243,0.27
Seq_862,0.368,0.211
Seq_863,0.288,0.365
Seq_864,0.333,0.292
Seq_865,0.333,0.417
Seq_866,0.265,0.441
Seq_867,0.422,0.333
Seq_868,0.2,0.48
Seq_869,0.259,0.519
Seq_870,0.19,0.429
Seq_871,0.136,0.5
Seq_872,0.5,0.333
Seq_873,0.238,0.452
Seq_874,0.238,0.476
Seq_875,0.6,0.333
Seq_876,0.273,0.432
Seq_877,0.366,0.341
Seq_878,0.72,0.08
Seq_879,0.577,0.231
Seq_880,0.8,0.1
Seq_881,0.8,0.1
Seq_882,0.583,0.25
Seq_883,0.583,0.25
Seq_884,0.571,0.25
Seq_885,0.103,0.483
Seq_886,0.138,0.552
Seq_887,0.167,0.467
Seq_888,0.2,0.467
Seq_889,0.103,0.517
Seq_890,0.375,0.3
Seq_891,0.2,0.467
Seq_892,0.161,0.484
Seq_893,0.133,0.467
Seq_894,0.167,0.533
Seq_895,0.194,0.484
Seq_896,0.258,0.484
Seq_897,0.435,0.217
Seq_898,0.529,0.118
Seq_899,0.636,0.136
Seq_900,0.51,0.314
Seq_901,0.182,0.485
Seq_902,0.543,0.286
Seq_903,0.324,0.471
Seq_904,0.341,0.317
Seq_905,0.341,0.366
Seq_906,0.316,0.474
Seq_907,0.333,0.25
Seq_908,0.385,0.256
Seq_909,0.41,0.231
Seq_910,0.298,0.383
Seq_911,0.41,0.231
Seq_912,0.577,0.231
Seq_913,0.778,0.111
Seq_914,0.474,0.316
Seq_915,0.426,0.333
Seq_916,0.293,0.366
Seq_917,0.268,0.366
Seq_918,0.268,0.366
Seq_919,0.341,0.341
Seq_920,0.429,0.357
Seq_921,0.271,0.333
Seq_922,0.339,0.237
Seq_923,0.356,0.222
Seq_924,0.356,0.222
Seq_925,0.364,0.364
Seq_926,0.424,0.212
Seq_927,0.286,0.476
Seq_928,0.3,0.333
Seq_929,0.44,0.24
Seq_930,0.302,0.372
Seq_931,0.391,0.261
Seq_932,0.267,0.333
Seq_933,0.318,0.364
Seq_934,0.318,0.364
Seq_935,0.415,0.151
Seq_936,0.414,0.345
Seq_937,0.5,0.294
Seq_938,0.5,0.341
Seq_939,0.432,0.364
Seq_940,0.455,0.409
Seq_941,0.432,0.409
Seq_942,0.194,0.361
Seq_943,0.267,0.433
Seq_944,0.136,0.5
Seq_945,0.318,0.364
Seq_946,0.371,0.286
Seq_947,0.31,0.405
Seq_948,0.28,0.44
Seq_949,0.222,0.444
Seq_950,0.148,0.519
Seq_951,0.259,0.444
Seq_952,0.346,0.423
Seq_953,0.405,0.324
Seq_954,0.15,0.55
Seq_955,0.294,0.176
Seq_956,0.205,0.256
Seq_957,0.478,0.304
Seq_958,0.458,0.333
Seq_959,0.458,0.292
Seq_960,0.458,0.292
Seq_961,0.579,0.263
Seq_962,0.4,0.533
Seq_963,0.4,0.533
Seq_964,0.047,0.163
Seq_965,0.5,0.188
Seq_966,0.49,0.275
Seq_967,0.5,0.25
Seq_968,0.562,0.188
Seq_969,0.5,0.333
Seq_970,0.722,0.278
Seq_971,0.8,0.067
Seq_972,0.333,0.286
Seq_973,0.227,0.364
Seq_974,0.205,0.364
Seq_975,0.489,0.289
Seq_976,0.385,0.231
Seq_977,0.714,0.143
Seq_978,0.571,0.214
Seq_979,0.353,0.294
Seq_980,0.294,0.294
Seq_981,0.278,0.444
Seq_982,0.459,0.27
Seq_983,0.459,0.27
Seq_984,0.432,0.27
Seq_985,0.459,0.27
Seq_986,0.432,0.27
Seq_987,0.536,0.25
Seq_988,0.462,0.154
Seq_989,0.533,0.267
Seq_990,0.5,0.25
Seq_991,0.368,0.316
Seq_992,0.538,0.308
Seq_993,0.609,0.217
Seq_994,0.571,0.286
Seq_995,0.5,0.25
Seq_996,0.375,0.312
Seq_997,0.353,0.353
Seq_998,0.611,0.222
Seq_999,0.526,0.368
Seq_1000,0.289,0.311
Seq_1001,0.37,0.37
Seq_1002,0.348,0.391
Seq_1003,0.5,0.25
Seq_1004,0.464,0.357
Seq_1005,0.207,0.517
Seq_1006,0.261,0.348
Seq_1007,0.217,0.391
Seq_1008,0.261,0.37
Seq_1009,0.283,0.348
Seq_1010,0.217,0.37
Seq_1011,0.261,0.326
Seq_1012,0.593,0.111
Seq_1013,0.304,0.348
Seq_1014,0.235,0.324
Seq_1015,0.333,0.4
Seq_1016,0.528,0.083
Seq_1017,0.4,0.3
Seq_1018,0.455,0.212
Seq_1019,0.424,0.273
Seq_1020,0.406,0.281
Seq_1021,0.414,0.379
Seq_1022,0.385,0.385
Seq_1023,0.286,0.381
Seq_1024,0.4,0.45
Seq_1025,0.513,0.282
Seq_1026,0.393,0.25
Seq_1027,0.286,0.143
Seq_1028,0.5,0.375
Seq_1029,0.421,0.211
Seq_1030,0.286,0.357
Seq_1031,0.267,0.533
Seq_1032,0.25,0.438
Seq_1033,0.25,0.25
Seq_1034,0.391,0.304
Seq_1035,0.381,0.238
Seq_1036,0.429,0.19
Seq_1037,0.429,0.19
Seq_1038,0.381,0.238
Seq_1039,0.333,0.238
Seq_1040,0.459,0.351
Seq_1041,0.265,0.441
Seq_1042,0.306,0.444
Seq_1043,0.317,0.415
Seq_1044,0.275,0.425
Seq_1045,0.333,0.381
Seq_1046,0.289,0.333
Seq_1047,0.213,0.426
Seq_1048,0.6,0.067
Seq_1049,0.353,0.294
Seq_1050,0.429,0.381
Seq_1051,0.667,0.133
Seq_1052,0.404,0.383
Seq_1053,0.556,0.222
Seq_1054,0.379,0.31
Seq_1055,0.182,0.545
Seq_1056,0.458,0.417
Seq_1057,0.353,0.353
Seq_1058,0.357,0.5
Seq_1059,0.353,0.353
Seq_1060,0.458,0.417
Seq_1061,0.474,0.211
Seq_1062,0.571,0.179
Seq_1063,0.5,0.214
Seq_1064,0.423,0.308
Seq_1065,0.529,0.206
Seq_1066,0.364,0.164
Seq_1067,0.391,0.413
Seq_1068,0.465,0.302
Seq_1069,0.325,0.325
Seq_1070,0.325,0.325
Seq_1071,0.375,0.325
Seq_1072,0.3,0.35
Seq_1073,0.35,0.35
Seq_1074,0.4,0.35
Seq_1075,0.457,0.326
Seq_1076,0.425,0.275
Seq_1077,0.212,0.485
Seq_1078,0.442,0.326
Seq_1079,0.214,0.476
Seq_1080,0.22,0.415
Seq_1081,0.5,0.25
Seq_1082,0.412,0.382
Seq_1083,0.432,0.162
Seq_1084,0.3,0.35
Seq_1085,0.143,0.405
Seq_1086,0.389,0.389
Seq_1087,0.69,0.138
Seq_1088,0.542,0.333
Seq_1089,0.455,0.242
Seq_1090,0.424,0.242
Seq_1091,0.486,0.324
Seq_1092,0.235,0.412
Seq_1093,0.267,0.333
Seq_1094,0.609,0.13
Seq_1095,0.48,0.28
Seq_1096,0.56,0.16
Seq_1097,0.56,0.16
Seq_1098,0.56,0.16
Seq_1099,0.364,0.0
Seq_1100,0.586,0.138
Seq_1101,0.586,0.138
Seq_1102,0.56,0.2
Seq_1103,0.531,0.219
Seq_1104,0.536,0.25
Seq_1105,0.458,0.375
Seq_1106,0.417,0.417
Seq_1107,0.375,0.458
Seq_1108,0.417,0.375
Seq_1109,0.458,0.417
Seq_1110,0.458,0.417
Seq_1111,0.429,0.357
Seq_1112,0.348,0.348
Seq_1113,0.541,0.297
Seq_1114,0.485,0.182
Seq_1115,0.417,0.458
Seq_1116,0.417,0.458
Seq_1117,0.476,0.19
Seq_1118,0.429,0.238
Seq_1119,0.667,0.233
Seq_1120,0.455,0.242
Seq_1121,0.455,0.273
Seq_1122,0.394,0.303
Seq_1123,0.458,0.417
Seq_1124,0.385,0.385
Seq_1125,0.469,0.25
Seq_1126,0.458,0.375
Seq_1127,0.417,0.375
Seq_1128,0.417,0.417
Seq_1129,0.45,0.45
Seq_1130,0.4,0.5
Seq_1131,0.308,0.462
Seq_1132,0.583,0.292
Seq_1133,0.5,0.375
Seq_1134,0.538,0.231
Seq_1135,0.471,0.294
Seq_1136,0.5,0.3
Seq_1137,0.5,0.3
Seq_1138,0.5,0.3
Seq_1139,0.4,0.4
Seq_1140,0.65,0.25
Seq_1141,0.385,0.385
Seq_1142,0.5,0.429
Seq_1143,0.35,0.45
Seq_1144,0.478,0.217
Seq_1145,0.522,0.217
Seq_1146,0.522,0.217
Seq_1147,0.562,0.125
Seq_1148,0.467,0.4
Seq_1149,0.467,0.4
Seq_1150,0.4,0.467
Seq_1151,0.342,0.368
Seq_1152,0.341,0.295
Seq_1153,0.356,0.289
Seq_1154,0.545,0.182
Seq_1155,0.538,0.231
Seq_1156,0.444,0.222
Seq_1157,0.448,0.31
Seq_1158,0.324,0.351
Seq_1159,0.464,0.286
Seq_1160,0.696,0.13
Seq_1161,0.385,0.308
Seq_1162,0.151,0.302
Seq_1163,0.267,0.533
Seq_1164,0.619,0.0
Seq_1165,0.182,0.5
Seq_1166,0.231,0.615
Seq_1167,0.308,0.385
Seq_1168,0.459,0.27
Seq_1169,0.42,0.34
Seq_1170,0.476,0.286
Seq_1171,0.6,0.24
Seq_1172,0.273,0.394
Seq_1173,0.353,0.294
Seq_1174,0.396,0.453
Seq_1175,0.425,0.275
Seq_1176,0.533,0.267
Seq_1177,0.5,0.286
Seq_1178,0.385,0.308
Seq_1179,0.34,0.277
Seq_1180,0.484,0.226
Seq_1181,0.516,0.194
Seq_1182,0.516,0.226
Seq_1183,0.426,0.34
Seq_1184,0.545,0.364
Seq_1185,0.308,0.359
Seq_1186,0.405,0.333
Seq_1187,0.4,0.3
Seq_1188,0.6,0.28
Seq_1189,0.381,0.238
Seq_1190,0.333,0.238
Seq_1191,0.333,0.286
Seq_1192,0.333,0.286
Seq_1193,0.238,0.333
Seq_1194,0.524,0.238
Seq_1195,0.455,0.318
Seq_1196,0.452,0.419
Seq_1197,0.385,0.385
Seq_1198,0.444,0.389
Seq_1199,0.688,0.094
Seq_1200,0.474,0.316
Seq_1201,0.381,0.31
Seq_1202,0.418,0.255
Seq_1203,0.667,0.111
Seq_1204,0.364,0.318
Seq_1205,0.26,0.42
Seq_1206,0.34,0.362
Seq_1207,0.409,0.409
Seq_1208,0.353,0.412
Seq_1209,0.309,0.364
Seq_1210,0.404,0.333
Seq_1211,0.431,0.276
Seq_1212,0.59,0.231
Seq_1213,0.35,0.375
Seq_1214,0.304,0.348
Seq_1215,0.667,0.1
Seq_1216,0.75,0.083
Seq_1217,0.333,0.308
Seq_1218,0.2,0.433
Seq_1219,0.396,0.438
Seq_1220,0.333,0.451
Seq_1221,0.433,0.3
Seq_1222,0.333,0.3
Seq_1223,0.5,0.357
Seq_1224,0.333,0.25
Seq_1225,0.5,0.429
Seq_1226,0.333,0.316
Seq_1227,0.368,0.368
Seq_1228,0.294,0.324
Seq_1229,0.4,0.3
Seq_1230,0.241,0.379
Seq_1231,0.341,0.25
Seq_1232,0.378,0.333
Seq_1233,0.275,0.325
Seq_1234,0.275,0.325
Seq_1235,0.34,0.26
Seq_1236,0.297,0.405
Seq_1237,0.476,0.31
Seq_1238,0.333,0.333
Seq_1239,0.158,0.474
Seq_1240,0.211,0.421
Seq_1241,0.158,0.368
Seq_1242,0.158,0.474
Seq_1243,0.432,0.297
Seq_1244,0.375,0.438
Seq_1245,0.327,0.442
Seq_1246,0.211,0.316
Seq_1247,0.341,0.439
Seq_1248,0.238,0.524
Seq_1249,0.158,0.632
Seq_1250,0.432,0.297
Seq_1251,0.273,0.455
Seq_1252,0.273,0.455
Seq_1253,0.276,0.379
Seq_1254,0.233,0.433
Seq_1255,0.227,0.455
Seq_1256,0.387,0.419
Seq_1257,0.625,0.125
Seq_1258,0.29,0.419
Seq_1259,0.4,0.367
Seq_1260,0.042,0.458
Seq_1261,0.188,0.531
Seq_1262,0.424,0.364
Seq_1263,0.3,0.2
Seq_1264,0.286,0.429
Seq_1265,0.536,0.143
Seq_1266,0.382,0.265
Seq_1267,0.412,0.382
Seq_1268,0.368,0.263
Seq_1269,0.342,0.289
Seq_1270,0.342,0.316
Seq_1271,0.289,0.316
Seq_1272,0.342,0.289
Seq_1273,0.316,0.289
Seq_1274,0.368,0.289
Seq_1275,0.273,0.545
Seq_1276,0.542,0.458
Seq_1277,0.429,0.429
Seq_1278,0.571,0.214
Seq_1279,0.643,0.143
Seq_1280,0.529,0.294
Seq_1281,0.412,0.294
Seq_1282,0.529,0.294
Seq_1283,0.5,0.286
Seq_1284,0.5,0.286
Seq_1285,0.423,0.462
Seq_1286,0.467,0.267
Seq_1287,0.467,0.3
Seq_1288,0.341,0.341
Seq_1289,0.071,0.643
Seq_1290,0.6,0.2
Seq_1291,0.364,0.5
Seq_1292,0.405,0.286
Seq_1293,0.48,0.28
Seq_1294,0.56,0.24
Seq_1295,0.467,0.333
Seq_1296,0.391,0.304
Seq_1297,0.5,0.375
Seq_1298,0.5,0.167
Seq_1299,0.333,0.167
Seq_1300,0.219,0.375
Seq_1301,0.367,0.5
Seq_1302,0.4,0.5
Seq_1303,0.333,0.394
Seq_1304,0.312,0.406
Seq_1305,0.333,0.364
Seq_1306,0.312,0.375
Seq_1307,0.485,0.394
Seq_1308,0.469,0.406
Seq_1309,0.344,0.344
Seq_1310,0.333,0.533
Seq_1311,0.278,0.611
Seq_1312,0.222,0.667
Seq_1313,0.222,0.667
Seq_1314,0.333,0.556
Seq_1315,0.4,0.3
Seq_1316,0.405,0.31
Seq_1317,0.238,0.429
Seq_1318,0.261,0.435
Seq_1319,0.571,0.214
Seq_1320,0.467,0.267
Seq_1321,0.571,0.286
Seq_1322,0.24,0.56
Seq_1323,0.379,0.345
Seq_1324,0.32,0.36
Seq_1325,0.319,0.319
Seq_1326,0.28,0.38
Seq_1327,0.32,0.36
Seq_1328,0.32,0.36
Seq_1329,0.32,0.36
Seq_1330,0.32,0.36
Seq_1331,0.32,0.36
Seq_1332,0.34,0.34
Seq_1333,0.36,0.34
Seq_1334,0.529,0.118
Seq_1335,0.208,0.458
Seq_1336,0.52,0.24
Seq_1337,0.5,0.273
Seq_1338,0.348,0.348
Seq_1339,0.37,0.348
Seq_1340,0.514,0.324
Seq_1341,0.414,0.345
Seq_1342,0.424,0.273
Seq_1343,0.424,0.303
Seq_1344,0.394,0.273
Seq_1345,0.238,0.476
Seq_1346,0.286,0.429
Seq_1347,0.281,0.5
Seq_1348,0.125,0.5
Seq_1349,0.568,0.216
Seq_1350,0.568,0.216
Seq_1351,0.5,0.375
Seq_1352,0.5,0.281
Seq_1353,0.357,0.214
Seq_1354,0.375,0.417
Seq_1355,0.417,0.375
Seq_1356,0.417,0.458
Seq_1357,0.211,0.368
Seq_1358,0.462,0.154
Seq_1359,0.462,0.308
Seq_1360,0.429,0.357
Seq_1361,0.333,0.333
Seq_1362,0.3,0.3
Seq_1363,0.481,0.259
Seq_1364,0.444,0.296
Seq_1365,0.6,0.08
Seq_1366,0.556,0.185
Seq_1367,0.444,0.333
Seq_1368,0.52,0.16
Seq_1369,0.593,0.185
Seq_1370,0.45,0.2
Seq_1371,0.556,0.185
Seq_1372,0.556,0.185
Seq_1373,0.591,0.136
Seq_1374,0.481,0.333
Seq_1375,0.64,0.04
Seq_1376,0.519,0.148
Seq_1377,0.3,0.35
Seq_1378,0.308,0.385
Seq_1379,0.312,0.375
Seq_1380,0.375,0.375
Seq_1381,0.469,0.344
Seq_1382,0.448,0.379
Seq_1383,0.432,0.378
Seq_1384,0.365,0.308
Seq_1385,0.383,0.234
Seq_1386,0.324,0.432
Seq_1387,0.351,0.405
Seq_1388,0.304,0.283
Seq_1389,0.22,0.317
Seq_1390,0.345,0.241
Seq_1391,0.459,0.189
Seq_1392,0.279,0.372
Seq_1393,0.278,0.278
Seq_1394,0.308,0.154
Seq_1395,0.286,0.143
Seq_1396,0.25,0.25
Seq_1397,0.568,0.216
Seq_1398,0.5,0.35
Seq_1399,0.471,0.412
Seq_1400,0.471,0.412
Seq_1401,0.26,0.42
Seq_1402,0.26,0.42
Seq_1403,0.167,0.5
Seq_1404,0.267,0.4
Seq_1405,0.172,0.483
Seq_1406,0.2,0.5
Seq_1407,0.583,0.25
Seq_1408,0.379,0.379
Seq_1409,0.414,0.379
Seq_1410,0.448,0.31
Seq_1411,0.286,0.381
Seq_1412,0.333,0.458
Seq_1413,0.138,0.448
Seq_1414,0.1,0.5
Seq_1415,0.778,0.167
Seq_1416,0.778,0.167
Seq_1417,0.349,0.395
Seq_1418,0.375,0.425
Seq_1419,0.35,0.425
Seq_1420,0.368,0.368
Seq_1421,0.267,0.467
Seq_1422,0.268,0.463
Seq_1423,0.286,0.357
Seq_1424,0.361,0.333
Seq_1425,0.5,0.222
Seq_1426,0.5,0.222
Seq_1427,0.441,0.265
Seq_1428,0.409,0.273
Seq_1429,0.364,0.273
Seq_1430,0.667,0.233
Seq_1431,0.138,0.483
Seq_1432,0.103,0.483
Seq_1433,0.161,0.484
Seq_1434,0.1,0.5
Seq_1435,0.129,0.484
Seq_1436,0.129,0.484
Seq_1437,0.129,0.484
Seq_1438,0.2,0.467
Seq_1439,0.333,0.396
Seq_1440,0.3,0.36
Seq_1441,0.333,0.353
Seq_1442,0.3,0.38
Seq_1443,0.353,0.353
Seq_1444,0.5,0.417
Seq_1445,0.5,0.375
Seq_1446,0.417,0.417
Seq_1447,0.565,0.304
Seq_1448,0.611,0.278
Seq_1449,0.5,0.333
Seq_1450,0.5,0.333
Seq_1451,0.542,0.333
Seq_1452,0.5,0.375
Seq_1453,0.458,0.417
Seq_1454,0.542,0.333
Seq_1455,0.542,0.333
Seq_1456,0.417,0.5
Seq_1457,0.609,0.304
Seq_1458,0.455,0.242
Seq_1459,0.485,0.212
Seq_1460,0.485,0.242
Seq_1461,0.424,0.242
Seq_1462,0.424,0.212
Seq_1463,0.394,0.273
Seq_1464,0.394,0.273
Seq_1465,0.394,0.242
Seq_1466,0.267,0.4
Seq_1467,0.455,0.212
Seq_1468,0.424,0.273
Seq_1469,0.394,0.242
Seq_1470,0.455,0.242
Seq_1471,0.424,0.212
Seq_1472,0.455,0.242
Seq_1473,0.385,0.462
Seq_1474,0.485,0.273
Seq_1475,0.515,0.242
Seq_1476,0.394,0.242
Seq_1477,0.424,0.212
Seq_1478,0.485,0.212
Seq_1479,0.326,0.391
Seq_1480,0.348,0.348
Seq_1481,0.348,0.37
Seq_1482,0.348,0.391
Seq_1483,0.348,0.37
Seq_1484,0.412,0.471
Seq_1485,0.326,0.37
Seq_1486,0.412,0.471
Seq_1487,0.348,0.348
Seq_1488,0.304,0.391
Seq_1489,0.326,0.37
Seq_1490,0.514,0.324
Seq_1491,0.541,0.297
Seq_1492,0.379,0.345
Seq_1493,0.35,0.35
Seq_1494,0.486,0.351
Seq_1495,0.514,0.297
Seq_1496,0.514,0.324
Seq_1497,0.486,0.351
Seq_1498,0.35,0.35
Seq_1499,0.333,0.286
Seq_1500,0.381,0.333
Seq_1501,0.333,0.381
Seq_1502,0.333,0.286
Seq_1503,0.333,0.286
Seq_1504,0.381,0.238
Seq_1505,0.4,0.35
Seq_1506,0.286,0.333
Seq_1507,0.286,0.333
Seq_1508,0.381,0.286
Seq_1509,0.286,0.333
Seq_1510,0.25,0.312
Seq_1511,0.483,0.241
Seq_1512,0.483,0.31
Seq_1513,0.483,0.241
Seq_1514,0.483,0.31
Seq_1515,0.438,0.312
Seq_1516,0.375,0.333
Seq_1517,0.412,0.294
Seq_1518,0.458,0.375
Seq_1519,0.375,0.375
Seq_1520,0.545,0.242
Seq_1521,0.515,0.273
Seq_1522,0.333,0.062
Seq_1523,0.643,0.143
Seq_1524,0.5,0.25
Seq_1525,0.593,0.074
Seq_1526,0.519,0.148
Seq_1527,0.519,0.148
Seq_1528,0.519,0.148
Seq_1529,0.471,0.176
Seq_1530,0.647,0.059
Seq_1531,0.529,0.235
Seq_1532,0.4,0.25
Seq_1533,0.263,0.368
Seq_1534,0.263,0.316
Seq_1535,0.2,0.35
Seq_1536,0.25,0.35
Seq_1537,0.263,0.368
Seq_1538,0.353,0.353
Seq_1539,0.267,0.5
Seq_1540,0.29,0.323
Seq_1541,0.559,0.176
Seq_1542,0.578,0.244
Seq_1543,0.409,0.364
Seq_1544,0.231,0.538
Seq_1545,0.5,0.25
Seq_1546,0.667,0.167
Seq_1547,0.353,0.353
Seq_1548,0.464,0.321
Seq_1549,0.348,0.304
Seq_1550,0.394,0.273
Seq_1551,0.424,0.242
Seq_1552,0.595,0.216
Seq_1553,0.541,0.243
Seq_1554,0.5,0.125
Seq_1555,0.375,0.312
Seq_1556,0.375,0.25
Seq_1557,0.375,0.375
Seq_1558,0.375,0.188
Seq_1559,0.385,0.308
Seq_1560,0.385,0.385
Seq_1561,0.316,0.421
Seq_1562,0.316,0.474
Seq_1563,0.25,0.5
Seq_1564,0.188,0.5
Seq_1565,0.429,0.286
Seq_1566,0.387,0.355
Seq_1567,0.375,0.458
Seq_1568,0.375,0.458
Seq_1569,0.375,0.458
Seq_1570,0.424,0.333
Seq_1571,0.455,0.303
Seq_1572,0.424,0.333
Seq_1573,0.471,0.235
Seq_1574,0.471,0.235
Seq_1575,0.524,0.333
Seq_1576,0.476,0.381
Seq_1577,0.3,0.34
Seq_1578,0.692,0.154
Seq_1579,0.647,0.118
Seq_1580,0.556,0.259
Seq_1581,0.571,0.357
Seq_1582,0.429,0.357
Seq_1583,0.417,0.417
Seq_1584,0.417,0.417
Seq_1585,0.347,0.408
Seq_1586,0.552,0.241
Seq_1587,0.414,0.31
Seq_1588,0.5,0.321
Seq_1589,0.464,0.357
Seq_1590,0.393,0.357
Seq_1591,0.211,0.105
Seq_1592,0.35,0.05
Seq_1593,0.212,0.485
Seq_1594,0.259,0.481
Seq_1595,0.385,0.327
Seq_1596,0.286,0.429
Seq_1597,0.444,0.333
Seq_1598,0.395,0.349
Seq_1599,0.333,0.333
Seq_1600,0.462,0.385
Seq_1601,0.342,0.474
Seq_1602,0.231,0.462
Seq_1603,0.295,0.386
Seq_1604,0.333,0.381
Seq_1605,0.179,0.5
Seq_1606,0.161,0.484
Seq_1607,0.24,0.52
Seq_1608,0.138,0.517
Seq_1609,0.188,0.469
Seq_1610,0.138,0.517
Seq_1611,0.179,0.571
Seq_1612,0.138,0.552
Seq_1613,0.207,0.483
Seq_1614,0.143,0.5
Seq_1615,0.293,0.366
Seq_1616,0.259,0.333
Seq_1617,0.519,0.185
Seq_1618,0.667,0.037
Seq_1619,0.444,0.167
Seq_1620,0.591,0.227
Seq_1621,0.545,0.227
Seq_1622,0.52,0.24
Seq_1623,0.44,0.28
Seq_1624,0.4,0.2
Seq_1625,0.5,0.083
Seq_1626,0.467,0.067
Seq_1627,0.4,0.2
Seq_1628,0.4,0.2
Seq_1629,0.44,0.32
Seq_1630,0.333,0.333
Seq_1631,0.375,0.375
Seq_1632,0.5,0.188
Seq_1633,0.452,0.31
Seq_1634,0.323,0.355
Seq_1635,0.438,0.25
Seq_1636,0.375,0.5
Seq_1637,0.385,0.385
Seq_1638,0.353,0.529
Seq_1639,0.388,0.327
Seq_1640,0.412,0.353
Seq_1641,0.339,0.322
Seq_1642,0.357,0.357
Seq_1643,0.214,0.429
Seq_1644,0.375,0.333
Seq_1645,0.273,0.364
Seq_1646,0.436,0.282
Seq_1647,0.439,0.293
Seq_1648,0.61,0.244
Seq_1649,0.52,0.24
Seq_1650,0.364,0.227
Seq_1651,0.4,0.289
Seq_1652,0.422,0.289
Seq_1653,0.613,0.129
Seq_1654,0.375,0.458
Seq_1655,0.417,0.458
Seq_1656,0.381,0.286
Seq_1657,0.333,0.333
Seq_1658,0.306,0.417
Seq_1659,0.348,0.522
Seq_1660,0.348,0.522
Seq_1661,0.3,0.267
Seq_1662,0.409,0.455
Seq_1663,0.348,0.261
Seq_1664,0.462,0.231
Seq_1665,0.308,0.385
Seq_1666,0.385,0.308
Seq_1667,0.568,0.243
Seq_1668,0.387,0.355
Seq_1669,0.417,0.458
Seq_1670,0.417,0.417
Seq_1671,0.333,0.458
Seq_1672,0.375,0.458
Seq_1673,0.5,0.333
Seq_1674,0.5,0.265
Seq_1675,0.29,0.355
Seq_1676,0.542,0.203
Seq_1677,0.414,0.276
Seq_1678,0.419,0.355
Seq_1679,0.409,0.364
Seq_1680,0.4,0.4
Seq_1681,0.471,0.235
Seq_1682,0.375,0.417
Seq_1683,0.417,0.375
Seq_1684,0.455,0.303
Seq_1685,0.455,0.273
Seq_1686,0.432,0.27
Seq_1687,0.536,0.214
Seq_1688,0.5,0.286
Seq_1689,0.458,0.417
Seq_1690,0.5,0.375
Seq_1691,0.368,0.526
Seq_1692,0.222,0.417
Seq_1693,0.471,0.235
Seq_1694,0.262,0.357
Seq_1695,0.368,0.342
Seq_1696,0.526,0.211
Seq_1697,0.357,0.357
Seq_1698,0.385,0.385
Seq_1699,0.308,0.385
Seq_1700,0.308,0.385
Seq_1701,0.391,0.348
Seq_1702,0.56,0.28
Seq_1703,0.409,0.409
Seq_1704,0.476,0.238
Seq_1705,0.391,0.348
Seq_1706,0.692,0.0
Seq_1707,0.5,0.25
Seq_1708,0.692,0.308
Seq_1709,0.387,0.29
Seq_1710,0.591,0.227
Seq_1711,0.38,0.36
Seq_1712,0.364,0.364
Seq_1713,0.237,0.421
Seq_1714,0.4,0.35
Seq_1715,0.238,0.571
Seq_1716,0.045,0.545
Seq_1717,0.412,0.471
Seq_1718,0.24,0.48
Seq_1719,0.316,0.395
Seq_1720,0.52,0.2
Seq_1721,0.25,0.5
Seq_1722,0.375,0.312
Seq_1723,0.377,0.038
Seq_1724,0.5,0.222
Seq_1725,0.5,0.167
Seq_1726,0.419,0.387
Seq_1727,0.5,0.333
Seq_1728,0.4,0.4
Seq_1729,0.4,0.4
Seq_1730,0.465,0.326
Seq_1731,0.2,0.114
Seq_1732,0.48,0.24
Seq_1733,0.518,0.25
Seq_1734,0.333,0.167
Seq_1735,0.297,0.351
Seq_1736,0.722,0.111
Seq_1737,0.474,0.316
Seq_1738,0.526,0.316
Seq_1739,0.526,0.368
Seq_1740,0.517,0.31
Seq_1741,0.231,0.231
Seq_1742,0.28,0.38
Seq_1743,0.273,0.455
Seq_1744,0.619,0.143
Seq_1745,0.559,0.265
Seq_1746,0.357,0.357
Seq_1747,0.308,0.385
Seq_1748,0.308,0.385
Seq_1749,0.385,0.385
Seq_1750,0.385,0.385
Seq_1751,0.308,0.462
Seq_1752,0.289,0.447
Seq_1753,0.286,0.343
Seq_1754,0.238,0.571
Seq_1755,0.385,0.308
Seq_1756,0.308,0.308
Seq_1757,0.5,0.233
Seq_1758,0.395,0.395
Seq_1759,0.708,0.208
Seq_1760,0.492,0.305
Seq_1761,0.211,0.263
Seq_1762,0.709,0.091
Seq_1763,0.273,0.386
Seq_1764,0.294,0.294
Seq_1765,0.353,0.294
Seq_1766,0.317,0.366
Seq_1767,0.474,0.263
Seq_1768,0.556,0.278
Seq_1769,0.577,0.154
Seq_1770,0.4,0.3
Seq_1771,0.667,0.19
Seq_1772,0.219,0.5
Seq_1773,0.386,0.351
Seq_1774,0.491,0.302
Seq_1775,0.364,0.477
Seq_1776,0.273,0.545
Seq_1777,0.467,0.3
Seq_1778,0.409,0.386
Seq_1779,0.188,0.562
Seq_1780,0.488,0.372
Seq_1781,0.323,0.355
Seq_1782,0.538,0.423
Seq_1783,0.538,0.154
Seq_1784,0.692,0.154
Seq_1785,0.435,0.348
Seq_1786,0.308,0.385
Seq_1787,0.387,0.323
Seq_1788,0.308,0.423
Seq_1789,0.484,0.226
Seq_1790,0.375,0.5
Seq_1791,0.367,0.4
Seq_1792,0.435,0.304
Seq_1793,0.412,0.294
Seq_1794,0.462,0.308
Seq_1795,0.462,0.231
Seq_1796,0.462,0.308
Seq_1797,0.595,0.189
Seq_1798,0.567,0.133
Seq_1799,0.5,0.375
Seq_1800,0.5,0.375
Seq_1801,0.485,0.242
Seq_1802,0.455,0.273
Seq_1803,0.5,0.233
Seq_1804,0.593,0.148
Seq_1805,0.63,0.111
Seq_1806,0.5,0.292
Seq_1807,0.5,0.111
Seq_1808,0.478,0.217
Seq_1809,0.44,0.2
Seq_1810,0.5,0.25
Seq_1811,0.4,0.28
Seq_1812,0.36,0.28
Seq_1813,0.48,0.16
Seq_1814,0.48,0.24
Seq_1815,0.688,0.125
Seq_1816,0.591,0.227
Seq_1817,0.583,0.25
Seq_1818,0.667,0.167
Seq_1819,0.6,0.133
Seq_1820,0.485,0.242
Seq_1821,0.424,0.303
Seq_1822,0.383,0.298
Seq_1823,0.595,0.216
Seq_1824,0.419,0.323
Seq_1825,0.615,0.154
Seq_1826,0.267,0.4
Seq_1827,0.4,0.233
Seq_1828,0.417,0.417
Seq_1829,0.586,0.207
Seq_1830,0.586,0.207
Seq_1831,0.333,0.37
Seq_1832,0.36,0.36
Seq_1833,0.333,0.37
Seq_1834,0.32,0.4
Seq_1835,0.304,0.435
Seq_1836,0.304,0.435
Seq_1837,0.375,0.375
Seq_1838,0.483,0.276
Seq_1839,0.407,0.333
Seq_1840,0.389,0.352
Seq_1841,0.27,0.405
Seq_1842,0.472,0.278
Seq_1843,0.455,0.318
Seq_1844,0.281,0.281
Seq_1845,0.226,0.484
Seq_1846,0.258,0.484
Seq_1847,0.226,0.484
Seq_1848,0.267,0.4
Seq_1849,0.442,0.163
Seq_1850,0.205,0.231
Seq_1851,0.451,0.314
Seq_1852,0.378,0.333
Seq_1853,0.379,0.379
Seq_1854,0.304,0.348
Seq_1855,0.261,0.0
Seq_1856,0.308,0.462
Seq_1857,0.2,0.6
Seq_1858,0.2,0.6
Seq_1859,0.048,0.143
Seq_1860,0.538,0.231
Seq_1861,0.455,0.045
Seq_1862,0.325,0.35
Seq_1863,0.643,0.214
Seq_1864,0.389,0.333
Seq_1865,0.294,0.353
Seq_1866,0.617,0.149
Seq_1867,0.591,0.273
Seq_1868,0.484,0.355
Seq_1869,0.846,0.077
Seq_1870,0.714,0.214
Seq_1871,0.714,0.143
Seq_1872,0.571,0.357
Seq_1873,0.714,0.214
Seq_1874,0.615,0.231
Seq_1875,0.462,0.231
Seq_1876,0.364,0.273
Seq_1877,0.417,0.25
Seq_1878,0.245,0.189
Seq_1879,0.477,0.205
Seq_1880,0.438,0.25
Seq_1881,0.438,0.25
Seq_1882,0.562,0.188
Seq_1883,0.607,0.214
Seq_1884,0.517,0.207
Seq_1885,0.476,0.095
Seq_1886,0.526,0.053
Seq_1887,0.632,0.105
Seq_1888,0.379,0.31
Seq_1889,0.588,0.294
Seq_1890,0.444,0.333
Seq_1891,0.632,0.263
Seq_1892,0.5,0.214
Seq_1893,0.5,0.357
Seq_1894,0.355,0.419
Seq_1895,0.143,0.524
Seq_1896,0.246,0.386
Seq_1897,0.268,0.488
Seq_1898,0.654,0.231
Seq_1899,0.349,0.256
Seq_1900,0.357,0.357
Seq_1901,0.308,0.231
Seq_1902,0.462,0.231
Seq_1903,0.309,0.4
Seq_1904,0.367,0.265
Seq_1905,0.042,0.458
Seq_1906,0.5,0.3
Seq_1907,0.214,0.571
Seq_1908,0.56,0.16
Seq_1909,0.435,0.391
Seq_1910,0.435,0.348
Seq_1911,0.452,0.258
Seq_1912,0.429,0.429
Seq_1913,0.389,0.333
Seq_1914,0.375,0.312
Seq_1915,0.362,0.298
Seq_1916,0.471,0.382
Seq_1917,0.5,0.382
Seq_1918,0.486,0.27
Seq_1919,0.383,0.362
Seq_1920,0.545,0.409
Seq_1921,0.769,0.231
Seq_1922,0.312,0.438
Seq_1923,0.333,0.333
Seq_1924,0.309,0.4
Seq_1925,0.407,0.407
Seq_1926,0.5,0.273
Seq_1927,0.525,0.3
Seq_1928,0.0,0.857
Seq_1929,0.281,0.421
Seq_1930,0.32,0.44
Seq_1931,0.442,0.269
Seq_1932,0.562,0.188
Seq_1933,0.471,0.176
Seq_1934,0.478,0.217
Seq_1935,0.458,0.271
Seq_1936,0.316,0.395
Seq_1937,0.421,0.368
Seq_1938,0.357,0.464
Seq_1939,0.394,0.303
Seq_1940,0.438,0.312
Seq_1941,0.353,0.353
Seq_1942,0.471,0.294
Seq_1943,0.375,0.417
Seq_1944,0.333,0.417
Seq_1945,0.333,0.458
Seq_1946,0.333,0.417
Seq_1947,0.364,0.273
Seq_1948,0.429,0.257
Seq_1949,0.462,0.231
Seq_1950,0.5,0.333
Seq_1951,0.417,0.417
Seq_1952,0.424,0.333
Seq_1953,0.412,0.471
Seq_1954,0.452,0.258
Seq_1955,0.414,0.345
Seq_1956,0.655,0.172
Seq_1957,0.568,0.216
Seq_1958,0.424,0.333
Seq_1959,0.686,0.143
Seq_1960,0.308,0.462
Seq_1961,0.227,0.5
Seq_1962,0.348,0.348
Seq_1963,0.435,0.261
Seq_1964,0.571,0.143
Seq_1965,0.478,0.217
Seq_1966,0.524,0.19
Seq_1967,0.536,0.143
Seq_1968,0.536,0.143
Seq_1969,0.5,0.214
Seq_1970,0.5,0.214
Seq_1971,0.556,0.148
Seq_1972,0.52,0.16
Seq_1973,0.52,0.16
Seq_1974,0.56,0.2
Seq_1975,0.571,0.143
Seq_1976,0.316,0.368
Seq_1977,0.368,0.316
Seq_1978,0.425,0.225
Seq_1979,0.385,0.282
Seq_1980,0.525,0.3
Seq_1981,0.5,0.3
Seq_1982,0.55,0.275
Seq_1983,0.55,0.25
Seq_1984,0.55,0.25
Seq_1985,0.55,0.275
Seq_1986,0.4,0.275
Seq_1987,0.412,0.441
Seq_1988,0.265,0.441
Seq_1989,0.438,0.344
Seq_1990,0.511,0.277
Seq_1991,0.692,0.205
Seq_1992,0.465,0.302
Seq_1993,0.452,0.31
Seq_1994,0.347,0.327
Seq_1995,0.48,0.36
Seq_1996,0.438,0.375
Seq_1997,0.343,0.343
Seq_1998,0.316,0.421
Seq_1999,0.317,0.366
Seq_2000,0.353,0.353
Seq_2001,0.327,0.385
Seq_2002,0.038,0.538
Seq_2003,0.4,0.3
Seq_2004,0.28,0.52
Seq_2005,0.364,0.341
Seq_2006,0.294,0.353
Seq_2007,0.525,0.2
Seq_2008,0.245,0.208
Seq_2009,0.316,0.237
Seq_2010,0.344,0.281
Seq_2011,0.32,0.14
Seq_2012,0.3,0.375
Seq_2013,0.571,0.286
Seq_2014,0.3,0.367
Seq_2015,0.25,0.45
Seq_2016,0.475,0.3
Seq_2017,0.419,0.302
Seq_2018,0.458,0.25
Seq_2019,0.385,0.385
Seq_2020,0.72,0.16
Seq_2021,0.548,0.226
Seq_2022,0.385,0.385
Seq_2023,0.483,0.276
Seq_2024,0.526,0.316
Seq_2025,0.522,0.304
Seq_2026,0.545,0.273
Seq_2027,0.478,0.348
Seq_2028,0.571,0.286
Seq_2029,0.633,0.233
Seq_2030,0.692,0.154
Seq_2031,0.378,0.243
Seq_2032,0.289,0.342
Seq_2033,0.462,0.231
Seq_2034,0.229,0.314
Seq_2035,0.357,0.405
Seq_2036,0.333,0.429
Seq_2037,0.357,0.429
Seq_2038,0.395,0.395
Seq_2039,0.324,0.405
Seq_2040,0.342,0.368
Seq_2041,0.423,0.308
Seq_2042,0.316,0.368
Seq_2043,0.4,0.36
Seq_2044,0.294,0.471
Seq_2045,0.714,0.143
Seq_2046,0.571,0.143
Seq_2047,0.52,0.28
Seq_2048,0.469,0.219
Seq_2049,0.469,0.219
Seq_2050,0.286,0.171
Seq_2051,0.421,0.316
Seq_2052,0.4,0.2
Seq_2053,0.39,0.341
Seq_2054,0.381,0.238
Seq_2055,0.381,0.238
Seq_2056,0.417,0.417
Seq_2057,0.28,0.52
Seq_2058,0.5,0.375
Seq_2059,0.485,0.273
Seq_2060,0.375,0.417
Seq_2061,0.458,0.417
Seq_2062,0.413,0.304
Seq_2063,0.391,0.326
Seq_2064,0.435,0.283
Seq_2065,0.302,0.395
Seq_2066,0.302,0.395
Seq_2067,0.588,0.176
Seq_2068,0.833,0.0
Seq_2069,0.786,0.0
Seq_2070,0.545,0.182
Seq_2071,0.471,0.265
Seq_2072,0.257,0.343
Seq_2073,0.6,0.35
Seq_2074,0.163,0.488
Seq_2075,0.542,0.208
Seq_2076,0.462,0.231
Seq_2077,0.429,0.257
Seq_2078,0.571,0.238
Seq_2079,0.429,0.357
Seq_2080,0.429,0.429
Seq_2081,0.333,0.444
Seq_2082,0.222,0.444
Seq_2083,0.357,0.5
Seq_2084,0.357,0.429
Seq_2085,0.357,0.429
Seq_2086,0.435,0.304
Seq_2087,0.308,0.423
Seq_2088,0.391,0.326
Seq_2089,0.465,0.326
Seq_2090,0.257,0.514
Seq_2091,0.308,0.423
Seq_2092,0.167,0.5
Seq_2093,0.342,0.368
Seq_2094,0.138,0.448
Seq_2095,0.25,0.469
Seq_2096,0.194,0.484
Seq_2097,0.3,0.4
Seq_2098,0.385,0.423
Seq_2099,0.522,0.174
Seq_2100,0.636,0.182
Seq_2101,0.727,0.273
Seq_2102,0.368,0.368
Seq_2103,0.442,0.302
Seq_2104,0.375,0.304
Seq_2105,0.688,0.125
Seq_2106,0.37,0.296
Seq_2107,0.385,0.231
Seq_2108,0.645,0.226
Seq_2109,0.375,0.375
Seq_2110,0.467,0.267
Seq_2111,0.5,0.219
Seq_2112,0.373,0.431
Seq_2113,0.241,0.483
Seq_2114,0.233,0.433
Seq_2115,0.3,0.367
Seq_2116,0.333,0.444
Seq_2117,0.519,0.37
Seq_2118,0.667,0.19
Seq_2119,0.28,0.48
Seq_2120,0.692,0.192
Seq_2121,0.438,0.312
Seq_2122,0.462,0.385
Seq_2123,0.5,0.444
Seq_2124,0.6,0.2
Seq_2125,0.385,0.385
Seq_2126,0.556,0.333
Seq_2127,0.545,0.273
Seq_2128,0.667,0.167
Seq_2129,0.389,0.278
Seq_2130,0.545,0.273
Seq_2131,0.621,0.172
Seq_2132,0.414,0.448
Seq_2133,0.385,0.385
Seq_2134,0.381,0.333
Seq_2135,0.435,0.348
Seq_2136,0.478,0.304
Seq_2137,0.529,0.353
Seq_2138,0.471,0.412
Seq_2139,0.378,0.289
Seq_2140,0.2,0.267
Seq_2141,0.2,0.267
Seq_2142,0.52,0.28
Seq_2143,0.654,0.308
Seq_2144,0.761,0.043
Seq_2145,0.158,0.553
Seq_2146,0.185,0.63
Seq_2147,0.1,0.6
Seq_2148,0.417,0.25
Seq_2149,0.442,0.279
Seq_2150,0.154,0.385
Seq_2151,0.478,0.326
Seq_2152,0.491,0.164
Seq_2153,0.509,0.127
Seq_2154,0.488,0.279
Seq_2155,0.362,0.362
Seq_2156,0.268,0.341
Seq_2157,0.286,0.357
Seq_2158,0.632,0.158
Seq_2159,0.393,0.393
Seq_2160,0.245,0.189
Seq_2161,0.515,0.242
Seq_2162,0.6,0.2
Seq_2163,0.483,0.276
Seq_2164,0.611,0.167
Seq_2165,0.466,0.259
Seq_2166,0.294,0.353
Seq_2167,0.5,0.269
Seq_2168,0.294,0.353
Seq_2169,0.296,0.222
Seq_2170,0.357,0.357
Seq_2171,0.35,0.3
Seq_2172,0.333,0.389
Seq_2173,0.423,0.154
Seq_2174,0.364,0.455
Seq_2175,0.467,0.333
Seq_2176,0.3,0.35
Seq_2177,0.542,0.305
Seq_2178,0.286,0.357
Seq_2179,0.333,0.333
Seq_2180,0.417,0.583
Seq_2181,0.385,0.385
Seq_2182,0.222,0.417
Seq_2183,0.385,0.308
Seq_2184,0.385,0.308
Seq_2185,0.308,0.385
Seq_2186,0.444,0.278
Seq_2187,0.316,0.316
Seq_2188,0.385,0.308
Seq_2189,0.545,0.227
Seq_2190,0.364,0.318
Seq_2191,0.417,0.333
Seq_2192,0.588,0.235
Seq_2193,0.647,0.118
Seq_2194,0.636,0.182
Seq_2195,0.667,0.19
Seq_2196,0.667,0.111
Seq_2197,0.704,0.037
Seq_2198,0.8,0.0
Seq_2199,0.5,0.214
Seq_2200,0.345,0.379
Seq_2201,0.406,0.312
Seq_2202,0.333,0.333
Seq_2203,0.368,0.368
Seq_2204,0.4,0.4
Seq_2205,0.54,0.26
Seq_2206,0.333,0.467
Seq_2207,0.4,0.4
Seq_2208,0.52,0.18
Seq_2209,0.571,0.143
Seq_2210,0.625,0.167
Seq_2211,0.605,0.105
Seq_2212,0.549,0.333
Seq_2213,0.471,0.333
Seq_2214,0.136,0.5
Seq_2215,0.431,0.255
Seq_2216,0.4,0.311
Seq_2217,0.455,0.394
Seq_2218,0.364,0.273
Seq_2219,0.294,0.353
Seq_2220,0.462,0.231
Seq_2221,0.5,0.107
Seq_2222,0.389,0.167
Seq_2223,0.302,0.395
Seq_2224,0.302,0.372
Seq_2225,0.302,0.349
Seq_2226,0.333,0.333
Seq_2227,0.483,0.276
Seq_2228,0.5,0.333
Seq_2229,0.414,0.345
Seq_2230,0.615,0.231
Seq_2231,0.5,0.375
Seq_2232,0.433,0.267
Seq_2233,0.385,0.385
Seq_2234,0.312,0.5
Seq_2235,0.3,0.3
Seq_2236,0.533,0.2
Seq_2237,0.533,0.133
Seq_2238,0.424,0.273
Seq_2239,0.238,0.476
Seq_2240,0.419,0.355
Seq_2241,0.45,0.4
Seq_2242,0.565,0.261
Seq_2243,0.5,0.318
Seq_2244,0.396,0.377
Seq_2245,0.408,0.306
Seq_2246,0.375,0.333
Seq_2247,0.189,0.243
Seq_2248,0.48,0.32
Seq_2249,0.5,0.083
Seq_2250,0.5,0.35
Seq_2251,0.588,0.176
Seq_2252,0.556,0.222
Seq_2253,0.571,0.381
Seq_2254,0.6,0.3
Seq_2255,0.586,0.31
Seq_2256,0.737,0.105
Seq_2257,0.421,0.263
Seq_2258,0.583,0.417
Seq_2259,0.583,0.417
Seq_2260,0.684,0.158
Seq_2261,0.385,0.462
Seq_2262,0.476,0.19
Seq_2263,0.462,0.538
Seq_2264,0.667,0.292
Seq_2265,0.714,0.214
Seq_2266,0.286,0.571
Seq_2267,0.429,0.357
Seq_2268,0.61,0.293
Seq_2269,0.706,0.176
Seq_2270,0.647,0.176
Seq_2271,0.529,0.294
Seq_2272,0.611,0.222
Seq_2273,0.529,0.235
Seq_2274,0.4,0.333
Seq_2275,0.344,0.312
Seq_2276,0.378,0.324
Seq_2277,0.714,0.214
Seq_2278,0.412,0.118
Seq_2279,0.588,0.235
Seq_2280,0.4,0.45
Seq_2281,0.444,0.289
Seq_2282,0.442,0.233
Seq_2283,0.471,0.147
Seq_2284,0.526,0.237
Seq_2285,0.545,0.273
Seq_2286,0.577,0.192
Seq_2287,0.469,0.312
Seq_2288,0.442,0.349
Seq_2289,0.483,0.207
Seq_2290,0.436,0.308
Seq_2291,0.371,0.314
Seq_2292,0.375,0.312
Seq_2293,0.304,0.304
Seq_2294,0.583,0.333
Seq_2295,0.5,0.214
Seq_2296,0.375,0.281
Seq_2297,0.459,0.351
Seq_2298,0.071,0.214
Seq_2299,0.378,0.432
Seq_2300,0.238,0.31
Seq_2301,0.28,0.28
Seq_2302,0.324,0.432
Seq_2303,0.517,0.31
Seq_2304,0.579,0.263
Seq_2305,0.48,0.2
Seq_2306,0.412,0.235
Seq_2307,0.591,0.182
Seq_2308,0.286,0.343
Seq_2309,0.438,0.25
Seq_2310,0.368,0.421
Seq_2311,0.6,0.25
Seq_2312,0.55,0.35
Seq_2313,0.6,0.3
Seq_2314,0.5,0.417
Seq_2315,0.444,0.333
Seq_2316,0.421,0.421
Seq_2317,0.389,0.444
Seq_2318,0.471,0.471
Seq_2319,0.5,0.333
Seq_2320,0.4,0.35
Seq_2321,0.733,0.2
Seq_2322,0.562,0.312
Seq_2323,0.474,0.421
Seq_2324,0.533,0.267
Seq_2325,0.529,0.294
Seq_2326,0.6,0.2
Seq_2327,0.5,0.333
Seq_2328,0.375,0.5
Seq_2329,0.526,0.263
Seq_2330,0.714,0.214
Seq_2331,0.533,0.267
Seq_2332,0.385,0.538
Seq_2333,0.636,0.182
Seq_2334,0.667,0.222
Seq_2335,0.483,0.293
Seq_2336,0.292,0.458
Seq_2337,0.318,0.295
Seq_2338,0.273,0.341
Seq_2339,0.455,0.242
Seq_2340,0.211,0.395
Seq_2341,0.277,0.383
Seq_2342,0.314,0.333
Seq_2343,0.344,0.25
Seq_2344,0.281,0.281
Seq_2345,0.419,0.452
Seq_2346,0.552,0.207
Seq_2347,0.483,0.31
Seq_2348,0.538,0.308
Seq_2349,0.462,0.385
Seq_2350,0.462,0.462
Seq_2351,0.462,0.385
Seq_2352,0.5,0.227
Seq_2353,0.455,0.364
Seq_2354,0.423,0.231
Seq_2355,0.333,0.333
Seq_2356,0.545,0.318
Seq_2357,0.611,0.111
Seq_2358,0.538,0.231
Seq_2359,0.182,0.182
Seq_2360,0.4,0.3
Seq_2361,0.545,0.227
Seq_2362,0.612,0.163
Seq_2363,0.6,0.267
Seq_2364,0.571,0.286
Seq_2365,0.533,0.2
Seq_2366,0.333,0.4
Seq_2367,0.364,0.364
Seq_2368,0.605,0.233
Seq_2369,0.421,0.263
Seq_2370,0.421,0.263
Seq_2371,0.579,0.263
Seq_2372,0.368,0.368
Seq_2373,0.368,0.368
Seq_2374,0.5,0.278
Seq_2375,0.52,0.36
Seq_2376,0.556,0.296
Seq_2377,0.538,0.333
Seq_2378,0.618,0.273
Seq_2379,0.513,0.333
Seq_2380,0.636,0.227
Seq_2381,0.308,0.308
Seq_2382,0.565,0.217
Seq_2383,0.525,0.3
Seq_2384,0.368,0.342
Seq_2385,0.4,0.291
Seq_2386,0.424,0.303
Seq_2387,0.4,0.35
Seq_2388,0.538,0.282
Seq_2389,0.536,0.214
Seq_2390,0.571,0.179
Seq_2391,0.158,0.395
Seq_2392,0.526,0.211
Seq_2393,0.25,0.083
Seq_2394,0.237,0.395
Seq_2395,0.351,0.378
Seq_2396,0.4,0.3
Seq_2397,0.591,0.182
Seq_2398,0.2,0.6
Seq_2399,0.273,0.455
Seq_2400,0.615,0.077
Seq_2401,0.615,0.077
Seq_2402,0.6,0.1
Seq_2403,0.347,0.327
Seq_2404,0.438,0.312
Seq_2405,0.409,0.273
Seq_2406,0.613,0.226
Seq_2407,0.5,0.25
Seq_2408,0.786,0.143
Seq_2409,0.5,0.3
Seq_2410,0.538,0.231
Seq_2411,0.538,0.154
Seq_2412,0.562,0.188
Seq_2413,0.4,0.267
Seq_2414,0.536,0.357
Seq_2415,0.469,0.312
Seq_2416,0.417,0.306
Seq_2417,0.257,0.2
Seq_2418,0.32,0.44
Seq_2419,0.613,0.065
Seq_2420,0.356,0.311
Seq_2421,0.435,0.348
Seq_2422,0.474,0.263
Seq_2423,0.45,0.45
Seq_2424,0.158,0.421
Seq_2425,0.244,0.317
Seq_2426,0.5,0.227
Seq_2427,0.385,0.538
Seq_2428,0.423,0.346
Seq_2429,0.41,0.359
Seq_2430,0.383,0.362
Seq_2431,0.458,0.333
Seq_2432,0.294,0.235
Seq_2433,0.275,0.275
Seq_2434,0.389,0.333
Seq_2435,0.467,0.367
Seq_2436,0.6,0.125
Seq_2437,0.545,0.273
Seq_2438,0.515,0.333
Seq_2439,0.49,0.235
Seq_2440,0.48,0.28
Seq_2441,0.333,0.273
Seq_2442,0.281,0.469
Seq_2443,0.667,0.333
Seq_2444,0.667,0.333
Seq_2445,0.455,0.455
Seq_2446,0.538,0.385
Seq_2447,0.462,0.462
Seq_2448,0.571,0.429
Seq_2449,0.364,0.545
Seq_2450,0.643,0.286
Seq_2451,0.5,0.357
Seq_2452,0.457,0.343
Seq_2453,0.406,0.312
Seq_2454,0.25,0.364
Seq_2455,0.375,0.5
Seq_2456,0.404,0.383
Seq_2457,0.65,0.25
Seq_2458,0.692,0.0
Seq_2459,0.258,0.484
Seq_2460,0.133,0.533
Seq_2461,0.421,0.342
Seq_2462,0.333,0.361
Seq_2463,0.44,0.4
Seq_2464,0.308,0.462
Seq_2465,0.382,0.353
Seq_2466,0.536,0.143
Seq_2467,0.455,0.318
Seq_2468,0.538,0.308
Seq_2469,0.508,0.237
Seq_2470,0.214,0.357
Seq_2471,0.318,0.5
Seq_2472,0.108,0.189
Seq_2473,0.455,0.273
Seq_2474,0.357,0.286
Seq_2475,0.641,0.256
Seq_2476,0.42,0.26
Seq_2477,0.52,0.24
Seq_2478,0.452,0.238
Seq_2479,0.182,0.576
Seq_2480,0.5,0.5
Seq_2481,0.462,0.462
Seq_2482,0.371,0.429
Seq_2483,0.481,0.185
Seq_2484,0.472,0.25
Seq_2485,0.429,0.286
Seq_2486,0.55,0.3
Seq_2487,0.245,0.449
Seq_2488,0.35,0.2
Seq_2489,0.32,0.24
Seq_2490,0.387,0.226
Seq_2491,0.375,0.375
Seq_2492,0.333,0.417
Seq_2493,0.3,0.4
Seq_2494,0.346,0.346
Seq_2495,0.565,0.261
Seq_2496,0.125,0.688
Seq_2497,0.28,0.36
Seq_2498,0.5,0.278
Seq_2499,0.486,0.286
Seq_2500,0.576,0.182
Seq_2501,0.286,0.286
Seq_2502,0.786,0.0
Seq_2503,0.6,0.16
Seq_2504,0.29,0.484
Seq_2505,0.5,0.312
Seq_2506,0.607,0.286
Seq_2507,0.37,0.333
Seq_2508,0.2,0.5
Seq_2509,0.5,0.333
Seq_2510,0.458,0.333
Seq_2511,0.6,0.275
Seq_2512,0.487,0.308
Seq_2513,0.45,0.3
Seq_2514,0.432,0.27
Seq_2515,0.432	,0.27	
