Sequence,Activity
GLWSKIKEVGKEAAKAAAKAAGKAALGAVSEAV,anticancer
GLFDIIKKIAESI,anticancer
GLFDIIKKIAESF,anticancer
GLLDIVKKVVGAFGSL,anticancer
GLFDIVKKVVGALGSL,anticancer
GLFDIVKKVVGAIGSL,anticancer
GLFDIVKKVVGTLAGL,anticancer
GLFDIVKKVVGAFGSL,anticancer
GLFDIAKKVIGVIGSL,anticancer
GLFDIVKKIAGHIAGSI,anticancer
GLFDIVKKIAGHIASSI,anticancer
GLFDIVKKIAGHIVSSI,anticancer
AACARFIDDFCDTLTPNIYRPRDNGQRCYAVNGHRCDFTVFNTNNGGNPIRASTPNCKTVLRTAANRCPTGGRGKINPNAPFLFAIDPNDGDCSTNF,anticancer
HGVSGHGQHGVHG,anticancer
FKCRRWQWRMKKLGAPSITCVRRAF,anticancer
KWKLFKKIKFLHSAKKF,anticancer
KSSAYSLQMGATAIKQVKKLFKKWGW,anticancer
GIGTKILGGVKTALKGALKELASTYAN,anticancer
GIGGKILSGLKTALKGAAKELASTYLH,anticancer
GIGGVLLSAGKAALKGLAKVLAEKYAN,anticancer
SIGAKILGGVKTFFKGALKELASTYLQ,anticancer
FLPLLAGLAANFLPTIICKISYKC,anticancer
FVQWFSKFLGRIL,anticancer
KWKIFKKIEKVGRNIRNGIIKAGPAVAVLGEAKAL,anticancer
GWLKKIGKKIERVGQHTRDATIQTIGVAQQAANVAATLK,anticancer
KWKLFKKIEKVGQNIRDGIIKAGPAVAVVGQATQIAK,anticancer
SQLGDLGSGAGQGGGGGGSIRAAGGAFGKLEAAREEEFFYKKQKEQLERLKNDQIHQAEFHHQQIKEHEEAIQRHKDFLNNLHK,anticancer
GIGKFLHSAKKFGKAFVGEIMNS,anticancer
GIGAVLKVLTTGLPALISWIKRKRQQ,anticancer
ALWKNMLKGIGKLAGQAALGAVKTLVGAE,anticancer
ACYCRIPACIAGERRYGTCIYQGRLWAFCC,anticancer
CYCRIPACIAGERRYGTCIYQGRLWAFCC,anticancer
DCYCRIPACIAGERRYGTCIYQGRLWAFCC,anticancer
ECRRLCYKQRCVTYCRGR,anticancer
LKLKSIVSWAKKVL,anticancer
KWCFRVCYRGICYRRCR,anticancer
KSCCRNTWARNCYNVCRLPGTISREICAKKCDCKIISGTTCPSDYPK,anticancer
GLLSVLGSVAKHVLPHVVPVIAEHL,anticancer
GLLSVLGSVAQHVLPHVVPVIAEHL,anticancer
GLLSVLGSVVKHVIPHVVPVIAEHL,anticancer
GLFSVLGAVAKHVLPHVVPVIAEK,anticancer
GLFKVLGSVAKHLLPHVAPVIAEK,anticancer
GLFKVLGSVAKHLLPHVVPVIAEK,anticancer
GLFGVLGSIAKHVLPHVVPVIAEK,anticancer
GLFVGVLAKVAAHVVPAIAEHF,anticancer
GLFVGLAKVAAHNNPAIAEHFQA,anticancer
GFVDFLKKVAGTIANVVT,anticancer
GLLQTIKEKLESLESLAKGIVSGIQA,anticancer
TRSSRAGLQFPVGRVHRLLRK,anticancer
FFGWLIKGAIHAGKAIHGLIHRRRH,anticancer
GLLSVLGSVAKHVLPHVVPVIAEKL,anticancer
GLFDVIKKVASVIGGL,anticancer
GLFDIIKKVASVVGGL,anticancer
GLFDIIKKVASVIGGL,anticancer
GRFKRFRKKFKKLFKKLSPVIPLLHLG,anticancer
GGLRSLGRKILRAWKKYGPIIVPIIRIG,anticancer
RRRPRPPYLPRPRPPPFFPPRLPPRIPPGFPPRFPPRFP,anticancer
GLLGPLLKIAAKVGSNLL,anticancer
GLICESCRKIIQKLEDMVGPQPNEDTVTQAASQVCDKLKILRGLCKKIMRSFLRRISWDILTGKKPQAICVDIKICKEKTGLI,anticancer
DHYNCVSSGGQCLYSACPIFTKIQGTCYRGKAKCCK,anticancer
FFHHIFRGIVHVGKTIHRLVTG,anticancer
KLAKLAKKLAKLAK,anticancer
KTCENLADTFRGPCFATSNC,anticancer
IDWKKLLDAAKQIL,anticancer
KTCENLADTY,anticancer
FLIGMTQGLICLITRKC,anticancer
ILPILSLIGGLLGK,anticancer
GLLGLLGSVVSHVVPAIVGHF,anticancer
FKRIVQRIKDFLR,anticancer
GLLGLLGSVVSHVLPAITQHL,anticancer
GIKCRFCCGCCTPGICGVCCRF,anticancer
QSHLSLCRWCCNCCRSNKGC,anticancer
ILGPVISTIGGVLGGLLKNL,anticancer
FLPILASLAAKFGPKLFCLVTKKC,anticancer
GLWSKIKEAAKAAGKAALNAVTGLVNQGDQPS,anticancer
LLGMIPLAISAISALSKL,anticancer
GLPVCGETCVGGTCNTPGCSCSWPVCTRN,anticancer
GVPICGETCTLGTCYTAGCSCSWPVCTRN,anticancer
GIPCGESCVWIPCISSAIGCSCKSKVCYRN,anticancer
GIPCAESCVWIPCTVTALIGCGCSNKVCYN,anticancer
GTFPCGESCVFIPCLTSAIGCSCKSKVCYKN,anticancer
GLLPCAESCVYIPCLTTVIGCSCKSKVCYKN,anticancer
GRDYRTCLTIVQKLKKMVDKPTQRSVSNAATRVCRTGRSRWRDVCRNFMRRYQSRVTQGLVAGETAQQICEDLRLCIPSTGPL,anticancer
GETDPNTQLLNDLGNNMAWGAALGAPGGLGSAALGAAGGALQTVGQGLIDHGPVNVFIPVLIGPSWNGSGSGYNSATSSSGSGS,anticancer
GFKDLLKGAAKALVKTVLF,anticancer
KSCCPNTTGRNIYNACRLTGAPRPTCAKLSGCKIISGSTCPSDYPK,anticancer
KSCCPNTTGRNIYNTCRFGGGSREVCARISGCKIISASTCPSDYPK,anticancer
KSCCPNTTGRNIYNTCRLTGSSRETCAKLSGCKIISASTCPSNYPK,anticancer
KSCCPNTTGRNIYNTCRFAGGSRERCAKLSGCKIISASTCPSDYPK,anticancer
KSCCPNTTGRNIYNTCRFGGGSRQVCASLSGCKIISASTCPSDYPK,anticancer
KSCCPNTTGRNIYNTCRLGGGSRERCASLSGCKIISASTCPSDYPK,anticancer
MRKEFHNVLSSGQLLADKRPARDYNRK,anticancer
KSCCKNTTGRNIYNTCRFAGGSRERCAKLSGCKIISASTCPSDYPK,anticancer
FIFHIIKGLFHAGKMIHGLVTRRRH,anticancer
ACSAG,anticancer
FLPAIVGAAAKFLPKIFCAISKKC,anticancer
FLPIIAGVAAKVLPKIFCAISKKC,anticancer
FLPIIAGIAAKFLPKIFCTISKKC,anticancer
FLPVIAGVAANFLPKLFCAISKKC,anticancer
FLPIIAGAAAKVVQKIFCAISKKC,anticancer
FLPIIAGAAAKVVEKIFCAISKKC,anticancer
GLMDTIKGVAKTVAASWLDKLKCKITGC,anticancer
VNWKKVLGKIIKVAK,anticancer
VNWKKILGKIIKVAK,anticancer
VNWKKILGKIIKVVK,anticancer
FFSLLPSLIGGLVSAIK,anticancer
AMVGT,anticancer
RFRLPFRRPPIRIHPPPFYPPFRRFL,anticancer
KWKLFKKIPKFLHLAKKF,anticancer
YKQCHKKGGHCFPKEKICLPPSSDFGKMDCRWRWKCCKKGSG,anticancer
GIPCGESCVFIPCITGAIGCSCKSKVCYRN,anticancer
GEFLKCGESCVQGECYTPGCSCDWPICKKN,anticancer
GLPTCGETCTLGTCYVPDCSCSWPICMKN,anticancer
GIPCGESCVFIPCITAAIGCSCKSKVCYRN,anticancer
GLPVCGETCAGGTCNTPGCSCSWPICTRN,anticancer
GLPVCGETCFGGTCNTPGCTCDPWPVCTRN,anticancer
FVDLKKIANIINSIFGK,anticancer
AWKLFDDGV,anticancer
GLPVCGETCVGGTCNTPGCACSWPVCTRN,anticancer
GLPVCGETCVGGTCNTPGCGCSWPVCTRN,anticancer
GSIPCGESCVFIPCISSVIGCACKSKVCYKN,anticancer
GIPCGESCVFIPCISSVIGCSCSSKVCYRN,anticancer
GSIPCGESCVFIPCISAVIGCSCSNKVCYKN,anticancer
GSIPCGESCVFIPCISAIIGCSCSSKVCYKN,anticancer
GSIPCEGSCVFIPCISAIIGCSCSNKVCYKN,anticancer
GIPCGESCVFIPCLTSAIDCSCKSKVCYRN,anticancer
GMWSKILGHLIR,anticancer
GKWMSLLKHILK,anticancer
GFGMALKLLKKVL,anticancer
GTGLPMSERRKIMLMMR,anticancer
GIACGESCVFLGCFIPGCSCKSKVCYFN,anticancer
GVIPCGESCVFIPCISSVLGCSCKNKVCYRD,anticancer
KLCGETCFKFKCYTPGCSCSYPFCK,anticancer
GDACGETCFTGICFTAGCSCNPWPTCTRN,anticancer
GIPCAESCVWIPPCTITALMGCSCKNNVCYNN,anticancer
GASCGETCFTGICFTAGCSCNPWPTCTRN,anticancer
IPCGESCVWIPCITAIAGCSCKNKVCYT,anticancer
AIPCGESCVWIPCISTVIGCSCSNKVCYR,anticancer
GEYCGESCYLIPCFTPGCYCVSRQCVNKN,anticancer
IPCGESCVWIPCISGMFGCSCKDKVCYS,anticancer
