ID,AAC_A,AAC_C,AAC_D,AAC_E,AAC_F,AAC_G,AAC_H,AAC_I,AAC_K,AAC_L,AAC_M,AAC_N,AAC_P,AAC_Q,AAC_R,AAC_S,AAC_T,AAC_V,AAC_W,AAC_Y
Seq_1,16.67,0.00,0.00,0.00,0.00,11.11,0.00,11.11,16.67,5.56,0.00,0.00,5.56,2.78,0.00,5.56,2.78,22.22,0.00,0.00
Seq_2,10.00,0.00,0.00,0.00,5.00,10.00,0.00,5.00,10.00,25.00,0.00,0.00,5.00,0.00,0.00,20.00,0.00,10.00,0.00,0.00
Seq_3,7.69,0.00,0.00,0.00,7.69,15.38,0.00,15.38,7.69,38.46,0.00,0.00,7.69,0.00,0.00,0.00,0.00,0.00,0.00,0.00
Seq_4,0.00,0.00,0.00,0.00,7.69,7.69,0.00,15.38,0.00,38.46,0.00,0.00,23.08,0.00,7.69,0.00,0.00,0.00,0.00,0.00
Seq_5,0.00,0.00,0.00,0.00,7.69,7.69,0.00,23.08,0.00,30.77,0.00,0.00,7.69,0.00,15.38,0.00,0.00,7.69,0.00,0.00
Seq_6,0.00,0.00,0.00,8.70,8.70,8.70,4.35,0.00,13.04,13.04,4.35,4.35,0.00,0.00,13.04,4.35,0.00,8.70,0.00,8.70
Seq_7,5.88,0.00,0.00,5.88,0.00,11.76,0.00,17.65,17.65,11.76,0.00,5.88,0.00,0.00,0.00,11.76,0.00,5.88,5.88,0.00
Seq_8,21.43,0.00,0.00,0.00,0.00,7.14,0.00,14.29,21.43,14.29,7.14,7.14,0.00,0.00,0.00,0.00,0.00,0.00,7.14,0.00
Seq_9,14.29,0.00,14.29,0.00,0.00,0.00,0.00,14.29,21.43,21.43,0.00,0.00,0.00,7.14,0.00,0.00,0.00,0.00,7.14,0.00
Seq_10,9.09,0.00,7.27,7.27,0.00,10.91,0.00,7.27,20.00,7.27,1.82,5.45,1.82,1.82,1.82,1.82,5.45,3.64,3.64,3.64
Seq_11,0.00,0.00,0.00,0.00,7.69,15.38,0.00,15.38,0.00,30.77,0.00,0.00,7.69,0.00,7.69,7.69,0.00,7.69,0.00,0.00
Seq_12,0.00,0.00,0.00,0.00,0.00,7.69,0.00,7.69,0.00,46.15,0.00,15.38,7.69,0.00,0.00,7.69,0.00,7.69,0.00,0.00
Seq_13,10.17,12.71,6.78,1.69,4.24,7.63,2.54,3.39,6.78,5.08,0.85,7.63,4.24,5.08,2.54,0.85,7.63,2.54,0.00,7.63
Seq_14,22.22,0.00,0.00,3.70,3.70,18.52,3.70,7.41,11.11,14.81,0.00,3.70,0.00,0.00,0.00,11.11,0.00,0.00,0.00,0.00
Seq_15,11.54,0.00,0.00,0.00,7.69,15.38,3.85,7.69,26.92,7.69,0.00,0.00,0.00,0.00,7.69,3.85,0.00,3.85,0.00,3.85
Seq_16,10.00,0.00,0.00,10.00,0.00,0.00,0.00,0.00,30.00,10.00,10.00,0.00,0.00,5.00,5.00,10.00,0.00,0.00,5.00,5.00
Seq_17,4.17,0.00,4.17,4.17,4.17,4.17,0.00,4.17,29.17,8.33,4.17,0.00,0.00,8.33,0.00,8.33,4.17,4.17,4.17,4.17
Seq_18,7.14,0.00,0.00,3.57,21.43,10.71,0.00,0.00,25.00,7.14,3.57,3.57,0.00,0.00,10.71,3.57,0.00,0.00,0.00,3.57
Seq_19,2.33,9.30,4.65,0.00,0.00,23.26,0.00,6.98,11.63,2.33,0.00,4.65,2.33,4.65,0.00,2.33,4.65,9.30,4.65,6.98
Seq_20,11.11,0.00,0.00,3.70,0.00,18.52,7.41,3.70,11.11,7.41,3.70,3.70,3.70,0.00,3.70,3.70,7.41,11.11,0.00,0.00
Seq_21,8.33,0.00,4.17,4.17,4.17,4.17,4.17,2.08,10.42,12.50,0.00,8.33,4.17,0.00,12.50,12.50,2.08,2.08,2.08,2.08
Seq_22,27.03,0.00,2.70,5.41,2.70,8.11,0.00,5.41,2.70,2.70,0.00,2.70,5.41,5.41,10.81,2.70,2.70,10.81,2.70,0.00
Seq_23,0.00,14.29,0.00,0.00,2.38,16.67,0.00,9.52,2.38,2.38,2.38,2.38,11.90,2.38,11.90,9.52,2.38,7.14,2.38,0.00
Seq_24,4.05,0.00,6.76,1.35,2.70,17.57,2.70,4.05,8.11,2.70,0.00,8.11,8.11,9.46,6.76,4.05,4.05,4.05,4.05,1.35
Seq_25,18.18,9.09,0.00,0.00,6.06,9.09,0.00,3.03,18.18,15.15,0.00,3.03,0.00,6.06,0.00,9.09,0.00,0.00,0.00,3.03
Seq_26,21.21,6.06,3.03,3.03,0.00,6.06,0.00,6.06,18.18,9.09,3.03,3.03,0.00,0.00,0.00,9.09,6.06,6.06,0.00,0.00
Seq_27,12.50,8.33,0.00,0.00,8.33,4.17,0.00,12.50,8.33,20.83,0.00,4.17,8.33,0.00,0.00,4.17,4.17,0.00,0.00,4.17
Seq_28,0.00,17.14,2.86,2.86,0.00,11.43,2.86,0.00,5.71,14.29,2.86,2.86,0.00,0.00,20.00,2.86,5.71,2.86,0.00,5.71
Seq_29,9.09,18.18,0.00,3.03,3.03,6.06,3.03,6.06,0.00,9.09,0.00,0.00,6.06,0.00,30.30,0.00,0.00,6.06,0.00,0.00
Seq_30,0.00,15.79,2.63,0.00,2.63,15.79,5.26,2.63,2.63,7.89,2.63,0.00,5.26,7.89,7.89,5.26,10.53,0.00,0.00,5.26
Seq_31,7.69,0.00,0.00,0.00,15.38,0.00,0.00,0.00,0.00,46.15,0.00,0.00,7.69,0.00,7.69,15.38,0.00,0.00,0.00,0.00
Seq_32,0.00,0.00,0.00,0.00,6.67,20.00,0.00,20.00,13.33,26.67,0.00,0.00,6.67,0.00,0.00,0.00,6.67,0.00,0.00,0.00
Seq_33,0.00,0.00,0.00,0.00,5.26,15.79,0.00,15.79,10.53,26.32,0.00,5.26,10.53,0.00,0.00,0.00,0.00,10.53,0.00,0.00
Seq_34,5.56,0.00,11.11,0.00,2.78,2.78,2.78,11.11,13.89,5.56,2.78,5.56,0.00,11.11,2.78,8.33,2.78,2.78,5.56,2.78
Seq_35,33.33,0.00,0.00,0.00,0.00,0.00,0.00,0.00,43.48,0.00,0.00,0.00,13.04,0.00,0.00,4.35,2.90,2.90,0.00,0.00
Seq_36,13.04,8.70,0.00,0.00,4.35,4.35,0.00,8.70,8.70,13.04,0.00,0.00,8.70,0.00,8.70,8.70,0.00,13.04,0.00,0.00
Seq_37,23.53,5.88,0.00,0.00,5.88,11.76,0.00,0.00,14.71,11.76,0.00,5.88,0.00,5.88,0.00,8.82,0.00,2.94,0.00,2.94
Seq_38,20.00,6.67,3.33,3.33,0.00,6.67,3.33,3.33,13.33,13.33,0.00,3.33,0.00,0.00,3.33,3.33,10.00,6.67,0.00,0.00
Seq_39,6.45,6.45,3.23,3.23,3.23,16.13,0.00,9.68,12.90,6.45,0.00,6.45,3.23,0.00,3.23,6.45,0.00,9.68,3.23,0.00
Seq_40,4.55,0.00,0.00,18.18,0.00,13.64,0.00,4.55,18.18,9.09,0.00,4.55,0.00,0.00,0.00,4.55,0.00,18.18,4.55,0.00
Seq_41,6.52,4.35,2.17,6.52,4.35,15.22,0.00,15.22,21.74,8.70,0.00,2.17,0.00,0.00,2.17,4.35,4.35,2.17,0.00,0.00
Seq_42,8.11,5.41,2.70,2.70,5.41,16.22,0.00,8.11,18.92,13.51,2.70,2.70,0.00,0.00,0.00,5.41,2.70,5.41,0.00,0.00
Seq_43,3.85,3.85,7.69,3.85,0.00,0.00,7.69,3.85,30.77,15.38,0.00,3.85,0.00,0.00,7.69,0.00,0.00,11.54,0.00,0.00
Seq_44,10.71,7.14,7.14,0.00,0.00,7.14,0.00,10.71,17.86,10.71,3.57,3.57,0.00,0.00,0.00,0.00,14.29,7.14,0.00,0.00
Seq_45,9.76,0.00,4.88,0.00,0.00,7.32,0.00,9.76,14.63,7.32,0.00,7.32,2.44,4.88,2.44,9.76,4.88,9.76,4.88,0.00
Seq_46,0.00,12.12,0.00,12.12,0.00,12.12,3.03,0.00,0.00,3.03,3.03,0.00,3.03,9.09,33.33,3.03,3.03,0.00,3.03,0.00
Seq_47,7.69,19.23,0.00,0.00,3.85,15.38,7.69,0.00,0.00,0.00,3.85,3.85,0.00,3.85,11.54,3.85,3.85,3.85,0.00,11.54
Seq_48,4.17,20.83,0.00,4.17,0.00,12.50,0.00,4.17,8.33,0.00,0.00,8.33,0.00,12.50,0.00,4.17,8.33,4.17,0.00,8.33
Seq_49,0.00,18.18,0.00,0.00,9.09,0.00,0.00,18.18,0.00,0.00,9.09,0.00,18.18,0.00,9.09,0.00,9.09,0.00,0.00,9.09
Seq_50,8.33,16.67,0.00,0.00,8.33,0.00,8.33,16.67,0.00,8.33,0.00,0.00,16.67,0.00,8.33,0.00,0.00,8.33,0.00,0.00
Seq_51,24.14,0.00,0.00,0.00,0.00,6.90,0.00,13.79,20.69,13.79,0.00,0.00,10.34,0.00,0.00,6.90,0.00,3.45,0.00,0.00
Seq_52,0.00,14.29,0.00,0.00,4.76,14.29,2.38,7.14,2.38,0.00,0.00,2.38,7.14,4.76,19.05,0.00,7.14,9.52,2.38,2.38
Seq_53,0.00,19.35,0.00,0.00,9.68,3.23,0.00,3.23,0.00,6.45,0.00,3.23,3.23,3.23,22.58,0.00,16.13,3.23,0.00,6.45
Seq_54,47.37,0.00,0.00,0.00,5.26,5.26,0.00,0.00,0.00,10.53,0.00,0.00,5.26,15.79,0.00,5.26,0.00,5.26,0.00,0.00
Seq_55,4.26,17.02,4.26,2.13,0.00,4.26,0.00,8.51,10.64,2.13,0.00,6.38,6.38,0.00,8.51,8.51,8.51,2.13,2.13,4.26
Seq_56,11.11,16.67,2.78,0.00,11.11,2.78,2.78,2.78,2.78,0.00,0.00,2.78,0.00,11.11,11.11,8.33,2.78,5.56,2.78,2.78
Seq_57,5.00,0.00,0.00,10.00,0.00,10.00,0.00,5.00,0.00,0.00,5.00,5.00,10.00,5.00,5.00,10.00,0.00,10.00,10.00,10.00
Seq_58,22.22,0.00,0.00,5.56,5.56,5.56,0.00,5.56,16.67,16.67,5.56,0.00,0.00,11.11,0.00,0.00,5.56,0.00,0.00,0.00
Seq_59,12.82,0.00,2.56,2.56,2.56,10.26,7.69,10.26,17.95,0.00,0.00,7.69,0.00,0.00,5.13,5.13,2.56,10.26,0.00,2.56
Seq_60,9.30,0.00,2.33,0.00,2.33,11.63,4.65,18.60,23.26,2.33,0.00,4.65,4.65,4.65,2.33,4.65,2.33,2.33,0.00,0.00
Seq_61,7.89,0.00,0.00,2.63,0.00,26.32,2.63,10.53,13.16,7.89,0.00,2.63,0.00,10.53,2.63,2.63,2.63,5.26,0.00,2.63
Seq_62,20.00,0.00,0.00,0.00,10.00,5.00,10.00,15.00,5.00,10.00,0.00,5.00,5.00,0.00,0.00,10.00,0.00,5.00,0.00,0.00
Seq_63,8.70,0.00,0.00,0.00,0.00,13.04,0.00,17.39,4.35,17.39,0.00,4.35,4.35,0.00,4.35,13.04,4.35,4.35,4.35,0.00
Seq_64,7.69,7.69,0.00,3.85,0.00,0.00,0.00,11.54,11.54,11.54,3.85,3.85,3.85,7.69,3.85,3.85,11.54,0.00,3.85,3.85
Seq_65,3.33,0.00,5.00,13.33,5.00,1.67,0.00,6.67,13.33,6.67,0.00,11.67,3.33,8.33,0.00,6.67,8.33,3.33,0.00,3.33
Seq_66,17.95,0.00,5.13,10.26,5.13,7.69,0.00,15.38,7.69,2.56,0.00,2.56,2.56,7.69,7.69,2.56,2.56,2.56,0.00,0.00
Seq_67,4.55,13.64,4.55,6.82,2.27,13.64,2.27,2.27,4.55,4.55,0.00,9.09,0.00,0.00,4.55,6.82,6.82,4.55,4.55,4.55
Seq_68,9.52,0.00,14.29,7.14,0.00,2.38,2.38,9.52,4.76,9.52,0.00,4.76,11.90,0.00,7.14,2.38,4.76,2.38,2.38,4.76
Seq_69,0.00,0.00,5.41,0.00,2.70,8.11,2.70,16.22,8.11,0.00,0.00,10.81,13.51,8.11,8.11,2.70,5.41,2.70,5.41,0.00
Seq_70,2.38,0.00,4.76,4.76,4.76,0.00,2.38,14.29,2.38,4.76,0.00,0.00,26.19,2.38,11.90,7.14,4.76,2.38,2.38,2.38
Seq_71,17.39,4.35,4.35,0.00,0.00,13.04,0.00,0.00,8.70,13.04,0.00,0.00,0.00,0.00,8.70,8.70,0.00,8.70,4.35,8.70
Seq_72,21.62,0.00,0.00,0.00,0.00,5.41,5.41,5.41,2.70,8.11,0.00,8.11,10.81,0.00,10.81,0.00,2.70,13.51,0.00,5.41
Seq_73,0.00,16.00,0.00,0.00,0.00,8.00,0.00,8.00,8.00,0.00,0.00,4.00,4.00,4.00,24.00,4.00,4.00,4.00,0.00,12.00
Seq_74,15.00,10.00,0.00,0.00,15.00,0.00,0.00,0.00,15.00,30.00,0.00,0.00,5.00,0.00,0.00,5.00,0.00,5.00,0.00,0.00
Seq_75,5.00,10.00,0.00,0.00,15.00,5.00,0.00,0.00,15.00,40.00,0.00,0.00,10.00,0.00,0.00,0.00,0.00,0.00,0.00,0.00
Seq_76,0.00,16.22,0.00,2.70,2.70,21.62,0.00,2.70,2.70,2.70,0.00,10.81,8.11,8.11,8.11,2.70,0.00,2.70,0.00,8.11
Seq_77,26.09,0.00,0.00,0.00,4.35,0.00,0.00,0.00,39.13,30.43,0.00,0.00,0.00,0.00,0.00,0.00,0.00,0.00,0.00,0.00
Seq_78,0.00,0.00,0.00,0.00,14.81,7.41,3.70,3.70,25.93,18.52,0.00,0.00,7.41,0.00,11.11,3.70,0.00,3.70,0.00,0.00
Seq_79,0.00,0.00,4.35,0.00,4.35,0.00,0.00,8.70,8.70,8.70,0.00,0.00,8.70,4.35,21.74,0.00,4.35,17.39,8.70,0.00
Seq_80,0.00,0.00,8.11,8.11,8.11,10.81,0.00,8.11,8.11,16.22,0.00,0.00,0.00,5.41,16.22,10.81,0.00,0.00,0.00,0.00
Seq_81,0.00,0.00,0.00,0.00,12.82,2.56,0.00,2.56,0.00,5.13,0.00,0.00,48.72,0.00,25.64,0.00,0.00,0.00,0.00,2.56
Seq_82,0.00,0.00,6.25,0.00,6.25,6.25,0.00,6.25,6.25,9.38,3.12,6.25,25.00,0.00,9.38,0.00,3.12,3.12,0.00,9.38
Seq_83,0.00,0.00,0.00,0.00,13.04,17.39,17.39,13.04,8.70,4.35,0.00,0.00,0.00,0.00,4.35,0.00,8.70,13.04,0.00,0.00
Seq_84,23.33,0.00,3.33,0.00,0.00,16.67,0.00,0.00,26.67,6.67,6.67,0.00,3.33,3.33,0.00,0.00,0.00,0.00,10.00,0.00
Seq_85,16.67,0.00,3.33,3.33,0.00,13.33,0.00,3.33,23.33,10.00,0.00,0.00,3.33,6.67,0.00,0.00,3.33,3.33,10.00,0.00
Seq_86,20.69,0.00,6.90,3.45,3.45,10.34,0.00,3.45,20.69,6.90,6.90,0.00,3.45,0.00,0.00,0.00,6.90,0.00,6.90,0.00
Seq_87,0.00,0.00,5.26,0.00,0.00,26.32,0.00,5.26,15.79,26.32,0.00,0.00,5.26,0.00,0.00,0.00,0.00,15.79,0.00,0.00
Seq_88,8.33,0.00,0.00,4.17,0.00,16.67,0.00,4.17,25.00,25.00,4.17,0.00,0.00,0.00,0.00,0.00,4.17,4.17,4.17,0.00
Seq_89,8.00,0.00,0.00,0.00,4.00,12.00,0.00,4.00,24.00,20.00,0.00,0.00,4.00,4.00,0.00,8.00,0.00,8.00,4.00,0.00
Seq_90,7.69,0.00,0.00,0.00,0.00,11.54,0.00,15.38,23.08,7.69,3.85,0.00,3.85,3.85,3.85,3.85,3.85,7.69,3.85,0.00
Seq_91,7.69,0.00,0.00,0.00,0.00,15.38,0.00,3.85,19.23,15.38,3.85,0.00,3.85,7.69,0.00,0.00,7.69,7.69,7.69,0.00
Seq_92,12.50,0.00,0.00,0.00,8.33,12.50,0.00,8.33,20.83,12.50,0.00,0.00,4.17,4.17,0.00,4.17,0.00,8.33,4.17,0.00
Seq_93,20.00,0.00,0.00,0.00,10.00,10.00,0.00,20.00,10.00,10.00,0.00,0.00,5.00,0.00,0.00,5.00,5.00,5.00,0.00,0.00
Seq_94,0.00,0.00,0.00,0.00,23.08,7.69,0.00,7.69,7.69,15.38,0.00,0.00,0.00,7.69,7.69,7.69,0.00,7.69,7.69,0.00
Seq_95,6.25,0.00,6.25,0.00,6.25,18.75,0.00,12.50,12.50,12.50,0.00,0.00,0.00,0.00,0.00,6.25,0.00,18.75,0.00,0.00
Seq_96,5.88,0.00,5.88,0.00,5.88,11.76,5.88,23.53,11.76,5.88,0.00,0.00,0.00,0.00,0.00,11.76,0.00,11.76,0.00,0.00
Seq_97,21.74,0.00,0.00,4.35,8.70,8.70,8.70,4.35,4.35,8.70,0.00,0.00,4.35,4.35,0.00,4.35,0.00,17.39,0.00,0.00
Seq_98,6.52,17.39,6.52,2.17,4.35,4.35,8.70,2.17,8.70,4.35,0.00,8.70,0.00,2.17,2.17,4.35,10.87,2.17,2.17,2.17
Seq_99,0.00,17.02,6.38,4.26,4.26,8.51,4.26,2.13,6.38,6.38,0.00,12.77,4.26,0.00,10.64,4.26,6.38,0.00,2.13,0.00
Seq_100,13.33,0.00,6.67,6.67,0.00,13.33,0.00,0.00,26.67,6.67,0.00,6.67,0.00,0.00,6.67,6.67,0.00,6.67,0.00,0.00
Seq_101,4.17,0.00,0.00,4.17,4.17,8.33,8.33,8.33,12.50,16.67,0.00,12.50,0.00,8.33,0.00,0.00,4.17,8.33,0.00,0.00
Seq_102,18.75,0.00,2.08,2.08,4.17,6.25,0.00,4.17,18.75,14.58,2.08,4.17,2.08,6.25,6.25,4.17,0.00,4.17,0.00,0.00
Seq_103,5.41,0.00,5.41,0.00,10.81,10.81,0.00,5.41,21.62,5.41,0.00,2.70,0.00,5.41,5.41,8.11,2.70,10.81,0.00,0.00
Seq_104,8.33,0.00,0.00,0.00,0.00,16.67,0.00,4.17,12.50,20.83,0.00,8.33,0.00,4.17,0.00,4.17,4.17,12.50,0.00,4.17
Seq_105,6.06,12.12,3.03,3.03,6.06,0.00,12.12,0.00,9.09,6.06,9.09,0.00,3.03,12.12,0.00,15.15,0.00,0.00,0.00,3.03
Seq_106,14.81,0.00,0.00,3.70,0.00,18.52,0.00,7.41,14.81,14.81,0.00,3.70,0.00,0.00,0.00,3.70,11.11,3.70,0.00,3.70
Seq_107,0.00,0.00,0.00,0.00,0.00,25.00,0.00,15.00,5.00,25.00,0.00,5.00,5.00,0.00,0.00,5.00,5.00,10.00,0.00,0.00
Seq_108,9.09,6.06,6.06,0.00,3.03,12.12,0.00,6.06,15.15,15.15,0.00,3.03,0.00,0.00,0.00,9.09,9.09,3.03,3.03,0.00
Seq_109,10.81,5.41,5.41,0.00,5.41,13.51,0.00,5.41,16.22,10.81,2.70,0.00,0.00,5.41,0.00,8.11,5.41,5.41,0.00,0.00
Seq_110,15.62,0.00,0.00,0.00,0.00,15.62,0.00,9.38,15.62,9.38,0.00,0.00,6.25,0.00,0.00,6.25,0.00,21.88,0.00,0.00
Seq_111,0.00,0.00,3.85,0.00,7.69,7.69,7.69,7.69,0.00,0.00,0.00,7.69,26.92,7.69,11.54,3.85,3.85,0.00,0.00,3.85
Seq_112,0.00,9.52,0.00,0.00,0.00,9.52,0.00,9.52,14.29,0.00,4.76,4.76,9.52,4.76,14.29,4.76,4.76,4.76,0.00,4.76
Seq_113,3.12,18.75,0.00,3.12,3.12,12.50,0.00,3.12,0.00,6.25,0.00,0.00,0.00,0.00,25.00,6.25,6.25,3.12,0.00,9.38
Seq_114,9.68,19.35,0.00,3.23,0.00,16.13,0.00,6.45,0.00,9.68,0.00,3.23,0.00,0.00,16.13,3.23,3.23,3.23,0.00,6.45
Seq_115,12.50,8.33,0.00,0.00,12.50,4.17,0.00,4.17,16.67,12.50,0.00,0.00,4.17,0.00,0.00,8.33,4.17,12.50,0.00,0.00
Seq_116,2.94,17.65,2.94,2.94,0.00,2.94,2.94,2.94,5.88,17.65,0.00,0.00,0.00,8.82,11.76,5.88,2.94,5.88,0.00,5.88
Seq_117,2.50,15.00,7.50,7.50,0.00,10.00,7.50,2.50,2.50,0.00,2.50,0.00,5.00,2.50,10.00,7.50,0.00,7.50,0.00,10.00
Seq_118,0.00,14.29,0.00,0.00,28.57,7.14,0.00,14.29,14.29,0.00,0.00,0.00,7.14,0.00,0.00,0.00,7.14,7.14,0.00,0.00
Seq_119,4.76,9.52,0.00,0.00,4.76,4.76,0.00,9.52,14.29,28.57,4.76,0.00,9.52,0.00,4.76,4.76,0.00,0.00,0.00,0.00
Seq_120,11.36,4.55,0.00,4.55,0.00,18.18,2.27,6.82,4.55,2.27,2.27,11.36,0.00,0.00,2.27,9.09,2.27,6.82,6.82,4.55
Seq_121,5.26,0.00,15.79,0.00,5.26,21.05,0.00,10.53,5.26,0.00,0.00,5.26,5.26,5.26,0.00,0.00,5.26,10.53,0.00,5.26
Seq_122,5.00,5.00,5.00,10.00,5.00,10.00,15.00,0.00,10.00,0.00,5.00,0.00,0.00,25.00,0.00,5.00,0.00,0.00,0.00,0.00
Seq_123,6.25,0.00,0.00,6.25,6.25,6.25,0.00,6.25,18.75,6.25,6.25,0.00,6.25,6.25,12.50,6.25,0.00,0.00,0.00,6.25
Seq_124,7.27,0.00,16.36,5.45,5.45,3.64,1.82,0.00,10.91,0.00,0.00,16.36,1.82,3.64,9.09,0.00,0.00,10.91,0.00,7.27
Seq_125,8.89,0.00,2.22,8.89,4.44,13.33,0.00,0.00,24.44,15.56,2.22,0.00,2.22,2.22,2.22,6.67,0.00,2.22,2.22,2.22
Seq_126,10.00,10.00,3.33,0.00,3.33,3.33,0.00,3.33,13.33,3.33,0.00,0.00,6.67,6.67,6.67,10.00,10.00,10.00,0.00,0.00
Seq_127,0.00,7.69,15.38,3.85,3.85,3.85,0.00,3.85,0.00,15.38,0.00,7.69,0.00,11.54,3.85,7.69,7.69,7.69,0.00,0.00
Seq_128,1.19,0.00,1.19,0.00,1.19,63.10,15.48,0.00,0.00,0.00,0.00,1.19,4.76,2.38,1.19,2.38,1.19,0.00,0.00,4.76
Seq_129,13.33,6.67,6.67,10.00,2.22,1.11,7.78,4.44,3.33,7.78,2.22,7.78,2.22,5.56,4.44,2.22,6.67,3.33,0.00,2.22
Seq_130,3.85,0.00,0.00,0.00,3.85,30.77,0.00,3.85,7.69,19.23,0.00,0.00,0.00,3.85,0.00,11.54,7.69,7.69,0.00,0.00
Seq_131,16.67,8.33,0.00,0.00,12.50,4.17,0.00,20.83,16.67,4.17,0.00,0.00,8.33,0.00,0.00,4.17,0.00,4.17,0.00,0.00
Seq_132,8.33,1.39,5.56,13.89,6.94,5.56,0.00,1.39,11.11,11.11,2.78,2.78,1.39,1.39,8.33,8.33,1.39,4.17,0.00,4.17
Seq_133,23.53,0.00,2.94,0.00,0.00,11.76,2.94,2.94,11.76,14.71,5.88,0.00,0.00,5.88,0.00,2.94,11.76,0.00,2.94,0.00
Seq_134,2.63,15.79,2.63,0.00,5.26,10.53,5.26,10.53,2.63,2.63,2.63,5.26,7.89,2.63,10.53,5.26,2.63,2.63,2.63,0.00
Seq_135,2.50,15.00,0.00,2.50,0.00,12.50,0.00,5.00,2.50,10.00,2.50,5.00,5.00,2.50,17.50,5.00,2.50,5.00,2.50,2.50
Seq_136,2.94,0.00,5.88,5.88,5.88,11.76,0.00,14.71,8.82,8.82,0.00,0.00,0.00,5.88,26.47,2.94,0.00,0.00,0.00,0.00
Seq_137,4.00,12.00,2.00,0.00,4.00,10.00,2.00,6.00,4.00,4.00,0.00,4.00,16.00,0.00,12.00,6.00,2.00,6.00,0.00,6.00
Seq_138,0.00,0.00,0.00,0.00,21.74,13.04,17.39,8.70,4.35,4.35,0.00,4.35,0.00,4.35,0.00,4.35,0.00,17.39,0.00,0.00
Seq_139,0.00,0.00,0.00,0.00,0.00,38.46,30.77,0.00,0.00,0.00,0.00,0.00,0.00,7.69,0.00,7.69,0.00,15.38,0.00,0.00
Seq_140,9.76,24.39,0.00,0.00,0.00,17.07,0.00,2.44,0.00,2.44,0.00,7.32,4.88,4.88,9.76,7.32,2.44,0.00,0.00,7.32
Seq_141,7.69,0.00,3.85,0.00,3.85,19.23,3.85,0.00,19.23,11.54,0.00,0.00,0.00,0.00,3.85,3.85,3.85,11.54,3.85,3.85
Seq_142,11.54,0.00,3.85,0.00,11.54,19.23,11.54,15.38,11.54,0.00,0.00,3.85,0.00,3.85,0.00,3.85,0.00,0.00,3.85,0.00
Seq_143,0.00,0.00,0.00,0.00,4.76,23.81,14.29,4.76,9.52,28.57,4.76,0.00,0.00,4.76,0.00,0.00,0.00,0.00,4.76,0.00
Seq_144,5.56,0.00,0.00,5.56,11.11,11.11,5.56,0.00,16.67,5.56,0.00,0.00,0.00,5.56,11.11,5.56,5.56,0.00,11.11,0.00
Seq_145,0.00,0.00,0.00,0.00,8.33,20.83,29.17,8.33,4.17,16.67,0.00,0.00,0.00,0.00,0.00,0.00,0.00,8.33,4.17,0.00
Seq_146,3.85,0.00,0.00,3.85,7.69,15.38,11.54,3.85,7.69,11.54,3.85,3.85,0.00,3.85,11.54,7.69,0.00,3.85,0.00,0.00
Seq_147,8.33,8.33,0.00,0.00,8.33,8.33,0.00,12.50,16.67,4.17,0.00,0.00,4.17,4.17,0.00,4.17,4.17,12.50,0.00,4.17
Seq_148,7.89,0.00,2.63,0.00,2.63,13.16,5.26,0.00,13.16,7.89,0.00,7.89,0.00,0.00,15.79,0.00,2.63,7.89,7.89,5.26
Seq_149,6.67,0.00,0.00,0.00,3.33,23.33,3.33,6.67,16.67,6.67,0.00,3.33,0.00,0.00,6.67,0.00,0.00,13.33,6.67,3.33
Seq_150,0.00,0.00,0.00,0.00,10.26,10.26,5.13,2.56,5.13,2.56,0.00,7.69,33.33,5.13,2.56,5.13,0.00,2.56,2.56,5.13
Seq_151,3.03,18.18,0.00,3.03,6.06,9.09,3.03,6.06,0.00,3.03,0.00,3.03,0.00,0.00,27.27,3.03,6.06,3.03,0.00,6.06
Seq_152,0.00,18.18,3.03,3.03,6.06,9.09,0.00,3.03,3.03,6.06,0.00,3.03,3.03,6.06,12.12,3.03,9.09,6.06,0.00,6.06
Seq_153,0.00,17.02,4.26,2.13,2.13,14.89,6.38,0.00,6.38,10.64,2.13,2.13,2.13,0.00,12.77,4.26,6.38,4.26,0.00,2.13
Seq_154,0.00,0.00,0.00,0.00,0.00,6.25,0.00,0.00,6.25,6.25,0.00,12.50,31.25,0.00,12.50,0.00,12.50,6.25,0.00,6.25
Seq_155,14.29,0.00,0.00,9.52,4.76,4.76,0.00,0.00,19.05,4.76,0.00,0.00,0.00,4.76,23.81,9.52,0.00,4.76,0.00,0.00
Seq_156,12.90,0.00,0.00,0.00,9.68,9.68,6.45,3.23,12.90,9.68,0.00,3.23,0.00,0.00,3.23,9.68,6.45,3.23,3.23,6.45
Seq_157,7.50,15.00,2.50,0.00,2.50,17.50,5.00,5.00,2.50,7.50,0.00,5.00,0.00,2.50,7.50,5.00,5.00,7.50,0.00,2.50
Seq_158,0.00,10.00,0.00,0.00,5.00,5.00,0.00,15.00,15.00,15.00,0.00,5.00,10.00,0.00,0.00,0.00,5.00,15.00,0.00,0.00
Seq_159,0.00,11.76,0.00,0.00,11.76,0.00,0.00,17.65,17.65,17.65,0.00,0.00,0.00,0.00,5.88,5.88,11.76,0.00,0.00,0.00
Seq_160,0.00,6.90,0.00,3.45,6.90,17.24,3.45,10.34,20.69,13.79,0.00,6.90,0.00,0.00,0.00,0.00,6.90,0.00,3.45,0.00
Seq_161,12.50,8.33,0.00,0.00,4.17,4.17,0.00,4.17,12.50,20.83,8.33,0.00,8.33,0.00,0.00,4.17,4.17,8.33,0.00,0.00
Seq_162,16.67,8.33,0.00,0.00,4.17,4.17,0.00,8.33,12.50,12.50,0.00,0.00,8.33,0.00,0.00,4.17,4.17,16.67,0.00,0.00
Seq_163,16.22,5.41,0.00,2.70,5.41,16.22,2.70,5.41,13.51,13.51,2.70,2.70,0.00,2.70,0.00,2.70,8.11,0.00,0.00,0.00
Seq_164,10.81,5.41,5.41,0.00,5.41,13.51,0.00,5.41,16.22,16.22,0.00,0.00,0.00,2.70,2.70,8.11,2.70,5.41,0.00,0.00
Seq_165,20.00,0.00,0.00,3.33,0.00,16.67,0.00,3.33,13.33,16.67,3.33,3.33,0.00,3.33,0.00,3.33,3.33,6.67,3.33,0.00
Seq_166,6.06,6.06,6.06,0.00,0.00,12.12,3.03,3.03,18.18,15.15,3.03,3.03,0.00,0.00,0.00,12.12,0.00,12.12,0.00,0.00
Seq_167,9.68,6.45,6.45,3.23,3.23,16.13,0.00,3.23,19.35,19.35,0.00,0.00,3.23,0.00,0.00,0.00,6.45,3.23,0.00,0.00
Seq_168,3.12,6.25,6.25,0.00,6.25,12.50,3.12,12.50,12.50,9.38,3.12,3.12,9.38,0.00,0.00,3.12,9.38,0.00,0.00,0.00
Seq_169,15.38,0.00,0.00,0.00,15.38,7.69,0.00,15.38,7.69,15.38,7.69,0.00,0.00,0.00,0.00,15.38,0.00,0.00,0.00,0.00
Seq_170,0.00,0.00,0.00,0.00,21.43,0.00,0.00,7.14,7.14,28.57,0.00,0.00,7.14,0.00,0.00,14.29,7.14,7.14,0.00,0.00
Seq_171,15.00,10.00,0.00,0.00,10.00,10.00,0.00,5.00,15.00,15.00,5.00,0.00,5.00,0.00,0.00,0.00,5.00,5.00,0.00,0.00
Seq_172,7.69,0.00,0.00,0.00,0.00,7.69,0.00,7.69,7.69,38.46,7.69,0.00,7.69,0.00,0.00,7.69,0.00,7.69,0.00,0.00
Seq_173,7.14,0.00,0.00,0.00,7.14,7.14,0.00,14.29,14.29,21.43,7.14,14.29,0.00,0.00,0.00,0.00,7.14,0.00,0.00,0.00
Seq_174,0.00,0.00,0.00,0.00,7.14,7.14,7.14,21.43,7.14,35.71,0.00,7.14,7.14,0.00,0.00,0.00,0.00,0.00,0.00,0.00
Seq_175,7.69,0.00,0.00,0.00,15.38,7.69,0.00,7.69,7.69,30.77,0.00,0.00,7.69,0.00,0.00,0.00,7.69,7.69,0.00,0.00
Seq_176,7.69,0.00,0.00,0.00,15.38,7.69,0.00,7.69,7.69,38.46,0.00,0.00,7.69,0.00,0.00,7.69,0.00,0.00,0.00,0.00
Seq_177,7.69,0.00,0.00,0.00,15.38,0.00,0.00,0.00,7.69,38.46,0.00,0.00,7.69,0.00,0.00,15.38,0.00,7.69,0.00,0.00
Seq_178,4.35,0.00,0.00,0.00,0.00,0.00,0.00,8.70,0.00,4.35,0.00,0.00,34.78,8.70,13.04,0.00,8.70,0.00,0.00,17.39
Seq_179,5.88,17.65,0.00,2.94,8.82,8.82,0.00,2.94,0.00,2.94,0.00,5.88,0.00,2.94,23.53,5.88,0.00,5.88,0.00,5.88
Seq_180,2.17,4.35,4.35,4.35,2.17,17.39,0.00,13.04,17.39,8.70,2.17,4.35,0.00,0.00,4.35,4.35,2.17,8.70,0.00,0.00
Seq_181,17.54,3.51,0.00,0.00,1.75,19.30,1.75,7.02,3.51,3.51,1.75,5.26,3.51,1.75,3.51,1.75,10.53,8.77,3.51,1.75
Seq_182,0.00,0.00,5.26,7.89,2.63,10.53,26.32,0.00,7.89,2.63,0.00,5.26,0.00,0.00,13.16,7.89,0.00,0.00,0.00,10.53
Seq_183,8.11,5.41,0.00,2.70,5.41,21.62,5.41,0.00,5.41,2.70,0.00,10.81,0.00,0.00,2.70,8.11,2.70,8.11,5.41,5.41
Seq_184,17.65,0.00,0.00,2.94,2.94,14.71,0.00,2.94,20.59,8.82,0.00,2.94,2.94,5.88,5.88,2.94,0.00,8.82,0.00,0.00
Seq_185,16.00,4.00,0.00,0.00,0.00,26.00,0.00,2.00,8.00,6.00,0.00,4.00,2.00,0.00,4.00,2.00,2.00,14.00,4.00,6.00
Seq_186,9.09,7.79,7.79,3.90,2.60,6.49,1.30,11.69,10.39,14.29,0.00,6.49,0.00,1.30,0.00,3.90,7.79,3.90,0.00,1.30
Seq_187,12.00,0.00,0.00,0.00,8.00,16.00,16.00,16.00,8.00,8.00,0.00,0.00,0.00,0.00,12.00,0.00,0.00,0.00,4.00,0.00
Seq_188,2.38,14.29,0.00,0.00,0.00,11.90,0.00,4.76,19.05,2.38,7.14,7.14,7.14,4.76,4.76,4.76,2.38,7.14,0.00,0.00
Seq_189,16.00,0.00,0.00,0.00,4.00,4.00,8.00,4.00,20.00,24.00,0.00,0.00,0.00,8.00,0.00,4.00,4.00,0.00,4.00,0.00
Seq_190,7.41,0.00,0.00,7.41,7.41,7.41,3.70,11.11,29.63,3.70,7.41,0.00,0.00,3.70,0.00,3.70,3.70,0.00,3.70,0.00
Seq_191,7.32,14.63,4.88,4.88,4.88,9.76,9.76,2.44,2.44,2.44,0.00,4.88,2.44,7.32,7.32,2.44,4.88,4.88,0.00,2.44
Seq_192,15.62,0.00,0.00,0.00,3.12,9.38,6.25,6.25,21.88,6.25,0.00,0.00,0.00,3.12,3.12,3.12,0.00,3.12,6.25,12.50
Seq_193,15.00,0.00,20.00,0.00,0.00,10.00,0.00,0.00,5.00,0.00,0.00,0.00,0.00,0.00,0.00,0.00,15.00,30.00,0.00,5.00
Seq_194,0.00,0.00,3.70,29.63,3.70,0.00,0.00,0.00,0.00,11.11,0.00,3.70,0.00,11.11,33.33,0.00,0.00,0.00,3.70,0.00
Seq_195,0.00,8.33,0.00,0.00,0.00,12.50,0.00,8.33,20.83,12.50,0.00,0.00,0.00,4.17,0.00,4.17,8.33,20.83,0.00,0.00
Seq_196,5.56,5.56,5.56,2.78,5.56,2.78,0.00,8.33,27.78,8.33,2.78,2.78,0.00,2.78,0.00,5.56,8.33,5.56,0.00,0.00
Seq_197,12.50,8.33,0.00,0.00,12.50,4.17,0.00,4.17,16.67,20.83,0.00,0.00,8.33,0.00,0.00,4.17,4.17,4.17,0.00,0.00
Seq_198,5.26,0.00,0.00,21.05,0.00,21.05,0.00,5.26,0.00,10.53,0.00,5.26,5.26,10.53,15.79,0.00,0.00,0.00,0.00,0.00
Seq_199,0.00,11.11,0.00,3.70,3.70,3.70,3.70,0.00,0.00,0.00,3.70,7.41,3.70,7.41,7.41,7.41,7.41,14.81,11.11,3.70
Seq_200,0.00,33.33,0.00,0.00,11.11,11.11,0.00,11.11,0.00,0.00,0.00,0.00,0.00,0.00,22.22,0.00,11.11,0.00,0.00,0.00
Seq_201,0.00,33.33,0.00,0.00,0.00,11.11,0.00,0.00,0.00,11.11,0.00,0.00,0.00,0.00,33.33,0.00,0.00,11.11,0.00,0.00
Seq_202,0.00,0.00,0.00,0.00,0.00,5.56,5.56,11.11,0.00,5.56,0.00,11.11,33.33,5.56,16.67,0.00,0.00,0.00,0.00,5.56
Seq_203,0.00,0.00,0.00,0.00,0.00,5.26,5.26,5.26,5.26,0.00,0.00,0.00,31.58,0.00,21.05,10.53,5.26,5.26,0.00,5.26
Seq_204,2.78,16.67,0.00,0.00,11.11,16.67,5.56,2.78,8.33,5.56,0.00,2.78,5.56,0.00,2.78,11.11,0.00,2.78,5.56,0.00
Seq_205,0.00,11.11,0.00,3.70,7.41,11.11,7.41,7.41,3.70,0.00,3.70,7.41,0.00,3.70,0.00,14.81,7.41,7.41,3.70,0.00
Seq_206,9.09,9.09,2.27,0.00,0.00,18.18,6.82,4.55,9.09,0.00,2.27,9.09,0.00,2.27,0.00,4.55,9.09,4.55,4.55,4.55
Seq_207,2.08,4.17,2.08,4.17,4.17,20.83,0.00,14.58,14.58,4.17,2.08,8.33,2.08,0.00,0.00,4.17,4.17,8.33,0.00,0.00
Seq_208,0.00,0.00,7.69,0.00,15.38,15.38,0.00,23.08,7.69,15.38,0.00,7.69,0.00,0.00,0.00,7.69,0.00,0.00,0.00,0.00
Seq_209,7.14,7.14,0.00,3.57,7.14,10.71,0.00,7.14,17.86,14.29,3.57,3.57,0.00,3.57,3.57,3.57,0.00,3.57,0.00,3.57
Seq_210,14.81,7.41,0.00,3.70,0.00,7.41,0.00,7.41,18.52,18.52,3.70,3.70,0.00,0.00,3.70,3.70,7.41,0.00,0.00,0.00
Seq_211,5.56,0.00,5.56,0.00,11.11,5.56,0.00,5.56,11.11,5.56,11.11,11.11,0.00,5.56,5.56,11.11,0.00,5.56,0.00,0.00
Seq_212,35.71,0.00,7.14,0.00,0.00,14.29,0.00,21.43,14.29,7.14,0.00,0.00,0.00,0.00,0.00,0.00,0.00,0.00,0.00,0.00
Seq_213,12.90,0.00,0.00,6.45,0.00,9.68,0.00,12.90,16.13,6.45,0.00,3.23,3.23,3.23,6.45,12.90,3.23,0.00,3.23,0.00
Seq_214,6.98,13.95,2.33,0.00,2.33,9.30,6.98,6.98,6.98,4.65,0.00,2.33,2.33,6.98,4.65,4.65,6.98,6.98,2.33,2.33
Seq_215,6.02,0.00,6.77,6.02,3.76,15.04,3.01,2.26,6.02,4.51,1.50,4.51,3.01,6.02,9.02,3.76,6.77,7.52,2.26,2.26
Seq_216,0.00,0.00,5.00,0.00,0.00,5.00,0.00,5.00,5.00,5.00,0.00,10.00,25.00,0.00,15.00,5.00,5.00,5.00,0.00,10.00
Seq_217,4.23,0.00,7.04,2.82,1.41,9.86,5.63,4.23,5.63,1.41,0.00,11.27,8.45,5.63,7.04,7.04,5.63,7.04,5.63,0.00
Seq_218,13.73,0.00,3.92,9.80,1.96,1.96,1.96,1.96,17.65,7.84,0.00,3.92,1.96,13.73,0.00,3.92,5.88,7.84,0.00,1.96
Seq_219,2.94,17.65,2.94,0.00,5.88,11.76,0.00,5.88,0.00,2.94,0.00,2.94,2.94,2.94,23.53,5.88,2.94,2.94,0.00,5.88
Seq_220,11.11,0.00,0.00,0.00,0.00,16.67,0.00,5.56,11.11,33.33,0.00,5.56,5.56,0.00,0.00,5.56,0.00,5.56,0.00,0.00
Seq_221,8.00,0.00,0.00,4.00,4.00,20.00,0.00,4.00,16.00,12.00,0.00,4.00,4.00,0.00,0.00,4.00,4.00,12.00,4.00,0.00
Seq_222,16.00,0.00,0.00,0.00,12.00,20.00,0.00,0.00,12.00,16.00,0.00,0.00,4.00,8.00,0.00,8.00,4.00,0.00,0.00,0.00
Seq_223,13.64,0.00,4.55,0.00,9.09,13.64,0.00,0.00,18.18,13.64,4.55,9.09,4.55,0.00,0.00,0.00,0.00,9.09,0.00,0.00
Seq_224,31.82,0.00,0.00,0.00,0.00,18.18,0.00,4.55,13.64,9.09,4.55,0.00,0.00,0.00,0.00,0.00,9.09,9.09,0.00,0.00
Seq_225,11.11,0.00,0.00,0.00,3.70,11.11,3.70,7.41,11.11,18.52,0.00,0.00,11.11,7.41,3.70,3.70,0.00,7.41,0.00,0.00
Seq_226,14.29,0.00,7.14,0.00,0.00,7.14,0.00,21.43,14.29,21.43,0.00,7.14,0.00,0.00,0.00,0.00,0.00,0.00,7.14,0.00
Seq_227,3.03,18.18,6.06,0.00,6.06,9.09,3.03,3.03,6.06,0.00,0.00,3.03,6.06,0.00,9.09,3.03,12.12,0.00,3.03,9.09
Seq_228,14.71,23.53,0.00,0.00,5.88,11.76,0.00,0.00,11.76,0.00,0.00,0.00,0.00,0.00,17.65,8.82,0.00,0.00,2.94,2.94
Seq_229,5.88,23.53,0.00,0.00,0.00,8.82,2.94,0.00,5.88,5.88,0.00,0.00,0.00,0.00,20.59,8.82,0.00,5.88,0.00,11.76
Seq_230,10.53,15.79,0.00,0.00,2.63,15.79,0.00,5.26,5.26,0.00,0.00,7.89,5.26,5.26,5.26,10.53,0.00,2.63,0.00,7.89
Seq_231,8.00,0.00,8.00,4.00,0.00,16.00,4.00,8.00,16.00,16.00,0.00,0.00,0.00,0.00,0.00,4.00,0.00,16.00,0.00,0.00
Seq_232,22.73,0.00,9.09,4.55,4.55,4.55,4.55,13.64,13.64,9.09,0.00,0.00,0.00,9.09,0.00,0.00,0.00,4.55,0.00,0.00
Seq_233,5.00,0.00,0.00,0.00,10.00,5.00,5.00,5.00,5.00,0.00,0.00,0.00,35.00,15.00,10.00,0.00,5.00,0.00,0.00,0.00
Seq_234,4.00,4.00,8.00,4.00,0.00,16.00,0.00,0.00,0.00,0.00,0.00,4.00,0.00,0.00,12.00,8.00,8.00,20.00,0.00,12.00
Seq_235,0.00,16.22,5.41,0.00,2.70,8.11,2.70,0.00,13.51,8.11,0.00,5.41,8.11,8.11,2.70,10.81,5.41,0.00,0.00,2.70
Seq_236,4.35,0.00,0.00,0.00,8.70,17.39,17.39,17.39,0.00,13.04,0.00,0.00,0.00,0.00,4.35,4.35,0.00,13.04,0.00,0.00
Seq_237,9.52,0.00,4.76,0.00,4.76,9.52,4.76,19.05,9.52,9.52,4.76,0.00,9.52,0.00,0.00,4.76,0.00,4.76,0.00,4.76
Seq_238,12.12,6.06,6.06,0.00,0.00,12.12,0.00,6.06,15.15,18.18,3.03,3.03,0.00,3.03,0.00,9.09,3.03,3.03,0.00,0.00
Seq_239,0.00,9.52,0.00,0.00,0.00,23.81,0.00,0.00,14.29,23.81,0.00,0.00,0.00,0.00,0.00,9.52,0.00,19.05,0.00,0.00
Seq_240,10.00,0.00,15.00,0.00,0.00,5.00,0.00,0.00,15.00,10.00,0.00,0.00,10.00,0.00,5.00,5.00,10.00,10.00,0.00,5.00
Seq_241,10.00,5.00,5.00,5.00,5.00,0.00,0.00,5.00,0.00,0.00,0.00,5.00,10.00,10.00,10.00,20.00,5.00,0.00,0.00,5.00
Seq_242,0.00,0.00,0.00,0.00,15.22,4.35,0.00,6.52,0.00,0.00,0.00,2.17,43.48,0.00,26.09,0.00,0.00,2.17,0.00,0.00
Seq_243,2.38,14.29,2.38,2.38,2.38,9.52,2.38,2.38,16.67,2.38,0.00,2.38,4.76,4.76,4.76,2.38,4.76,4.76,2.38,11.90
Seq_244,2.38,0.00,0.00,0.00,7.14,16.67,0.00,7.14,19.05,7.14,0.00,0.00,2.38,7.14,16.67,2.38,2.38,2.38,2.38,4.76
Seq_245,9.38,0.00,6.25,3.12,0.00,3.12,0.00,6.25,12.50,6.25,0.00,3.12,3.12,15.62,9.38,0.00,6.25,3.12,3.12,9.38
Seq_246,12.50,8.33,0.00,0.00,8.33,0.00,0.00,16.67,12.50,4.17,4.17,0.00,8.33,0.00,4.17,4.17,8.33,8.33,0.00,0.00
Seq_247,18.18,6.06,3.03,0.00,0.00,12.12,0.00,6.06,12.12,15.15,0.00,6.06,0.00,6.06,0.00,9.09,3.03,3.03,0.00,0.00
Seq_248,8.82,5.88,2.94,0.00,2.94,11.76,0.00,2.94,14.71,20.59,0.00,5.88,0.00,5.88,0.00,8.82,5.88,2.94,0.00,0.00
Seq_249,13.51,5.41,0.00,5.41,2.70,18.92,0.00,8.11,18.92,16.22,0.00,0.00,0.00,2.70,0.00,2.70,0.00,5.41,0.00,0.00
Seq_250,4.62,15.38,0.00,3.08,3.08,15.38,1.54,3.08,0.00,1.54,0.00,1.54,7.69,12.31,16.92,4.62,3.08,4.62,0.00,1.54
Seq_251,6.67,10.00,5.00,0.00,0.00,13.33,1.67,6.67,3.33,10.00,0.00,0.00,11.67,1.67,13.33,6.67,5.00,0.00,0.00,5.00
Seq_252,6.58,7.89,3.95,5.26,3.95,9.21,3.95,3.95,17.11,3.95,3.95,6.58,1.32,2.63,0.00,5.26,3.95,6.58,1.32,2.63
Seq_253,0.00,5.88,4.41,22.06,0.00,0.00,2.94,0.00,10.29,0.00,2.94,1.47,2.94,20.59,17.65,0.00,2.94,0.00,0.00,5.88
Seq_254,4.35,13.04,2.17,6.52,2.17,15.22,4.35,0.00,6.52,4.35,0.00,2.17,13.04,2.17,6.52,6.52,6.52,4.35,0.00,0.00
Seq_255,10.53,0.00,5.26,0.00,5.26,21.05,0.00,15.79,10.53,5.26,0.00,5.26,0.00,0.00,5.26,0.00,0.00,15.79,0.00,0.00
Seq_256,11.76,0.00,5.88,0.00,5.88,5.88,0.00,5.88,11.76,5.88,0.00,5.88,0.00,0.00,5.88,0.00,5.88,29.41,0.00,0.00
Seq_257,11.76,0.00,0.00,0.00,5.88,11.76,5.88,11.76,11.76,0.00,0.00,5.88,0.00,0.00,0.00,11.76,0.00,23.53,0.00,0.00
Seq_258,5.26,0.00,5.26,0.00,0.00,15.79,0.00,10.53,10.53,21.05,0.00,5.26,0.00,0.00,5.26,0.00,5.26,15.79,0.00,0.00
Seq_259,5.88,0.00,5.88,0.00,0.00,11.76,0.00,17.65,11.76,5.88,0.00,5.88,0.00,0.00,5.88,5.88,0.00,23.53,0.00,0.00
Seq_260,11.76,0.00,5.88,0.00,0.00,5.88,0.00,5.88,17.65,11.76,0.00,11.76,5.88,0.00,0.00,0.00,0.00,23.53,0.00,0.00
Seq_261,15.38,0.00,7.69,0.00,7.69,7.69,7.69,7.69,7.69,0.00,0.00,0.00,0.00,0.00,0.00,7.69,0.00,23.08,7.69,0.00
Seq_262,7.69,0.00,0.00,0.00,0.00,3.85,0.00,11.54,15.38,7.69,0.00,3.85,3.85,0.00,15.38,0.00,3.85,15.38,3.85,7.69
Seq_263,4.76,0.00,0.00,0.00,0.00,28.57,0.00,14.29,9.52,19.05,4.76,0.00,4.76,0.00,0.00,4.76,0.00,9.52,0.00,0.00
Seq_264,20.00,6.67,6.67,0.00,6.67,6.67,0.00,0.00,6.67,6.67,0.00,13.33,6.67,6.67,0.00,0.00,0.00,6.67,0.00,6.67
Seq_265,10.81,5.41,0.00,5.41,2.70,13.51,0.00,5.41,16.22,10.81,5.41,2.70,0.00,2.70,0.00,0.00,10.81,8.11,0.00,0.00
Seq_266,2.22,13.33,0.00,4.44,0.00,11.11,0.00,6.67,13.33,6.67,0.00,2.22,2.22,4.44,15.56,4.44,4.44,4.44,0.00,4.44
Seq_267,10.00,10.00,0.00,5.00,0.00,5.00,0.00,5.00,5.00,5.00,5.00,5.00,10.00,0.00,0.00,0.00,10.00,10.00,0.00,15.00
Seq_268,3.03,6.06,3.03,3.03,6.06,12.12,0.00,0.00,18.18,12.12,3.03,12.12,0.00,0.00,0.00,6.06,0.00,15.15,0.00,0.00
Seq_269,0.00,20.00,0.00,0.00,0.00,20.00,0.00,0.00,0.00,0.00,0.00,0.00,5.00,5.00,25.00,0.00,0.00,5.00,15.00,5.00
Seq_270,5.00,20.00,0.00,0.00,0.00,10.00,5.00,0.00,10.00,0.00,0.00,0.00,5.00,5.00,20.00,0.00,0.00,0.00,10.00,10.00
Seq_271,1.92,15.38,5.77,1.92,3.85,9.62,0.00,5.77,11.54,0.00,1.92,1.92,5.77,0.00,11.54,11.54,7.69,0.00,0.00,3.85
Seq_272,9.52,0.00,4.76,4.76,4.76,14.29,0.00,14.29,4.76,4.76,4.76,9.52,0.00,0.00,4.76,14.29,4.76,0.00,0.00,0.00
Seq_273,8.70,0.00,0.00,4.35,0.00,8.70,4.35,0.00,21.74,21.74,0.00,0.00,0.00,0.00,4.35,0.00,8.70,8.70,4.35,4.35
Seq_274,2.00,12.00,2.00,0.00,4.00,6.00,6.00,4.00,10.00,8.00,0.00,6.00,2.00,8.00,8.00,4.00,4.00,6.00,4.00,4.00
Seq_275,10.26,0.00,5.13,0.00,0.00,15.38,2.56,7.69,12.82,0.00,5.13,7.69,0.00,5.13,5.13,7.69,0.00,7.69,5.13,2.56
Seq_276,3.64,14.55,3.64,0.00,5.45,10.91,3.64,9.09,5.45,0.00,1.82,3.64,3.64,3.64,7.27,12.73,5.45,0.00,0.00,5.45
Seq_277,3.57,0.00,0.00,0.00,0.00,17.86,0.00,21.43,10.71,10.71,0.00,0.00,7.14,0.00,14.29,3.57,0.00,3.57,3.57,3.57
Seq_278,9.09,6.06,3.03,0.00,3.03,21.21,0.00,0.00,18.18,18.18,3.03,3.03,0.00,0.00,0.00,6.06,0.00,9.09,0.00,0.00
Seq_279,0.00,11.76,0.00,0.00,5.88,11.76,0.00,17.65,5.88,17.65,5.88,0.00,0.00,5.88,5.88,0.00,11.76,0.00,0.00,0.00
Seq_280,7.69,0.00,0.00,0.00,2.56,10.26,0.00,5.13,17.95,17.95,2.56,5.13,5.13,2.56,2.56,0.00,10.26,7.69,2.56,0.00
Seq_281,15.00,10.00,0.00,0.00,5.00,5.00,0.00,10.00,5.00,15.00,0.00,5.00,5.00,5.00,0.00,0.00,10.00,5.00,0.00,5.00
Seq_282,12.12,6.06,3.03,0.00,9.09,6.06,0.00,0.00,12.12,18.18,0.00,9.09,0.00,0.00,0.00,12.12,6.06,6.06,0.00,0.00
Seq_283,12.50,3.12,0.00,0.00,6.25,12.50,0.00,6.25,18.75,6.25,0.00,9.38,3.12,3.12,0.00,6.25,6.25,3.12,0.00,3.12
Seq_284,0.00,15.38,0.00,0.00,15.38,0.00,0.00,7.69,7.69,7.69,7.69,0.00,7.69,0.00,15.38,15.38,0.00,0.00,0.00,0.00
Seq_285,7.14,3.57,7.14,0.00,3.57,10.71,3.57,10.71,7.14,10.71,0.00,0.00,14.29,0.00,10.71,3.57,3.57,0.00,3.57,0.00
Seq_286,5.26,7.89,2.63,2.63,0.00,15.79,5.26,5.26,7.89,15.79,0.00,2.63,2.63,2.63,2.63,13.16,0.00,5.26,0.00,2.63
Seq_287,0.00,0.00,0.00,0.00,7.14,21.43,0.00,7.14,7.14,14.29,0.00,7.14,14.29,0.00,7.14,14.29,0.00,0.00,0.00,0.00
Seq_288,0.00,0.00,0.00,7.14,14.29,0.00,0.00,0.00,7.14,7.14,0.00,0.00,21.43,0.00,7.14,14.29,14.29,0.00,7.14,0.00
Seq_289,0.00,12.50,6.25,0.00,0.00,18.75,6.25,25.00,0.00,0.00,0.00,0.00,0.00,6.25,12.50,6.25,0.00,0.00,6.25,0.00
Seq_290,0.00,0.00,0.00,0.00,0.00,25.00,0.00,0.00,0.00,16.67,0.00,0.00,0.00,0.00,8.33,25.00,16.67,8.33,0.00,0.00
Seq_291,7.69,0.00,0.00,11.54,0.00,11.54,0.00,11.54,11.54,19.23,0.00,0.00,0.00,7.69,0.00,11.54,3.85,3.85,0.00,0.00
Seq_292,12.00,0.00,4.00,0.00,0.00,20.00,0.00,4.00,8.00,16.00,0.00,0.00,4.00,4.00,4.00,12.00,0.00,12.00,0.00,0.00
Seq_293,11.11,0.00,5.56,0.00,11.11,11.11,0.00,5.56,11.11,5.56,0.00,5.56,0.00,0.00,0.00,0.00,11.11,22.22,0.00,0.00
Seq_294,0.00,0.00,0.00,0.00,0.00,16.67,0.00,0.00,38.89,44.44,0.00,0.00,0.00,0.00,0.00,0.00,0.00,0.00,0.00,0.00
Seq_295,0.00,0.00,0.00,0.00,0.00,0.00,8.33,8.33,8.33,8.33,0.00,0.00,16.67,8.33,8.33,8.33,0.00,0.00,16.67,8.33
Seq_296,2.13,12.77,4.26,0.00,4.26,8.51,4.26,8.51,2.13,6.38,0.00,0.00,10.64,0.00,12.77,10.64,4.26,2.13,0.00,6.38
Seq_297,10.53,0.00,0.00,0.00,0.00,21.05,0.00,0.00,26.32,0.00,0.00,0.00,0.00,5.26,15.79,10.53,5.26,5.26,0.00,0.00
Seq_298,0.00,0.00,2.63,10.53,5.26,10.53,0.00,13.16,15.79,7.89,0.00,2.63,2.63,7.89,13.16,2.63,5.26,0.00,0.00,0.00
Seq_299,8.33,4.17,0.00,0.00,0.00,12.50,0.00,8.33,16.67,29.17,0.00,4.17,0.00,0.00,16.67,0.00,0.00,0.00,0.00,0.00
Seq_300,0.00,0.00,0.00,0.00,0.00,0.00,0.00,18.18,9.09,36.36,0.00,0.00,0.00,0.00,9.09,18.18,9.09,0.00,0.00,0.00
Seq_301,4.76,9.52,0.00,0.00,0.00,4.76,0.00,0.00,0.00,4.76,0.00,0.00,0.00,0.00,28.57,0.00,0.00,23.81,9.52,14.29
Seq_302,2.78,16.67,0.00,0.00,0.00,19.44,2.78,2.78,8.33,0.00,0.00,11.11,5.56,8.33,5.56,5.56,0.00,2.78,2.78,5.56
Seq_303,7.84,7.84,1.96,3.92,5.88,5.88,1.96,3.92,11.76,3.92,1.96,3.92,1.96,1.96,15.69,9.80,1.96,3.92,1.96,1.96
Seq_304,11.54,0.00,0.00,0.00,3.85,7.69,0.00,3.85,23.08,7.69,3.85,0.00,0.00,7.69,0.00,11.54,3.85,3.85,7.69,3.85
Seq_305,9.52,19.05,4.76,0.00,9.52,19.05,0.00,4.76,0.00,4.76,0.00,4.76,0.00,0.00,0.00,4.76,0.00,9.52,4.76,4.76
Seq_306,2.04,0.00,6.12,8.16,1.02,7.14,0.00,7.14,12.24,14.29,4.08,8.16,1.02,1.02,5.10,11.22,2.04,5.10,1.02,3.06
Seq_307,3.57,21.43,0.00,3.57,7.14,10.71,0.00,0.00,3.57,3.57,0.00,3.57,3.57,3.57,0.00,10.71,14.29,7.14,0.00,3.57
Seq_308,5.41,16.22,10.81,2.70,2.70,10.81,0.00,2.70,2.70,5.41,0.00,2.70,5.41,0.00,8.11,5.41,10.81,5.41,0.00,2.70
Seq_309,3.23,19.35,0.00,6.45,6.45,6.45,0.00,9.68,6.45,3.23,3.23,6.45,0.00,0.00,0.00,16.13,3.23,6.45,0.00,3.23
Seq_310,0.00,18.18,3.03,3.03,9.09,24.24,0.00,3.03,0.00,3.03,0.00,6.06,3.03,0.00,0.00,3.03,15.15,0.00,0.00,9.09
Seq_311,6.67,13.33,0.00,0.00,0.00,6.67,0.00,13.33,13.33,20.00,0.00,0.00,6.67,0.00,0.00,0.00,0.00,13.33,6.67,0.00
Seq_312,11.54,0.00,3.85,0.00,0.00,19.23,0.00,7.69,11.54,23.08,0.00,0.00,3.85,3.85,0.00,7.69,0.00,7.69,0.00,0.00
Seq_313,0.00,15.62,0.00,3.12,3.12,6.25,3.12,6.25,6.25,6.25,0.00,3.12,3.12,6.25,0.00,9.38,15.62,9.38,3.12,0.00
Seq_314,0.00,0.00,0.00,0.00,0.00,0.00,0.00,5.32,2.13,13.83,0.00,0.00,44.68,2.13,29.79,2.13,0.00,0.00,0.00,0.00
Seq_315,1.27,0.00,0.00,0.00,18.99,8.86,0.00,1.27,0.00,0.00,0.00,6.33,53.16,0.00,7.59,0.00,0.00,1.27,1.27,0.00
Seq_316,5.41,0.00,5.41,8.11,8.11,10.81,0.00,8.11,18.92,10.81,0.00,0.00,2.70,5.41,8.11,2.70,2.70,2.70,0.00,0.00
Seq_317,4.35,2.17,2.17,2.17,2.17,0.00,2.17,4.35,4.35,13.04,2.17,6.52,0.00,2.17,4.35,17.39,4.35,17.39,4.35,4.35
Seq_318,21.74,0.00,0.00,0.00,1.45,11.59,0.00,10.14,4.35,8.70,2.90,2.90,0.00,4.35,1.45,4.35,13.04,10.14,1.45,1.45
Seq_319,17.07,2.44,0.00,4.88,2.44,15.85,1.22,9.76,10.98,12.20,0.00,3.66,1.22,2.44,0.00,2.44,4.88,2.44,3.66,2.44
Seq_320,7.69,0.00,0.00,3.85,3.85,11.54,7.69,3.85,3.85,11.54,0.00,0.00,7.69,0.00,3.85,7.69,0.00,26.92,0.00,0.00
Seq_321,16.13,4.84,0.00,4.84,3.23,24.19,1.61,1.61,6.45,1.61,1.61,6.45,1.61,0.00,3.23,6.45,1.61,6.45,4.84,3.23
Seq_322,0.00,0.00,0.00,0.00,14.29,0.00,0.00,14.29,7.14,21.43,0.00,0.00,7.14,0.00,0.00,21.43,7.14,7.14,0.00,0.00
Seq_323,13.95,4.65,2.33,0.00,0.00,16.28,0.00,4.65,11.63,0.00,0.00,11.63,0.00,2.33,0.00,11.63,4.65,4.65,9.30,2.33
Seq_324,5.41,10.81,0.00,0.00,0.00,21.62,8.11,0.00,2.70,2.70,0.00,13.51,0.00,2.70,0.00,8.11,2.70,10.81,5.41,5.41
Seq_325,4.76,0.00,9.52,0.00,9.52,14.29,0.00,14.29,9.52,14.29,0.00,0.00,0.00,9.52,0.00,0.00,4.76,9.52,0.00,0.00
Seq_326,20.00,0.00,4.29,0.00,2.86,8.57,0.00,15.71,7.14,5.71,0.00,2.86,0.00,1.43,1.43,10.00,5.71,10.00,1.43,2.86
Seq_327,30.51,0.00,3.39,0.00,3.39,11.86,1.69,6.78,1.69,13.56,0.00,1.69,1.69,1.69,1.69,3.39,8.47,3.39,3.39,1.69
Seq_328,8.57,0.00,2.86,8.57,5.71,17.14,0.00,5.71,22.86,5.71,0.00,5.71,2.86,0.00,0.00,0.00,0.00,2.86,11.43,0.00
Seq_329,15.00,0.00,0.00,1.67,1.67,15.00,0.00,13.33,8.33,10.00,0.00,1.67,0.00,5.00,0.00,6.67,6.67,13.33,0.00,1.67
Seq_330,6.98,4.65,4.65,2.33,2.33,11.63,0.00,4.65,9.30,2.33,0.00,6.98,0.00,2.33,6.98,4.65,4.65,11.63,4.65,9.30
Seq_331,6.82,4.55,2.27,4.55,0.00,13.64,2.27,6.82,9.09,2.27,0.00,11.36,4.55,2.27,4.55,0.00,2.27,6.82,9.09,6.82
Seq_332,15.09,3.77,1.89,1.89,1.89,15.09,1.89,3.77,7.55,9.43,1.89,15.09,7.55,0.00,3.77,3.77,0.00,1.89,1.89,1.89
Seq_333,3.45,3.45,1.72,0.00,3.45,12.07,3.45,5.17,15.52,12.07,0.00,3.45,3.45,3.45,3.45,3.45,10.34,5.17,3.45,3.45
Seq_334,8.82,5.88,0.00,5.88,2.94,8.82,0.00,5.88,17.65,8.82,5.88,5.88,2.94,2.94,0.00,2.94,2.94,0.00,5.88,5.88
Seq_335,11.36,0.00,0.00,4.55,2.27,2.27,0.00,6.82,13.64,6.82,4.55,4.55,9.09,4.55,4.55,0.00,6.82,2.27,4.55,11.36
Seq_336,11.36,0.00,0.00,2.27,4.55,9.09,0.00,15.91,11.36,2.27,4.55,2.27,6.82,4.55,6.82,2.27,2.27,4.55,4.55,4.55
Seq_337,4.65,0.00,2.33,2.33,6.98,9.30,2.33,13.95,16.28,6.98,4.65,0.00,2.33,9.30,2.33,0.00,4.65,2.33,6.98,2.33
Seq_338,8.33,11.11,5.56,0.00,2.78,8.33,0.00,5.56,0.00,8.33,0.00,11.11,8.33,2.78,0.00,11.11,5.56,11.11,0.00,0.00
Seq_339,7.14,4.76,2.38,0.00,0.00,16.67,7.14,7.14,9.52,0.00,0.00,4.76,2.38,4.76,2.38,2.38,7.14,7.14,7.14,7.14
Seq_340,2.15,0.00,4.30,5.38,6.45,19.35,1.08,6.45,7.53,3.23,1.08,4.30,5.38,7.53,8.60,6.45,2.15,3.23,0.00,5.38
Seq_341,20.83,0.00,4.17,0.00,8.33,12.50,4.17,8.33,12.50,4.17,0.00,4.17,0.00,0.00,4.17,0.00,4.17,12.50,0.00,0.00
Seq_342,16.67,0.00,4.17,0.00,0.00,8.33,0.00,16.67,20.83,4.17,0.00,8.33,0.00,4.17,0.00,4.17,4.17,4.17,4.17,0.00
Seq_343,17.78,4.44,4.44,3.33,2.22,15.56,0.00,1.11,3.33,5.56,1.11,8.89,5.56,1.11,1.11,6.67,2.22,10.00,3.33,2.22
Seq_344,11.76,0.00,5.88,0.00,5.88,17.65,5.88,11.76,11.76,17.65,0.00,0.00,0.00,0.00,0.00,5.88,0.00,5.88,0.00,0.00
Seq_345,0.00,0.00,0.00,0.00,15.38,7.69,0.00,0.00,7.69,38.46,7.69,0.00,7.69,0.00,0.00,0.00,7.69,7.69,0.00,0.00
Seq_346,0.00,0.00,0.00,0.00,7.69,15.38,0.00,15.38,7.69,30.77,0.00,7.69,0.00,0.00,0.00,15.38,0.00,0.00,0.00,0.00
Seq_347,7.69,0.00,0.00,0.00,15.38,7.69,0.00,15.38,7.69,23.08,0.00,0.00,0.00,0.00,0.00,15.38,0.00,7.69,0.00,0.00
Seq_348,5.56,0.00,0.00,0.00,5.56,5.56,5.56,5.56,22.22,16.67,11.11,0.00,5.56,0.00,0.00,5.56,0.00,11.11,0.00,0.00
Seq_349,2.56,0.00,0.00,7.69,5.13,0.00,2.56,2.56,20.51,12.82,0.00,5.13,2.56,12.82,5.13,2.56,7.69,2.56,0.00,7.69
Seq_350,13.95,13.95,2.33,2.33,4.65,11.63,4.65,4.65,4.65,6.98,0.00,6.98,0.00,2.33,4.65,6.98,2.33,6.98,0.00,0.00
Seq_351,13.33,0.00,0.00,3.33,0.00,13.33,0.00,10.00,13.33,13.33,3.33,3.33,3.33,6.67,0.00,10.00,3.33,0.00,3.33,0.00
Seq_352,5.69,5.69,5.69,5.69,0.81,5.69,0.81,2.44,4.88,10.57,1.63,1.63,4.88,7.32,13.01,5.69,8.13,5.69,0.81,3.25
Seq_353,7.50,20.00,0.00,0.00,2.50,7.50,12.50,0.00,5.00,5.00,2.50,0.00,2.50,0.00,5.00,10.00,7.50,5.00,2.50,5.00
Seq_354,2.50,20.00,0.00,0.00,5.00,10.00,10.00,0.00,5.00,7.50,0.00,2.50,2.50,0.00,10.00,7.50,7.50,2.50,0.00,7.50
Seq_355,8.33,0.00,4.17,4.17,0.00,29.17,4.17,16.67,8.33,12.50,0.00,0.00,0.00,0.00,8.33,0.00,0.00,0.00,4.17,0.00
Seq_356,7.69,0.00,3.85,0.00,0.00,19.23,3.85,11.54,15.38,11.54,0.00,0.00,0.00,0.00,19.23,0.00,0.00,3.85,3.85,0.00
Seq_357,8.33,0.00,0.00,0.00,8.33,20.83,16.67,16.67,4.17,8.33,4.17,4.17,0.00,4.17,4.17,0.00,0.00,0.00,0.00,0.00
Seq_358,16.00,0.00,0.00,0.00,4.00,16.00,20.00,8.00,8.00,4.00,0.00,4.00,0.00,0.00,4.00,4.00,0.00,4.00,4.00,4.00
