ID,PCP_AR,PCP_NE_pH,PCP_HB
Seq_1,0.03,0.727,0.545
Seq_2,0.176,0.882,0.559
Seq_3,0.111,0.741,0.389
Seq_4,0.122,0.735,0.449
Seq_5,0.088,0.735,0.559
Seq_6,0.056,0.778,0.5
Seq_7,0.056,0.778,0.5
Seq_8,0.0,0.667,0.667
Seq_9,0.163,0.791,0.744
Seq_10,0.054,0.784,0.595
Seq_11,0.077,0.692,0.538
Seq_12,0.154,0.692,0.538
Seq_13,0.062,0.812,0.562
Seq_14,0.062,0.812,0.562
Seq_15,0.062,0.812,0.562
Seq_16,0.062,0.812,0.625
Seq_17,0.125,0.812,0.562
Seq_18,0.062,0.812,0.562
Seq_19,0.059,0.765,0.529
Seq_20,0.059,0.765,0.529
Seq_21,0.059,0.765,0.529
Seq_22,0.0,0.75,0.167
Seq_23,0.0,0.692,0.154
Seq_24,0.16,0.68,0.56
Seq_25,0.19,0.952,0.619
Seq_26,0.235,0.529,0.471
Seq_27,0.143,0.762,0.476
Seq_28,0.114,0.773,0.409
Seq_29,0.054,0.784,0.568
Seq_30,0.054,0.784,0.595
Seq_31,0.056,0.778,0.583
Seq_32,0.154,0.769,0.462
Seq_33,0.079,0.789,0.553
Seq_34,0.075,0.75,0.55
Seq_35,0.071,0.762,0.524
Seq_36,0.073,0.805,0.561
Seq_37,0.071,0.857,0.571
Seq_38,0.095,0.762,0.524
Seq_39,0.05,0.75,0.525
Seq_40,0.053,0.763,0.553
Seq_41,0.05,0.775,0.55
Seq_42,0.05,0.8,0.5
Seq_43,0.053,0.816,0.553
Seq_44,0.053,0.842,0.579
Seq_45,0.048,0.857,0.548
Seq_46,0.042,0.792,0.5
Seq_47,0.037,0.815,0.481
Seq_48,0.037,0.815,0.481
Seq_49,0.04,0.8,0.52
Seq_50,0.04,0.84,0.52
Seq_51,0.037,0.815,0.481
Seq_52,0.0,0.9,0.6
Seq_53,0.0,0.9,0.6
Seq_54,0.0,0.9,0.6
Seq_55,0.037,0.815,0.519
Seq_56,0.037,0.815,0.519
Seq_57,0.037,0.778,0.481
Seq_58,0.037,0.815,0.519
Seq_59,0.111,0.815,0.519
Seq_60,0.0,0.9,0.6
Seq_61,0.0,0.9,0.55
Seq_62,0.0,0.9,0.55
Seq_63,0.0,0.765,0.706
Seq_64,0.0,0.706,0.588
Seq_65,0.0,0.706,0.647
Seq_66,0.0,0.706,0.588
Seq_67,0.0,0.882,0.588
Seq_68,0.083,0.833,0.792
Seq_69,0.087,0.826,0.652
Seq_70,0.125,0.833,0.75
Seq_71,0.083,0.833,0.792
Seq_72,0.03,0.848,0.576
Seq_73,0.022,0.696,0.435
Seq_74,0.022,0.717,0.457
Seq_75,0.027,0.757,0.514
Seq_76,0.091,0.818,0.515
Seq_77,0.0,0.758,0.576
Seq_78,0.0,0.758,0.606
Seq_79,0.027,0.784,0.541
Seq_80,0.125,0.833,0.708
Seq_81,0.125,0.917,0.75
Seq_82,0.061,0.788,0.545
Seq_83,0.091,0.788,0.485
Seq_84,0.054,0.784,0.514
Seq_85,0.077,0.923,0.692
Seq_86,0.0,0.923,0.692
Seq_87,0.0,1.0,0.692
Seq_88,0.077,0.923,0.692
Seq_89,0.154,0.923,0.692
Seq_90,0.308,0.846,0.615
Seq_91,0.048,0.714,0.429
Seq_92,0.089,0.667,0.444
Seq_93,0.154,0.923,0.846
Seq_94,0.154,0.923,0.769
Seq_95,0.154,0.923,0.769
Seq_96,0.154,0.923,0.846
Seq_97,0.0,0.923,0.769
Seq_98,0.071,0.857,0.643
Seq_99,0.071,0.857,0.714
Seq_100,0.077,0.923,0.692
Seq_101,0.0,0.727,0.455
Seq_102,0.04,0.84,0.52
Seq_103,0.032,0.71,0.548
Seq_104,0.062,0.781,0.594
Seq_105,0.125,0.833,0.75
Seq_106,0.031,0.688,0.5
Seq_107,0.0,0.812,0.562
Seq_108,0.0,0.75,0.571
Seq_109,0.0,0.714,0.536
Seq_110,0.0,0.84,0.52
Seq_111,0.037,0.778,0.556
Seq_112,0.032,0.71,0.548
Seq_113,0.054,0.703,0.514
Seq_114,0.028,0.667,0.444
Seq_115,0.057,0.657,0.514
Seq_116,0.057,0.686,0.514
Seq_117,0.026,0.718,0.487
Seq_118,0.026,0.744,0.487
Seq_119,0.056,0.778,0.611
Seq_120,0.026,0.744,0.538
Seq_121,0.026,0.744,0.538
Seq_122,0.057,0.686,0.429
Seq_123,0.032,0.71,0.419
Seq_124,0.026,0.744,0.513
Seq_125,0.077,0.846,0.846
Seq_126,0.057,0.629,0.457
Seq_127,0.057,0.6,0.429
Seq_128,0.054,0.73,0.514
Seq_129,0.0,0.632,0.474
Seq_130,0.091,0.545,0.545
Seq_131,0.13,0.739,0.435
Seq_132,0.104,0.875,0.396
Seq_133,0.038,0.808,0.577
Seq_134,0.048,0.714,0.548
Seq_135,0.137,0.667,0.373
Seq_136,0.125,0.719,0.469
Seq_137,0.385,0.769,0.769
Seq_138,0.056,0.722,0.611
Seq_139,0.385,0.692,0.692
Seq_140,0.12,0.68,0.36
Seq_141,0.159,0.864,0.455
Seq_142,0.034,0.655,0.448
Seq_143,0.0,0.667,0.556
Seq_144,0.029,0.824,0.618
Seq_145,0.059,0.882,0.647
Seq_146,0.033,0.767,0.533
Seq_147,0.036,0.857,0.75
Seq_148,0.034,0.793,0.621
Seq_149,0.077,0.769,0.538
Seq_150,0.036,0.786,0.571
Seq_151,0.033,0.833,0.5
Seq_152,0.036,0.857,0.607
Seq_153,0.16,0.72,0.48
Seq_154,0.105,0.947,0.474
Seq_155,0.0,0.75,0.5
Seq_156,0.062,0.812,0.562
Seq_157,0.1,0.75,0.45
Seq_158,0.115,0.769,0.462
Seq_159,0.053,0.684,0.474
Seq_160,0.167,0.8,0.633
Seq_161,0.161,0.774,0.613
Seq_162,0.132,0.395,0.053
Seq_163,0.167,0.833,0.6
Seq_164,0.172,0.828,0.586
Seq_165,0.167,0.8,0.567
Seq_166,0.091,0.818,0.606
Seq_167,0.062,0.75,0.5
Seq_168,0.156,0.812,0.531
Seq_169,0.079,0.816,0.474
Seq_170,0.057,0.657,0.486
Seq_171,0.03,0.515,0.273
Seq_172,0.121,0.697,0.424
Seq_173,0.088,0.647,0.471
Seq_174,0.03,0.636,0.576
Seq_175,0.03,0.667,0.606
Seq_176,0.061,0.758,0.485
Seq_177,0.25,0.75,0.5
Seq_178,0.111,0.667,0.389
Seq_179,0.05,0.8,0.65
Seq_180,0.08,0.76,0.64
Seq_181,0.1,0.8,0.4
Seq_182,0.111,0.667,0.444
Seq_183,0.071,0.643,0.476
Seq_184,0.068,0.705,0.455
Seq_185,0.162,0.838,0.378
Seq_186,0.071,0.714,0.571
Seq_187,0.0,0.786,0.714
Seq_188,0.083,0.861,0.389
Seq_189,0.108,0.865,0.351
Seq_190,0.0,0.882,0.618
Seq_191,0.0,0.853,0.618
Seq_192,0.062,0.875,0.625
Seq_193,0.029,0.765,0.529
Seq_194,0.125,0.688,0.375
Seq_195,0.042,0.875,0.5
Seq_196,0.0,0.81,0.619
Seq_197,0.278,0.611,0.444
Seq_198,0.278,0.611,0.444
Seq_199,0.235,0.647,0.471
Seq_200,0.235,0.647,0.471
Seq_201,0.235,0.647,0.471
Seq_202,0.025,0.825,0.475
Seq_203,0.118,0.706,0.412
Seq_204,0.125,0.688,0.5
Seq_205,0.111,0.722,0.444
Seq_206,0.167,0.778,0.5
Seq_207,0.111,0.722,0.5
Seq_208,0.125,0.688,0.438
Seq_209,0.125,0.719,0.438
Seq_210,0.069,0.759,0.448
Seq_211,0.065,0.806,0.516
Seq_212,0.078,0.725,0.49
Seq_213,0.025,0.825,0.5
Seq_214,0.059,0.735,0.5
Seq_215,0.05,0.825,0.5
Seq_216,0.026,0.744,0.487
Seq_217,0.026,0.744,0.513
Seq_218,0.026,0.744,0.513
Seq_219,0.05,0.75,0.525
Seq_220,0.085,0.638,0.383
Seq_221,0.0,0.763,0.526
Seq_222,0.064,0.745,0.511
Seq_223,0.04,0.76,0.48
Seq_224,0.0,0.8,0.64
Seq_225,0.0,0.8,0.64
Seq_226,0.0,0.84,0.64
Seq_227,0.0,0.8,0.6
Seq_228,0.0,0.8,0.64
Seq_229,0.042,0.792,0.667
Seq_230,0.042,0.75,0.625
Seq_231,0.042,0.75,0.625
Seq_232,0.042,0.792,0.625
Seq_233,0.0,0.84,0.48
Seq_234,0.0,0.8,0.48
Seq_235,0.0,0.8,0.52
Seq_236,0.0,0.8,0.48
Seq_237,0.045,0.682,0.409
Seq_238,0.045,0.636,0.409
Seq_239,0.045,0.636,0.409
Seq_240,0.045,0.636,0.409
Seq_241,0.043,0.783,0.435
Seq_242,0.043,0.783,0.478
Seq_243,0.043,0.783,0.435
Seq_244,0.091,0.818,0.727
Seq_245,0.087,0.826,0.609
Seq_246,0.111,0.833,0.667
Seq_247,0.0,0.769,0.462
Seq_248,0.128,0.718,0.487
Seq_249,0.152,0.788,0.545
Seq_250,0.075,0.775,0.55
Seq_251,0.167,0.75,0.556
Seq_252,0.0,0.658,0.447
Seq_253,0.04,0.76,0.4
Seq_254,0.073,0.902,0.366
Seq_255,0.163,0.767,0.721
Seq_256,0.054,0.757,0.405
Seq_257,0.118,0.735,0.441
Seq_258,0.067,0.867,0.567
Seq_259,0.065,0.871,0.581
Seq_260,0.217,0.783,0.522
Seq_261,0.217,0.783,0.522
Seq_262,0.217,0.783,0.522
Seq_263,0.217,0.783,0.522
Seq_264,0.174,0.739,0.522
Seq_265,0.059,0.647,0.353
Seq_266,0.065,0.871,0.613
Seq_267,0.044,0.667,0.4
Seq_268,0.091,0.727,0.424
Seq_269,0.094,0.656,0.438
Seq_270,0.098,0.804,0.471
Seq_271,0.098,0.804,0.471
Seq_272,0.048,0.714,0.429
Seq_273,0.08,0.76,0.48
Seq_274,0.13,0.739,0.522
Seq_275,0.125,0.75,0.5
Seq_276,0.132,0.711,0.368
Seq_277,0.032,0.774,0.613
Seq_278,0.068,0.795,0.477
Seq_279,0.022,0.739,0.478
Seq_280,0.043,0.681,0.447
Seq_281,0.043,0.702,0.447
Seq_282,0.167,0.833,0.528
Seq_283,0.154,0.744,0.513
Seq_284,0.154,0.718,0.513
Seq_285,0.049,0.78,0.488
Seq_286,0.095,0.905,0.619
Seq_287,0.182,0.909,0.818
Seq_288,0.083,0.833,0.833
Seq_289,0.167,0.917,0.75
Seq_290,0.091,0.909,0.818
Seq_291,0.051,0.667,0.333
Seq_292,0.048,0.667,0.429
Seq_293,0.074,0.519,0.37
Seq_294,0.108,0.568,0.405
Seq_295,0.261,0.739,0.348
Seq_296,0.057,0.657,0.457
Seq_297,0.061,0.788,0.515
Seq_298,0.061,0.879,0.455
Seq_299,0.053,0.789,0.526
Seq_300,0.053,0.789,0.526
Seq_301,0.105,0.789,0.526
Seq_302,0.053,0.842,0.579
Seq_303,0.053,0.789,0.526
Seq_304,0.0,0.789,0.526
Seq_305,0.0,0.789,0.579
Seq_306,0.059,0.765,0.647
Seq_307,0.0,0.765,0.529
Seq_308,0.059,0.765,0.588
Seq_309,0.059,0.824,0.529
Seq_310,0.154,0.769,0.615
Seq_311,0.158,0.684,0.421
Seq_312,0.158,0.737,0.474
Seq_313,0.219,0.688,0.406
Seq_314,0.219,0.656,0.406
Seq_315,0.118,0.706,0.471
Seq_316,0.118,0.706,0.412
Seq_317,0.0,0.538,0.385
Seq_318,0.083,0.833,0.583
Seq_319,0.0,0.588,0.529
Seq_320,0.0,0.632,0.526
Seq_321,0.12,0.64,0.48
Seq_322,0.12,0.64,0.48
Seq_323,0.05,0.65,0.5
Seq_324,0.132,0.737,0.395
Seq_325,0.029,0.706,0.588
Seq_326,0.056,0.778,0.5
Seq_327,0.0,0.8,0.64
Seq_328,0.057,0.714,0.514
Seq_329,0.086,0.714,0.514
Seq_330,0.057,0.686,0.514
Seq_331,0.057,0.686,0.543
Seq_332,0.054,0.784,0.649
Seq_333,0.062,0.812,0.562
Seq_334,0.062,0.812,0.562
Seq_335,0.062,0.812,0.562
Seq_336,0.047,0.744,0.512
Seq_337,0.075,0.85,0.575
Seq_338,0.091,0.727,0.591
Seq_339,0.286,0.857,0.786
Seq_340,0.048,0.81,0.714
Seq_341,0.156,0.781,0.562
Seq_342,0.156,0.781,0.562
Seq_343,0.156,0.75,0.562
Seq_344,0.067,0.6,0.467
Seq_345,0.133,0.6,0.467
Seq_346,0.125,0.625,0.5
Seq_347,0.125,0.625,0.5
Seq_348,0.148,0.593,0.481
Seq_349,0.071,0.75,0.5
Seq_350,0.059,0.529,0.324
Seq_351,0.13,0.652,0.609
Seq_352,0.054,0.649,0.486
Seq_353,0.081,0.595,0.324
Seq_354,0.073,0.683,0.488
Seq_355,0.048,0.69,0.524
Seq_356,0.068,0.727,0.523
Seq_357,0.1,0.7,0.5
Seq_358,0.1,0.7,0.5
Seq_359,0.1,0.667,0.467
Seq_360,0.103,0.69,0.586
Seq_361,0.067,0.767,0.567
Seq_362,0.0,0.778,0.556
Seq_363,0.0,0.789,0.526
Seq_364,0.042,0.708,0.542
Seq_365,0.042,0.708,0.542
Seq_366,0.089,0.622,0.378
Seq_367,0.08,0.76,0.52
Seq_368,0.08,0.76,0.52
Seq_369,0.038,0.731,0.538
Seq_370,0.077,0.808,0.577
Seq_371,0.125,0.792,0.583
Seq_372,0.1,0.9,0.75
Seq_373,0.08,0.8,0.56
Seq_374,0.1,0.8,0.54
Seq_375,0.106,0.766,0.511
Seq_376,0.154,0.744,0.692
Seq_377,0.154,0.846,0.385
Seq_378,0.154,0.846,0.462
Seq_379,0.0,0.6,0.56
Seq_380,0.111,0.694,0.417
Seq_381,0.022,0.778,0.444
Seq_382,0.085,0.638,0.426
Seq_383,0.167,0.806,0.528
Seq_384,0.154,0.923,0.692
Seq_385,0.0,0.818,0.485
Seq_386,0.231,0.923,0.692
Seq_387,0.214,0.929,0.786
Seq_388,0.109,0.8,0.436
Seq_389,0.0,0.793,0.655
Seq_390,0.034,0.793,0.655
Seq_391,0.0,0.844,0.625
Seq_392,0.0,0.833,0.639
Seq_393,0.081,0.568,0.378
Seq_394,0.074,0.815,0.481
Seq_395,0.106,0.766,0.511
Seq_396,0.128,0.787,0.511
Seq_397,0.073,0.818,0.527
Seq_398,0.091,0.818,0.491
Seq_399,0.037,0.815,0.593
Seq_400,0.08,0.8,0.52
Seq_401,0.091,0.773,0.545
Seq_402,0.0,0.889,0.611
Seq_403,0.154,0.769,0.538
Seq_404,0.143,0.5,0.5
Seq_405,0.286,0.714,0.571
Seq_406,0.0,0.638,0.383
Seq_407,0.05,0.9,0.5
Seq_408,0.194,0.774,0.484
Seq_409,0.12,0.7,0.4
Seq_410,0.081,0.73,0.432
Seq_411,0.128,0.795,0.41
Seq_412,0.121,0.788,0.515
Seq_413,0.121,0.667,0.455
Seq_414,0.129,0.774,0.484
Seq_415,0.121,0.727,0.485
Seq_416,0.2,0.833,0.633
Seq_417,0.147,0.735,0.441
Seq_418,0.056,0.722,0.611
Seq_419,0.05,0.6,0.2
Seq_420,0.0,0.786,0.714
Seq_421,0.231,0.692,0.385
Seq_422,0.083,0.667,0.667
Seq_423,0.111,0.806,0.444
Seq_424,0.042,0.875,0.792
Seq_425,0.125,0.875,0.708
Seq_426,0.125,0.833,0.708
Seq_427,0.125,0.833,0.625
Seq_428,0.05,0.85,0.75
Seq_429,0.103,0.724,0.483
Seq_430,0.103,0.759,0.483
Seq_431,0.118,0.765,0.706
Seq_432,0.125,0.833,0.75
Seq_433,0.042,0.875,0.792
Seq_434,0.083,0.875,0.792
Seq_435,0.167,0.833,0.75
Seq_436,0.125,0.833,0.75
Seq_437,0.167,0.833,0.75
Seq_438,0.125,0.833,0.75
Seq_439,0.125,0.833,0.75
Seq_440,0.167,0.875,0.75
Seq_441,0.125,0.833,0.75
Seq_442,0.125,0.833,0.708
Seq_443,0.125,0.875,0.708
Seq_444,0.136,0.682,0.545
Seq_445,0.136,0.727,0.5
Seq_446,0.042,0.75,0.458
Seq_447,0.042,0.75,0.458
Seq_448,0.0,0.696,0.435
Seq_449,0.0,0.739,0.478
Seq_450,0.105,0.895,0.421
Seq_451,0.19,0.905,0.476
Seq_452,0.097,0.839,0.548
Seq_453,0.107,0.661,0.482
Seq_454,0.087,0.717,0.5
Seq_455,0.048,0.69,0.548
Seq_456,0.114,0.743,0.514
Seq_457,0.114,0.743,0.486
Seq_458,0.114,0.743,0.486
Seq_459,0.114,0.714,0.486
Seq_460,0.059,0.706,0.392
Seq_461,0.05,0.75,0.55
Seq_462,0.05,0.75,0.55
Seq_463,0.048,0.476,0.286
Seq_464,0.04,0.64,0.4
Seq_465,0.222,0.556,0.556
Seq_466,0.067,0.844,0.311
Seq_467,0.105,0.526,0.368
Seq_468,0.0,0.85,0.65
Seq_469,0.088,0.588,0.353
Seq_470,0.267,1.0,0.933
Seq_471,0.0,0.882,0.529
Seq_472,0.0,0.696,0.348
Seq_473,0.087,0.783,0.565
Seq_474,0.2,0.85,0.7
Seq_475,0.1,0.55,0.4
Seq_476,0.125,0.333,0.083
Seq_477,0.0,0.571,0.571
Seq_478,0.0,0.857,0.524
Seq_479,0.0,0.788,0.515
Seq_480,0.067,0.6,0.533
Seq_481,0.033,0.833,0.6
Seq_482,0.036,0.714,0.0
Seq_483,0.079,0.789,0.0
Seq_484,0.05,0.85,0.75
Seq_485,0.1,0.85,0.75
Seq_486,0.1,0.85,0.75
Seq_487,0.08,0.72,0.56
Seq_488,0.111,0.593,0.444
Seq_489,0.2,0.65,0.4
Seq_490,0.2,0.7,0.4
Seq_491,0.156,0.438,0.094
Seq_492,0.0,0.917,0.667
Seq_493,0.071,0.786,0.643
Seq_494,0.167,0.333,0.083
Seq_495,0.049,0.78,0.561
Seq_496,0.0,0.9,0.6
Seq_497,0.0,0.9,0.6
Seq_498,0.0,0.9,0.55
Seq_499,0.062,0.875,0.625
Seq_500,0.103,0.931,0.724
Seq_501,0.071,0.679,0.429
Seq_502,0.1,0.8,0.6
Seq_503,0.0,0.72,0.52
Seq_504,0.05,0.8,0.5
Seq_505,0.018,0.732,0.536
Seq_506,0.0,0.733,0.667
Seq_507,0.056,0.833,0.611
Seq_508,0.132,0.816,0.421
Seq_509,0.0,0.76,0.52
Seq_510,0.071,0.643,0.571
Seq_511,0.0,0.917,0.667
Seq_512,0.0,0.68,0.48
Seq_513,0.045,0.682,0.545
Seq_514,0.0,0.762,0.571
Seq_515,0.053,0.842,0.632
Seq_516,0.111,0.778,0.444
Seq_517,0.148,0.667,0.481
Seq_518,0.15,0.725,0.35
Seq_519,0.043,0.783,0.587
Seq_520,0.148,0.704,0.444
Seq_521,0.071,0.667,0.476
Seq_522,0.0,0.579,0.211
Seq_523,0.095,0.81,0.619
Seq_524,0.115,0.692,0.538
Seq_525,0.07,0.791,0.488
Seq_526,0.12,0.76,0.36
Seq_527,0.114,0.943,0.714
Seq_528,0.075,0.775,0.5
Seq_529,0.091,0.773,0.5
Seq_530,0.085,0.638,0.468
Seq_531,0.059,0.824,0.647
Seq_532,0.059,0.882,0.706
Seq_533,0.03,0.788,0.455
Seq_534,0.067,0.867,0.8
Seq_535,0.026,0.816,0.474
Seq_536,0.15,0.85,0.8
Seq_537,0.077,0.808,0.615
Seq_538,0.077,0.808,0.577
Seq_539,0.0,0.75,0.607
Seq_540,0.043,0.674,0.457
Seq_541,0.065,0.696,0.457
Seq_542,0.03,0.848,0.545
Seq_543,0.0,0.848,0.515
Seq_544,0.027,0.784,0.595
Seq_545,0.125,0.833,0.75
Seq_546,0.0,0.905,0.524
Seq_547,0.048,0.857,0.524
Seq_548,0.0,0.952,0.524
Seq_549,0.088,0.853,0.5
Seq_550,0.0,0.733,0.6
Seq_551,0.0,0.423,0.385
Seq_552,0.065,0.774,0.484
Seq_553,0.154,0.923,0.769
Seq_554,0.03,0.788,0.515
Seq_555,0.045,0.909,0.591
Seq_556,0.154,0.923,0.692
Seq_557,0.19,0.952,0.619
Seq_558,0.031,0.75,0.531
Seq_559,0.083,0.833,0.792
Seq_560,0.077,0.923,0.692
Seq_561,0.077,1.0,0.769
Seq_562,0.071,0.857,0.643
Seq_563,0.077,0.923,0.692
Seq_564,0.095,0.81,0.524
Seq_565,0.13,0.783,0.478
Seq_566,0.15,0.85,0.8
Seq_567,0.15,0.85,0.8
Seq_568,0.15,0.85,0.8
Seq_569,0.065,0.674,0.457
Seq_570,0.0,0.929,0.643
Seq_571,0.03,0.788,0.455
Seq_572,0.083,0.5,0.417
Seq_573,0.03,0.788,0.455
Seq_574,0.027,0.838,0.486
Seq_575,0.143,1.0,0.714
Seq_576,0.103,0.759,0.621
Seq_577,0.107,0.786,0.5
Seq_578,0.0,0.741,0.593
Seq_579,0.0,0.741,0.593
Seq_580,0.065,0.839,0.581
Seq_581,0.032,0.839,0.581
Seq_582,0.042,0.792,0.458
Seq_583,0.042,0.792,0.458
Seq_584,0.105,0.579,0.421
Seq_585,0.05,0.6,0.45
Seq_586,0.067,0.533,0.367
Seq_587,0.065,0.516,0.355
Seq_588,0.13,0.522,0.348
Seq_589,0.138,0.517,0.379
Seq_590,0.093,0.86,0.395
Seq_591,0.091,0.886,0.432
Seq_592,0.116,0.86,0.419
Seq_593,0.091,0.818,0.432
Seq_594,0.135,0.838,0.378
Seq_595,0.093,0.837,0.442
Seq_596,0.098,0.878,0.415
Seq_597,0.0,0.818,0.545
Seq_598,0.0,0.846,0.538
Seq_599,0.048,0.905,0.619
Seq_600,0.091,0.879,0.545
Seq_601,0.091,0.909,0.545
Seq_602,0.121,0.879,0.545
Seq_603,0.091,0.909,0.545
Seq_604,0.121,0.879,0.545
Seq_605,0.12,0.84,0.64
Seq_606,0.125,0.875,0.792
Seq_607,0.125,0.833,0.792
Seq_608,0.043,0.696,0.5
Seq_609,0.043,0.696,0.5
Seq_610,0.027,0.757,0.486
Seq_611,0.0,0.75,0.571
Seq_612,0.0,0.714,0.536
Seq_613,0.0,0.75,0.571
Seq_614,0.0,0.75,0.5
Seq_615,0.0,0.786,0.571
Seq_616,0.0,0.704,0.519
Seq_617,0.077,0.923,0.692
Seq_618,0.043,0.826,0.696
Seq_619,0.167,0.792,0.542
Seq_620,0.054,0.757,0.514
Seq_621,0.081,0.784,0.486
Seq_622,0.068,0.682,0.409
Seq_623,0.13,0.87,0.652
Seq_624,0.042,0.917,0.5
Seq_625,0.1,0.64,0.42
Seq_626,0.081,0.676,0.405
Seq_627,0.116,0.581,0.372
Seq_628,0.053,0.579,0.342
Seq_629,0.027,0.757,0.459
Seq_630,0.091,0.606,0.394
Seq_631,0.14,0.744,0.721
Seq_632,0.077,0.712,0.635
Seq_633,0.0,0.75,0.607
Seq_634,0.077,0.654,0.538
Seq_635,0.222,0.63,0.481
Seq_636,0.025,0.65,0.425
Seq_637,0.162,0.622,0.378
Seq_638,0.133,0.7,0.433
Seq_639,0.043,0.87,0.609
Seq_640,0.077,0.923,0.692
Seq_641,0.077,0.846,0.615
Seq_642,0.154,0.846,0.538
Seq_643,0.087,0.783,0.522
Seq_644,0.087,0.783,0.522
Seq_645,0.13,0.783,0.522
Seq_646,0.05,0.9,0.55
Seq_647,0.048,0.857,0.524
Seq_648,0.05,0.8,0.5
Seq_649,0.048,0.762,0.429
Seq_650,0.048,0.762,0.476
Seq_651,0.095,0.762,0.476
Seq_652,0.053,0.579,0.526
Seq_653,0.118,0.647,0.471
Seq_654,0.108,0.73,0.405
Seq_655,0.179,0.821,0.436
Seq_656,0.135,0.757,0.405
Seq_657,0.135,0.757,0.432
Seq_658,0.189,0.811,0.324
Seq_659,0.067,0.756,0.489
Seq_660,0.065,0.761,0.5
Seq_661,0.0,0.667,0.5
Seq_662,0.0,0.818,0.636
Seq_663,0.0,0.667,0.556
Seq_664,0.111,0.778,0.667
Seq_665,0.0,1.0,0.727
Seq_666,0.238,0.714,0.524
Seq_667,0.238,0.714,0.524
Seq_668,0.034,0.931,0.655
Seq_669,0.065,0.839,0.548
Seq_670,0.132,0.737,0.526
Seq_671,0.105,0.737,0.5
Seq_672,0.108,0.568,0.432
Seq_673,0.108,0.595,0.432
Seq_674,0.081,0.622,0.378
Seq_675,0.081,0.595,0.405
Seq_676,0.038,0.923,0.462
Seq_677,0.043,0.87,0.565
Seq_678,0.043,0.87,0.522
Seq_679,0.0,0.87,0.522
Seq_680,0.119,0.81,0.476
Seq_681,0.184,0.816,0.474
Seq_682,0.098,0.707,0.39
Seq_683,0.075,0.75,0.55
Seq_684,0.088,0.794,0.353
Seq_685,0.088,0.824,0.382
Seq_686,0.081,0.757,0.459
Seq_687,0.071,0.643,0.5
Seq_688,0.095,0.738,0.619
Seq_689,0.116,0.791,0.442
Seq_690,0.136,0.75,0.409
Seq_691,0.039,0.667,0.412
Seq_692,0.051,0.692,0.487
Seq_693,0.042,0.792,0.5
Seq_694,0.105,0.842,0.684
Seq_695,0.053,0.895,0.632
Seq_696,0.05,0.85,0.6
Seq_697,0.053,0.842,0.632
Seq_698,0.059,0.824,0.647
Seq_699,0.105,0.842,0.684
Seq_700,0.04,0.84,0.6
Seq_701,0.167,0.75,0.542
Seq_702,0.109,0.848,0.543
Seq_703,0.086,0.914,0.724
Seq_704,0.08,0.8,0.68
Seq_705,0.0,0.905,0.619
Seq_706,0.13,0.739,0.435
Seq_707,0.042,0.708,0.5
Seq_708,0.108,0.676,0.405
Seq_709,0.135,0.649,0.378
Seq_710,0.081,0.649,0.378
Seq_711,0.108,0.676,0.405
Seq_712,0.042,0.708,0.417
Seq_713,0.05,0.7,0.5
Seq_714,0.038,0.577,0.385
Seq_715,0.061,0.735,0.469
Seq_716,0.083,0.75,0.458
Seq_717,0.12,0.68,0.4
Seq_718,0.16,0.68,0.52
Seq_719,0.158,0.632,0.526
Seq_720,0.12,0.68,0.44
Seq_721,0.16,0.68,0.44
Seq_722,0.087,0.652,0.522
Seq_723,0.154,0.731,0.462
Seq_724,0.143,0.762,0.524
Seq_725,0.105,0.632,0.421
Seq_726,0.087,0.696,0.435
Seq_727,0.125,0.667,0.458
Seq_728,0.0,0.9,0.6
Seq_729,0.0,0.9,0.6
Seq_730,0.0,1.0,0.647
Seq_731,0.0,0.833,0.611
Seq_732,0.0,0.833,0.611
Seq_733,0.211,0.474,0.132
Seq_734,0.259,0.556,0.185
Seq_735,0.19,0.476,0.095
Seq_736,0.12,0.32,0.08
Seq_737,0.154,0.308,0.077
Seq_738,0.143,0.286,0.071
Seq_739,0.111,0.778,0.667
Seq_740,0.1,0.75,0.65
Seq_741,0.091,0.864,0.682
Seq_742,0.05,0.8,0.45
Seq_743,0.05,0.7,0.5
Seq_744,0.138,0.621,0.345
Seq_745,0.083,0.833,0.333
Seq_746,0.0,0.774,0.452
Seq_747,0.032,0.774,0.452
Seq_748,0.065,0.774,0.452
Seq_749,0.154,0.923,0.769
Seq_750,0.077,0.923,0.769
Seq_751,0.231,0.923,0.769
Seq_752,0.231,1.0,0.769
Seq_753,0.062,0.812,0.469
Seq_754,0.061,0.788,0.485
Seq_755,0.143,0.929,0.714
Seq_756,0.143,0.929,0.714
Seq_757,0.143,0.929,0.786
Seq_758,0.214,0.929,0.786
Seq_759,0.04,0.84,0.52
Seq_760,0.1,0.85,0.75
Seq_761,0.0,0.71,0.581
Seq_762,0.0,0.87,0.565
Seq_763,0.0,0.95,0.6
Seq_764,0.0,0.674,0.372
Seq_765,0.051,0.641,0.385
Seq_766,0.023,0.674,0.419
Seq_767,0.026,0.684,0.421
Seq_768,0.026,0.711,0.421
Seq_769,0.026,0.711,0.421
Seq_770,0.026,0.711,0.447
Seq_771,0.026,0.789,0.342
Seq_772,0.106,0.851,0.511
Seq_773,0.14,0.884,0.442
Seq_774,0.116,0.837,0.419
Seq_775,0.091,0.818,0.455
Seq_776,0.116,0.837,0.419
Seq_777,0.093,0.86,0.395
Seq_778,0.093,0.884,0.419
Seq_779,0.116,0.86,0.395
Seq_780,0.108,0.757,0.432
Seq_781,0.108,0.892,0.378
Seq_782,0.135,0.838,0.378
Seq_783,0.108,0.811,0.405
Seq_784,0.114,0.864,0.432
Seq_785,0.163,0.791,0.442
Seq_786,0.056,0.833,0.722
Seq_787,0.111,0.722,0.611
Seq_788,0.143,0.81,0.429
Seq_789,0.125,0.833,0.75
Seq_790,0.167,0.833,0.75
Seq_791,0.062,0.938,0.625
Seq_792,0.077,0.923,0.692
Seq_793,0.17,0.809,0.511
Seq_794,0.077,0.923,0.769
Seq_795,0.154,0.923,0.769
Seq_796,0.0,0.923,0.692
Seq_797,0.0,0.75,0.643
Seq_798,0.154,0.846,0.692
Seq_799,0.0,1.0,0.692
Seq_800,0.077,0.923,0.692
Seq_801,0.077,0.923,0.538
Seq_802,0.154,0.923,0.692
Seq_803,0.048,0.857,0.619
Seq_804,0.125,0.833,0.75
Seq_805,0.0,0.684,0.368
Seq_806,0.0,0.788,0.455
Seq_807,0.094,0.656,0.281
Seq_808,0.083,0.833,0.75
Seq_809,0.042,0.875,0.792
Seq_810,0.062,0.75,0.531
Seq_811,0.0,0.75,0.5
Seq_812,0.0,0.952,0.762
Seq_813,0.111,0.593,0.519
Seq_814,0.0,0.783,0.609
Seq_815,0.028,0.639,0.5
Seq_816,0.054,0.622,0.459
Seq_817,0.095,0.81,0.571
Seq_818,0.176,0.559,0.441
Seq_819,0.176,0.529,0.441
Seq_820,0.206,0.559,0.471
Seq_821,0.154,0.923,0.615
Seq_822,0.077,1.0,0.769
Seq_823,0.231,0.923,0.615
Seq_824,0.053,0.842,0.684
Seq_825,0.1,0.833,0.4
Seq_826,0.2,0.75,0.45
Seq_827,0.2,0.7,0.35
Seq_828,0.067,0.844,0.333
Seq_829,0.105,0.895,0.421
Seq_830,0.081,0.865,0.432
Seq_831,0.1,0.74,0.42
Seq_832,0.064,0.638,0.447
Seq_833,0.089,0.711,0.422
Seq_834,0.043,0.787,0.447
Seq_835,0.043,0.681,0.553
Seq_836,0.093,0.837,0.442
Seq_837,0.189,0.784,0.324
Seq_838,0.189,0.838,0.324
Seq_839,0.189,0.838,0.405
Seq_840,0.138,0.931,0.707
Seq_841,0.086,0.886,0.629
Seq_842,0.186,0.837,0.419
Seq_843,0.086,0.914,0.724
Seq_844,0.043,0.913,0.522
Seq_845,0.04,0.84,0.6
Seq_846,0.048,0.905,0.667
Seq_847,0.065,0.806,0.645
Seq_848,0.036,0.821,0.607
Seq_849,0.033,0.833,0.567
Seq_850,0.031,0.812,0.5
Seq_851,0.03,0.758,0.576
Seq_852,0.08,0.8,0.6
Seq_853,0.105,0.789,0.632
Seq_854,0.0,0.944,0.722
Seq_855,0.089,0.644,0.467
Seq_856,0.043,0.681,0.553
Seq_857,0.025,0.8,0.475
Seq_858,0.043,0.681,0.574
Seq_859,0.041,0.714,0.592
Seq_860,0.06,0.64,0.42
Seq_861,0.085,0.745,0.511
Seq_862,0.043,0.66,0.553
Seq_863,0.062,0.708,0.542
Seq_864,0.135,0.757,0.595
Seq_865,0.053,0.632,0.316
Seq_866,0.077,0.692,0.423
Seq_867,0.208,0.917,0.5
Seq_868,0.083,0.75,0.583
Seq_869,0.0,0.882,0.618
Seq_870,0.156,0.933,0.444
Seq_871,0.12,0.88,0.56
Seq_872,0.185,0.852,0.556
Seq_873,0.143,0.905,0.524
Seq_874,0.227,0.909,0.545
Seq_875,0.111,0.889,0.778
Seq_876,0.214,0.786,0.429
Seq_877,0.214,0.786,0.452
Seq_878,0.133,0.667,0.6
Seq_879,0.159,0.864,0.455
Seq_880,0.146,0.707,0.488
Seq_881,0.08,0.56,0.36
Seq_882,0.115,0.615,0.385
Seq_883,0.1,0.55,0.35
Seq_884,0.1,0.6,0.4
Seq_885,0.167,0.625,0.375
Seq_886,0.125,0.625,0.375
Seq_887,0.25,0.607,0.393
Seq_888,0.065,0.871,0.581
Seq_889,0.107,0.929,0.607
Seq_890,0.067,0.867,0.6
Seq_891,0.1,0.867,0.567
Seq_892,0.034,0.931,0.621
Seq_893,0.034,0.931,0.621
Seq_894,0.069,0.931,0.655
Seq_895,0.054,0.757,0.541
Seq_896,0.067,0.867,0.533
Seq_897,0.067,0.867,0.567
Seq_898,0.069,0.897,0.655
Seq_899,0.075,0.9,0.375
Seq_900,0.097,0.871,0.548
Seq_901,0.067,0.867,0.567
Seq_902,0.097,0.742,0.548
Seq_903,0.1,0.767,0.567
Seq_904,0.069,0.862,0.621
Seq_905,0.067,0.867,0.567
Seq_906,0.097,0.839,0.484
Seq_907,0.067,0.9,0.667
Seq_908,0.065,0.839,0.548
Seq_909,0.182,0.939,0.515
Seq_910,0.067,0.967,0.6
Seq_911,0.067,0.9,0.667
Seq_912,0.067,0.867,0.667
Seq_913,0.067,0.933,0.667
Seq_914,0.097,0.871,0.581
Seq_915,0.065,0.871,0.613
Seq_916,0.087,0.739,0.391
Seq_917,0.0,0.882,0.529
Seq_918,0.0,0.818,0.591
Seq_919,0.176,0.765,0.529
Seq_920,0.152,0.848,0.485
Seq_921,0.19,0.952,0.619
Seq_922,0.19,0.952,0.619
Seq_923,0.057,0.657,0.457
Seq_924,0.118,0.676,0.5
Seq_925,0.049,0.78,0.512
Seq_926,0.049,0.878,0.61
Seq_927,0.105,0.816,0.579
Seq_928,0.111,0.694,0.472
Seq_929,0.077,0.718,0.359
Seq_930,0.077,0.744,0.359
Seq_931,0.213,0.766,0.426
Seq_932,0.077,0.744,0.41
Seq_933,0.154,0.885,0.615
Seq_934,0.111,0.556,0.389
Seq_935,0.079,0.737,0.474
Seq_936,0.13,0.648,0.333
Seq_937,0.073,0.902,0.488
Seq_938,0.122,0.805,0.415
Seq_939,0.073,0.902,0.463
Seq_940,0.073,0.756,0.439
Seq_941,0.25,0.786,0.464
Seq_942,0.125,0.896,0.5
Seq_943,0.051,0.898,0.508
Seq_944,0.044,0.956,0.6
Seq_945,0.044,0.956,0.6
Seq_946,0.045,0.909,0.636
Seq_947,0.121,0.758,0.333
Seq_948,0.143,0.952,0.762
Seq_949,0.1,0.767,0.4
Seq_950,0.2,0.68,0.36
Seq_951,0.116,0.744,0.395
Seq_952,0.043,0.87,0.522
Seq_953,0.067,0.867,0.433
Seq_954,0.159,0.773,0.432
Seq_955,0.159,0.773,0.432
Seq_956,0.057,0.83,0.472
Seq_957,0.103,0.759,0.5
Seq_958,0.147,0.765,0.5
Seq_959,0.182,0.773,0.545
Seq_960,0.136,0.795,0.568
Seq_961,0.159,0.75,0.545
Seq_962,0.159,0.75,0.545
Seq_963,0.028,0.944,0.611
Seq_964,0.167,0.867,0.567
Seq_965,0.091,0.818,0.591
Seq_966,0.159,0.773,0.432
Seq_967,0.086,0.943,0.629
Seq_968,0.143,0.786,0.429
Seq_969,0.12,0.88,0.52
Seq_970,0.111,0.852,0.481
Seq_971,0.148,0.852,0.481
Seq_972,0.111,0.778,0.519
Seq_973,0.115,0.808,0.577
Seq_974,0.081,0.838,0.595
Seq_975,0.05,0.95,0.7
Seq_976,0.0,0.778,0.556
Seq_977,0.0,0.722,0.556
Seq_978,0.0,0.667,0.556
Seq_979,0.059,0.765,0.588
Seq_980,0.205,0.872,0.538
Seq_981,0.087,0.739,0.565
Seq_982,0.083,0.75,0.583
Seq_983,0.042,0.75,0.5
Seq_984,0.083,0.75,0.5
Seq_985,0.105,0.737,0.632
Seq_986,0.267,1.0,0.933
Seq_987,0.267,1.0,0.867
Seq_988,0.0,0.977,0.163
Seq_989,0.125,0.75,0.562
Seq_990,0.098,0.647,0.412
Seq_991,0.062,0.75,0.562
Seq_992,0.0,0.75,0.562
Seq_993,0.167,0.567,0.467
Seq_994,0.0,0.722,0.722
Seq_995,0.067,0.8,0.6
Seq_996,0.048,0.857,0.619
Seq_997,0.114,0.818,0.477
Seq_998,0.114,0.818,0.455
Seq_999,0.067,0.644,0.422
Seq_1000,0.077,0.923,0.615
Seq_1001,0.0,0.786,0.643
Seq_1002,0.0,0.786,0.643
Seq_1003,0.118,0.765,0.529
Seq_1004,0.118,0.765,0.529
Seq_1005,0.167,0.778,0.611
Seq_1006,0.054,0.757,0.486
Seq_1007,0.054,0.757,0.486
Seq_1008,0.027,0.784,0.459
Seq_1009,0.027,0.784,0.486
Seq_1010,0.027,0.784,0.459
Seq_1011,0.036,0.714,0.571
Seq_1012,0.0,1.0,0.692
Seq_1013,0.0,0.867,0.667
Seq_1014,0.0,0.875,0.625
Seq_1015,0.105,0.737,0.526
Seq_1016,0.154,0.923,0.846
Seq_1017,0.087,0.739,0.609
Seq_1018,0.071,0.786,0.643
Seq_1019,0.062,0.812,0.625
Seq_1020,0.031,0.688,0.375
Seq_1021,0.059,0.941,0.765
Seq_1022,0.056,0.722,0.611
Seq_1023,0.105,0.789,0.737
Seq_1024,0.044,0.8,0.444
Seq_1025,0.043,0.696,0.478
Seq_1026,0.065,0.674,0.5
Seq_1027,0.0,0.786,0.571
Seq_1028,0.0,0.75,0.607
Seq_1029,0.034,0.862,0.621
Seq_1030,0.043,0.826,0.522
Seq_1031,0.065,0.804,0.457
Seq_1032,0.043,0.826,0.478
Seq_1033,0.065,0.783,0.457
Seq_1034,0.065,0.848,0.457
Seq_1035,0.043,0.804,0.435
Seq_1036,0.074,0.593,0.333
Seq_1037,0.065,0.761,0.435
Seq_1038,0.176,0.794,0.735
Seq_1039,0.1,0.8,0.567
Seq_1040,0.083,0.667,0.556
Seq_1041,0.1,0.75,0.6
Seq_1042,0.0,0.818,0.515
Seq_1043,0.091,0.848,0.576
Seq_1044,0.094,0.812,0.469
Seq_1045,0.034,0.759,0.621
Seq_1046,0.154,0.769,0.615
Seq_1047,0.095,0.857,0.524
Seq_1048,0.1,0.95,0.75
Seq_1049,0.051,0.795,0.615
Seq_1050,0.036,0.714,0.571
Seq_1051,0.071,0.857,0.429
Seq_1052,0.083,0.833,0.667
Seq_1053,0.026,0.789,0.421
Seq_1054,0.214,0.786,0.643
Seq_1055,0.133,0.733,0.4
Seq_1056,0.062,0.75,0.438
Seq_1057,0.0,0.917,0.417
Seq_1058,0.13,0.783,0.435
Seq_1059,0.0,0.905,0.524
Seq_1060,0.0,0.905,0.476
Seq_1061,0.0,0.857,0.476
Seq_1062,0.0,0.905,0.524
Seq_1063,0.0,0.857,0.476
Seq_1064,0.081,0.676,0.432
Seq_1065,0.088,0.765,0.471
Seq_1066,0.167,0.778,0.611
Seq_1067,0.195,0.756,0.512
Seq_1068,0.125,0.775,0.525
Seq_1069,0.095,0.833,0.548
Seq_1070,0.067,0.778,0.533
Seq_1071,0.128,0.83,0.532
Seq_1072,0.0,0.533,0.267
Seq_1073,0.118,0.941,0.647
Seq_1074,0.143,0.762,0.571
Seq_1075,0.0,0.8,0.533
Seq_1076,0.085,0.702,0.426
Seq_1077,0.056,0.889,0.722
Seq_1078,0.172,0.759,0.483
Seq_1079,0.273,0.909,0.545
Seq_1080,0.083,0.833,0.75
Seq_1081,0.176,0.941,0.765
Seq_1082,0.143,0.857,0.714
Seq_1083,0.235,0.882,0.647
Seq_1084,0.083,0.833,0.75
Seq_1085,0.053,0.895,0.632
Seq_1086,0.036,0.821,0.536
Seq_1087,0.036,0.821,0.5
Seq_1088,0.115,0.846,0.577
Seq_1089,0.088,0.824,0.529
Seq_1090,0.109,0.709,0.145
Seq_1091,0.087,0.739,0.478
Seq_1092,0.047,0.744,0.535
Seq_1093,0.05,0.8,0.475
Seq_1094,0.05,0.825,0.475
Seq_1095,0.05,0.775,0.5
Seq_1096,0.05,0.825,0.525
Seq_1097,0.075,0.825,0.5
Seq_1098,0.075,0.8,0.525
Seq_1099,0.043,0.783,0.609
Seq_1100,0.025,0.775,0.55
Seq_1101,0.091,0.818,0.455
Seq_1102,0.07,0.721,0.535
Seq_1103,0.119,0.857,0.524
Seq_1104,0.171,0.732,0.366
Seq_1105,0.136,0.614,0.386
Seq_1106,0.088,0.647,0.412
Seq_1107,0.027,0.622,0.432
Seq_1108,0.125,0.75,0.4
Seq_1109,0.048,0.857,0.548
Seq_1110,0.056,0.694,0.5
Seq_1111,0.034,0.828,0.586
Seq_1112,0.083,0.833,0.667
Seq_1113,0.03,0.848,0.545
Seq_1114,0.0,0.879,0.545
Seq_1115,0.027,0.811,0.568
Seq_1116,0.118,0.882,0.647
Seq_1117,0.133,0.867,0.6
Seq_1118,0.043,0.652,0.435
Seq_1119,0.0,0.72,0.56
Seq_1120,0.0,0.68,0.48
Seq_1121,0.0,0.68,0.48
Seq_1122,0.0,0.72,0.52
Seq_1123,0.0,1.0,0.409
Seq_1124,0.034,0.414,0.172
Seq_1125,0.034,0.483,0.207
Seq_1126,0.0,0.72,0.56
Seq_1127,0.031,0.719,0.5
Seq_1128,0.0,0.714,0.536
Seq_1129,0.125,0.833,0.75
Seq_1130,0.083,0.833,0.75
Seq_1131,0.125,0.833,0.75
Seq_1132,0.125,0.875,0.75
Seq_1133,0.083,0.833,0.708
Seq_1134,0.083,0.792,0.708
Seq_1135,0.036,0.75,0.607
Seq_1136,0.065,0.717,0.457
Seq_1137,0.027,0.784,0.568
Seq_1138,0.0,0.848,0.515
Seq_1139,0.083,0.833,0.792
Seq_1140,0.083,0.875,0.792
Seq_1141,0.048,0.905,0.571
Seq_1142,0.048,0.905,0.571
Seq_1143,0.0,0.667,0.567
Seq_1144,0.091,0.788,0.515
Seq_1145,0.03,0.758,0.545
Seq_1146,0.061,0.788,0.545
Seq_1147,0.083,0.833,0.708
Seq_1148,0.154,0.846,0.692
Seq_1149,0.031,0.75,0.5
Seq_1150,0.083,0.833,0.75
Seq_1151,0.083,0.875,0.75
Seq_1152,0.125,0.833,0.75
Seq_1153,0.05,0.85,0.8
Seq_1154,0.1,0.85,0.8
Seq_1155,0.231,0.923,0.692
Seq_1156,0.083,0.833,0.708
Seq_1157,0.125,0.833,0.708
Seq_1158,0.077,0.923,0.769
Seq_1159,0.118,0.882,0.765
Seq_1160,0.05,0.95,0.8
Seq_1161,0.1,0.9,0.75
Seq_1162,0.05,0.9,0.75
Seq_1163,0.05,0.9,0.75
Seq_1164,0.1,0.85,0.8
Seq_1165,0.154,0.846,0.692
Seq_1166,0.214,0.786,0.786
Seq_1167,0.1,0.7,0.45
Seq_1168,0.043,0.783,0.522
Seq_1169,0.043,0.783,0.522
Seq_1170,0.043,0.783,0.522
Seq_1171,0.0,0.938,0.625
Seq_1172,0.067,0.667,0.533
Seq_1173,0.067,0.667,0.533
Seq_1174,0.067,0.667,0.533
Seq_1175,0.079,0.789,0.421
Seq_1176,0.068,0.841,0.409
Seq_1177,0.067,0.822,0.4
Seq_1178,0.182,0.818,0.545
Seq_1179,0.154,0.692,0.385
Seq_1180,0.139,0.694,0.389
Seq_1181,0.034,0.552,0.414
Seq_1182,0.054,0.838,0.568
Seq_1183,0.107,0.714,0.429
Seq_1184,0.022,0.674,0.435
Seq_1185,0.135,0.769,0.385
Seq_1186,0.302,0.887,0.075
Seq_1187,0.0,0.833,0.633
Seq_1188,0.0,0.381,0.19
Seq_1189,0.136,0.909,0.591
Seq_1190,0.154,0.846,0.846
Seq_1191,0.077,0.923,0.692
Seq_1192,0.054,0.757,0.514
Seq_1193,0.1,0.68,0.44
Seq_1194,0.143,0.619,0.429
Seq_1195,0.08,0.6,0.4
Seq_1196,0.03,0.909,0.606
Seq_1197,0.118,0.941,0.647
Seq_1198,0.132,0.717,0.528
Seq_1199,0.05,0.675,0.425
Seq_1200,0.067,0.8,0.6
Seq_1201,0.0,0.786,0.571
Seq_1202,0.231,0.692,0.654
Seq_1203,0.106,0.766,0.426
Seq_1204,0.065,0.71,0.387
Seq_1205,0.032,0.677,0.387
Seq_1206,0.065,0.71,0.419
Seq_1207,0.085,0.702,0.426
Seq_1208,0.136,0.682,0.5
Seq_1209,0.026,0.795,0.538
Seq_1210,0.143,0.619,0.405
Seq_1211,0.025,0.8,0.5
Seq_1212,0.12,0.68,0.52
Seq_1213,0.0,0.905,0.524
Seq_1214,0.0,0.952,0.524
Seq_1215,0.0,0.905,0.524
Seq_1216,0.0,0.905,0.524
Seq_1217,0.048,0.905,0.476
Seq_1218,0.048,0.667,0.524
Seq_1219,0.045,0.773,0.591
Seq_1220,0.161,0.613,0.548
Seq_1221,0.154,0.923,0.692
Seq_1222,0.222,0.833,0.667
Seq_1223,0.031,0.781,0.562
Seq_1224,0.0,0.842,0.632
Seq_1225,0.048,0.786,0.524
Seq_1226,0.091,0.891,0.636
Seq_1227,0.056,0.444,0.222
Seq_1228,0.068,0.682,0.432
Seq_1229,0.12,0.76,0.48
Seq_1230,0.128,0.809,0.574
Seq_1231,0.182,0.909,0.636
Seq_1232,0.137,0.667,0.392
Seq_1233,0.091,0.618,0.382
Seq_1234,0.053,0.632,0.386
Seq_1235,0.052,0.621,0.345
Seq_1236,0.026,0.744,0.487
Seq_1237,0.1,0.775,0.525
Seq_1238,0.174,0.87,0.609
Seq_1239,0.1,0.333,0.033
Seq_1240,0.083,0.208,0.042
Seq_1241,0.077,0.821,0.436
Seq_1242,0.033,0.967,0.6
Seq_1243,0.062,0.646,0.5
Seq_1244,0.098,0.745,0.549
Seq_1245,0.133,0.733,0.433
Seq_1246,0.067,0.833,0.433
Seq_1247,0.143,0.857,0.714
Seq_1248,0.083,0.667,0.333
Seq_1249,0.071,0.786,0.786
Seq_1250,0.018,0.807,0.596
Seq_1251,0.105,0.842,0.632
Seq_1252,0.059,0.824,0.412
Seq_1253,0.05,0.9,0.6
Seq_1254,0.103,0.828,0.414
Seq_1255,0.045,0.75,0.455
Seq_1256,0.044,0.711,0.467
Seq_1257,0.075,0.95,0.475
Seq_1258,0.075,0.95,0.475
Seq_1259,0.04,0.64,0.42
Seq_1260,0.108,0.757,0.486
Seq_1261,0.095,0.714,0.476
Seq_1262,0.067,0.711,0.422
Seq_1263,0.158,0.842,0.526
Seq_1264,0.105,0.842,0.526
Seq_1265,0.105,0.895,0.474
Seq_1266,0.158,0.842,0.526
Seq_1267,0.0,0.757,0.514
Seq_1268,0.062,0.646,0.5
Seq_1269,0.096,0.692,0.519
Seq_1270,0.158,0.842,0.632
Seq_1271,0.146,0.829,0.561
Seq_1272,0.048,0.905,0.667
Seq_1273,0.053,0.947,0.737
Seq_1274,0.081,0.919,0.514
Seq_1275,0.03,0.818,0.636
Seq_1276,0.03,0.818,0.636
Seq_1277,0.069,0.793,0.448
Seq_1278,0.167,0.833,0.5
Seq_1279,0.136,0.909,0.591
Seq_1280,0.065,0.742,0.548
Seq_1281,0.083,0.708,0.5
Seq_1282,0.032,0.806,0.484
Seq_1283,0.033,0.767,0.567
Seq_1284,0.083,1.0,0.583
Seq_1285,0.062,0.875,0.562
Seq_1286,0.152,0.818,0.576
Seq_1287,0.1,0.7,0.5
Seq_1288,0.107,0.893,0.571
Seq_1289,0.036,0.786,0.464
Seq_1290,0.088,0.824,0.529
Seq_1291,0.147,0.765,0.412
Seq_1292,0.026,0.763,0.579
Seq_1293,0.026,0.763,0.579
Seq_1294,0.053,0.763,0.605
Seq_1295,0.053,0.816,0.632
Seq_1296,0.026,0.763,0.579
Seq_1297,0.026,0.789,0.605
Seq_1298,0.026,0.737,0.579
Seq_1299,0.045,1.0,0.818
Seq_1300,0.125,0.458,0.458
Seq_1301,0.143,0.643,0.5
Seq_1302,0.071,0.786,0.571
Seq_1303,0.071,0.786,0.571
Seq_1304,0.059,0.706,0.529
Seq_1305,0.059,0.765,0.471
Seq_1306,0.059,0.765,0.529
Seq_1307,0.071,0.786,0.643
Seq_1308,0.071,0.714,0.643
Seq_1309,0.154,0.692,0.538
Seq_1310,0.067,0.833,0.533
Seq_1311,0.1,0.833,0.567
Seq_1312,0.098,0.805,0.439
Seq_1313,0.071,0.929,0.643
Seq_1314,0.1,0.8,0.6
Seq_1315,0.136,0.682,0.545
Seq_1316,0.119,0.619,0.381
Seq_1317,0.04,0.8,0.64
Seq_1318,0.04,0.76,0.64
Seq_1319,0.067,0.867,0.667
Seq_1320,0.022,0.717,0.457
Seq_1321,0.083,0.792,0.667
Seq_1322,0.056,0.833,0.556
Seq_1323,0.056,0.778,0.389
Seq_1324,0.125,0.812,0.531
Seq_1325,0.2,0.833,0.633
Seq_1326,0.2,0.767,0.6
Seq_1327,0.121,0.697,0.394
Seq_1328,0.125,0.719,0.406
Seq_1329,0.091,0.697,0.364
Seq_1330,0.094,0.719,0.375
Seq_1331,0.091,0.667,0.515
Seq_1332,0.094,0.688,0.531
Seq_1333,0.062,0.719,0.344
Seq_1334,0.233,0.833,0.633
Seq_1335,0.056,0.722,0.611
Seq_1336,0.111,0.778,0.667
Seq_1337,0.056,0.833,0.722
Seq_1338,0.0,0.778,0.667
Seq_1339,0.1,0.7,0.425
Seq_1340,0.095,0.714,0.452
Seq_1341,0.095,0.762,0.524
Seq_1342,0.043,0.957,0.609
Seq_1343,0.071,0.714,0.5
Seq_1344,0.0,0.8,0.533
Seq_1345,0.0,0.786,0.643
Seq_1346,0.08,0.76,0.64
Seq_1347,0.069,0.707,0.448
Seq_1348,0.1,0.82,0.46
Seq_1349,0.064,0.681,0.426
Seq_1350,0.12,0.82,0.44
Seq_1351,0.1,0.82,0.46
Seq_1352,0.1,0.8,0.48
Seq_1353,0.1,0.82,0.48
Seq_1354,0.1,0.82,0.46
Seq_1355,0.1,0.8,0.48
Seq_1356,0.1,0.74,0.42
Seq_1357,0.1,0.74,0.42
Seq_1358,0.059,0.882,0.529
Seq_1359,0.083,0.875,0.625
Seq_1360,0.04,0.8,0.64
Seq_1361,0.045,0.636,0.409
Seq_1362,0.043,0.717,0.457
Seq_1363,0.022,0.696,0.457
Seq_1364,0.027,0.784,0.595
Seq_1365,0.034,0.759,0.586
Seq_1366,0.03,0.848,0.576
Seq_1367,0.061,0.848,0.576
Seq_1368,0.0,0.879,0.545
Seq_1369,0.095,0.905,0.619
Seq_1370,0.048,0.905,0.619
Seq_1371,0.062,0.875,0.625
Seq_1372,0.125,0.875,0.562
Seq_1373,0.054,0.811,0.568
Seq_1374,0.054,0.838,0.595
Seq_1375,0.125,0.688,0.375
Seq_1376,0.031,0.719,0.562
Seq_1377,0.143,0.643,0.429
Seq_1378,0.042,0.875,0.792
Seq_1379,0.042,0.875,0.792
Seq_1380,0.083,0.833,0.792
Seq_1381,0.158,0.842,0.526
Seq_1382,0.077,1.0,0.692
Seq_1383,0.077,0.923,0.769
Seq_1384,0.143,0.786,0.643
Seq_1385,0.111,0.778,0.389
Seq_1386,0.1,0.8,0.4
Seq_1387,0.037,0.815,0.519
Seq_1388,0.074,0.815,0.519
Seq_1389,0.04,0.8,0.48
Seq_1390,0.037,0.778,0.481
Seq_1391,0.111,0.815,0.556
Seq_1392,0.04,0.8,0.48
Seq_1393,0.037,0.778,0.519
Seq_1394,0.0,0.9,0.6
Seq_1395,0.037,0.815,0.519
Seq_1396,0.037,0.815,0.519
Seq_1397,0.0,0.864,0.591
Seq_1398,0.148,0.815,0.556
Seq_1399,0.0,0.8,0.48
Seq_1400,0.037,0.852,0.556
Seq_1401,0.0,0.9,0.6
Seq_1402,0.077,1.0,0.692
Seq_1403,0.188,0.75,0.625
Seq_1404,0.188,0.75,0.625
Seq_1405,0.125,0.719,0.5
Seq_1406,0.103,0.759,0.621
Seq_1407,0.054,0.703,0.541
Seq_1408,0.077,0.788,0.519
Seq_1409,0.064,0.83,0.468
Seq_1410,0.189,0.73,0.432
Seq_1411,0.162,0.703,0.405
Seq_1412,0.065,0.717,0.435
Seq_1413,0.122,0.829,0.439
Seq_1414,0.103,0.828,0.483
Seq_1415,0.027,0.595,0.243
Seq_1416,0.186,0.814,0.419
Seq_1417,0.111,0.833,0.5
Seq_1418,0.154,0.846,0.385
Seq_1419,0.143,0.857,0.5
Seq_1420,0.2,0.9,0.6
Seq_1421,0.054,0.703,0.351
Seq_1422,0.15,0.6,0.5
Seq_1423,0.176,0.588,0.529
Seq_1424,0.0,0.824,0.765
Seq_1425,0.16,0.8,0.44
Seq_1426,0.16,0.82,0.44
Seq_1427,0.067,0.867,0.567
Seq_1428,0.1,0.767,0.467
Seq_1429,0.069,0.897,0.655
Seq_1430,0.067,0.867,0.6
Seq_1431,0.0,0.667,0.583
Seq_1432,0.034,0.759,0.586
Seq_1433,0.034,0.759,0.586
Seq_1434,0.034,0.759,0.586
Seq_1435,0.048,0.905,0.571
Seq_1436,0.042,0.875,0.75
Seq_1437,0.034,0.931,0.621
Seq_1438,0.067,0.9,0.667
Seq_1439,0.056,0.778,0.611
Seq_1440,0.056,0.778,0.611
Seq_1441,0.14,0.86,0.465
Seq_1442,0.1,0.775,0.55
Seq_1443,0.125,0.75,0.475
Seq_1444,0.105,0.895,0.684
Seq_1445,0.133,0.8,0.6
Seq_1446,0.073,0.854,0.61
Seq_1447,0.143,0.881,0.619
Seq_1448,0.056,0.722,0.5
Seq_1449,0.083,0.611,0.417
Seq_1450,0.083,0.611,0.417
Seq_1451,0.0,0.618,0.382
Seq_1452,0.091,0.773,0.455
Seq_1453,0.0,0.818,0.636
Seq_1454,0.1,0.667,0.533
Seq_1455,0.034,0.931,0.655
Seq_1456,0.034,0.931,0.621
Seq_1457,0.065,0.871,0.548
Seq_1458,0.067,0.9,0.533
Seq_1459,0.065,0.903,0.548
Seq_1460,0.065,0.903,0.548
Seq_1461,0.065,0.903,0.548
Seq_1462,0.067,0.833,0.567
Seq_1463,0.125,0.812,0.604
Seq_1464,0.12,0.82,0.4
Seq_1465,0.098,0.804,0.471
Seq_1466,0.12,0.8,0.42
Seq_1467,0.098,0.784,0.471
Seq_1468,0.083,0.833,0.667
Seq_1469,0.083,0.833,0.667
Seq_1470,0.083,0.875,0.792
Seq_1471,0.087,0.826,0.652
Seq_1472,0.111,0.667,0.611
Seq_1473,0.083,0.792,0.625
Seq_1474,0.083,0.833,0.625
Seq_1475,0.083,0.792,0.667
Seq_1476,0.083,0.792,0.667
Seq_1477,0.083,0.875,0.667
Seq_1478,0.083,0.792,0.667
Seq_1479,0.083,0.792,0.667
Seq_1480,0.083,0.875,0.875
Seq_1481,0.087,0.826,0.652
Seq_1482,0.03,0.848,0.576
Seq_1483,0.03,0.848,0.576
Seq_1484,0.03,0.818,0.576
Seq_1485,0.03,0.848,0.545
Seq_1486,0.03,0.879,0.545
Seq_1487,0.0,0.848,0.545
Seq_1488,0.0,0.818,0.515
Seq_1489,0.0,0.848,0.515
Seq_1490,0.2,0.8,0.533
Seq_1491,0.0,0.848,0.545
Seq_1492,0.0,0.848,0.576
Seq_1493,0.0,0.879,0.515
Seq_1494,0.03,0.848,0.545
Seq_1495,0.0,0.818,0.515
Seq_1496,0.0,0.848,0.576
Seq_1497,0.154,0.615,0.385
Seq_1498,0.061,0.788,0.545
Seq_1499,0.061,0.788,0.545
Seq_1500,0.0,0.818,0.485
Seq_1501,0.0,0.818,0.485
Seq_1502,0.0,0.788,0.515
Seq_1503,0.065,0.717,0.478
Seq_1504,0.065,0.696,0.435
Seq_1505,0.065,0.696,0.478
Seq_1506,0.065,0.696,0.5
Seq_1507,0.065,0.717,0.478
Seq_1508,0.176,0.765,0.706
Seq_1509,0.043,0.717,0.457
Seq_1510,0.176,0.765,0.706
Seq_1511,0.043,0.717,0.457
Seq_1512,0.043,0.717,0.457
Seq_1513,0.043,0.717,0.457
Seq_1514,0.027,0.784,0.595
Seq_1515,0.027,0.757,0.568
Seq_1516,0.034,0.828,0.586
Seq_1517,0.1,0.85,0.6
Seq_1518,0.027,0.784,0.568
Seq_1519,0.027,0.811,0.568
Seq_1520,0.027,0.784,0.568
Seq_1521,0.027,0.784,0.568
Seq_1522,0.15,0.8,0.5
Seq_1523,0.0,0.905,0.524
Seq_1524,0.048,0.81,0.524
Seq_1525,0.048,0.857,0.571
Seq_1526,0.0,0.905,0.524
Seq_1527,0.0,0.952,0.571
Seq_1528,0.0,0.952,0.571
Seq_1529,0.1,0.85,0.65
Seq_1530,0.0,0.905,0.524
Seq_1531,0.0,0.905,0.524
Seq_1532,0.0,0.857,0.524
Seq_1533,0.0,0.952,0.524
Seq_1534,0.062,0.812,0.375
Seq_1535,0.034,0.759,0.552
Seq_1536,0.034,0.759,0.621
Seq_1537,0.034,0.724,0.517
Seq_1538,0.034,0.759,0.621
Seq_1539,0.25,0.625,0.375
Seq_1540,0.167,0.667,0.625
Seq_1541,0.176,0.706,0.529
Seq_1542,0.083,0.875,0.75
Seq_1543,0.083,0.833,0.625
Seq_1544,0.03,0.788,0.576
Seq_1545,0.03,0.788,0.576
Seq_1546,0.021,0.729,0.104
Seq_1547,0.143,0.857,0.786
Seq_1548,0.083,0.917,0.75
Seq_1549,0.037,0.852,0.481
Seq_1550,0.074,0.889,0.519
Seq_1551,0.074,0.852,0.519
Seq_1552,0.074,0.852,0.519
Seq_1553,0.059,0.882,0.529
Seq_1554,0.0,0.882,0.588
Seq_1555,0.0,0.882,0.647
Seq_1556,0.05,0.75,0.6
Seq_1557,0.158,0.842,0.579
Seq_1558,0.105,0.842,0.526
Seq_1559,0.15,0.9,0.55
Seq_1560,0.15,0.85,0.6
Seq_1561,0.158,0.842,0.632
Seq_1562,0.176,0.824,0.588
Seq_1563,0.2,0.833,0.533
Seq_1564,0.065,0.774,0.516
Seq_1565,0.0,0.412,0.324
Seq_1566,0.111,0.556,0.4
Seq_1567,0.182,0.909,0.636
Seq_1568,0.077,0.923,0.769
Seq_1569,0.083,0.75,0.5
Seq_1570,0.083,0.667,0.5
Seq_1571,0.059,0.941,0.765
Seq_1572,0.071,0.714,0.571
Seq_1573,0.043,0.913,0.609
Seq_1574,0.061,0.758,0.455
Seq_1575,0.061,0.758,0.455
Seq_1576,0.054,0.784,0.541
Seq_1577,0.054,0.784,0.514
Seq_1578,0.062,0.938,0.625
Seq_1579,0.188,0.938,0.688
Seq_1580,0.125,0.938,0.625
Seq_1581,0.25,0.938,0.75
Seq_1582,0.062,0.938,0.562
Seq_1583,0.154,0.923,0.692
Seq_1584,0.231,0.923,0.769
Seq_1585,0.053,0.789,0.526
Seq_1586,0.211,0.737,0.579
Seq_1587,0.062,0.875,0.625
Seq_1588,0.062,0.688,0.5
Seq_1589,0.095,0.714,0.429
Seq_1590,0.065,0.742,0.516
Seq_1591,0.083,0.833,0.75
Seq_1592,0.083,0.833,0.708
Seq_1593,0.083,0.833,0.75
Seq_1594,0.0,0.697,0.545
Seq_1595,0.0,0.697,0.545
Seq_1596,0.0,0.727,0.545
Seq_1597,0.059,0.941,0.765
Seq_1598,0.235,0.882,0.706
Seq_1599,0.048,0.857,0.762
Seq_1600,0.095,0.81,0.714
Seq_1601,0.12,0.84,0.46
Seq_1602,0.077,0.769,0.615
Seq_1603,0.0,0.706,0.529
Seq_1604,0.0,0.667,0.556
Seq_1605,0.143,0.857,0.786
Seq_1606,0.0,0.857,0.643
Seq_1607,0.125,0.833,0.75
Seq_1608,0.083,0.833,0.75
Seq_1609,0.122,0.796,0.469
Seq_1610,0.0,0.69,0.552
Seq_1611,0.069,0.793,0.621
Seq_1612,0.0,0.786,0.643
Seq_1613,0.036,0.786,0.643
Seq_1614,0.0,0.786,0.643
Seq_1615,0.0,1.0,0.579
Seq_1616,0.0,0.85,0.6
Seq_1617,0.0,0.939,0.636
Seq_1618,0.111,0.852,0.667
Seq_1619,0.077,0.808,0.596
Seq_1620,0.238,0.857,0.333
Seq_1621,0.167,0.778,0.556
Seq_1622,0.023,0.791,0.535
Seq_1623,0.167,0.944,0.667
Seq_1624,0.154,0.846,0.692
Seq_1625,0.132,0.737,0.474
Seq_1626,0.231,0.923,0.615
Seq_1627,0.091,0.795,0.5
Seq_1628,0.024,0.738,0.571
Seq_1629,0.143,0.893,0.571
Seq_1630,0.065,0.839,0.548
Seq_1631,0.2,0.8,0.56
Seq_1632,0.103,0.897,0.655
Seq_1633,0.062,0.938,0.656
Seq_1634,0.103,0.931,0.655
Seq_1635,0.071,0.893,0.679
Seq_1636,0.069,0.897,0.621
Seq_1637,0.138,0.862,0.483
Seq_1638,0.107,0.857,0.571
Seq_1639,0.171,0.927,0.537
Seq_1640,0.111,0.815,0.519
Seq_1641,0.037,0.815,0.556
Seq_1642,0.037,0.852,0.556
Seq_1643,0.056,0.889,0.5
Seq_1644,0.0,0.864,0.682
Seq_1645,0.091,0.727,0.591
Seq_1646,0.12,0.8,0.6
Seq_1647,0.08,0.8,0.56
Seq_1648,0.0,0.84,0.56
Seq_1649,0.0,0.917,0.583
Seq_1650,0.0,1.0,0.533
Seq_1651,0.0,0.84,0.48
Seq_1652,0.0,0.84,0.48
Seq_1653,0.04,0.8,0.64
Seq_1654,0.056,0.833,0.611
Seq_1655,0.062,0.719,0.5
Seq_1656,0.062,0.875,0.562
Seq_1657,0.048,0.667,0.476
Seq_1658,0.065,0.774,0.484
Seq_1659,0.0,0.938,0.688
Seq_1660,0.125,0.833,0.792
Seq_1661,0.231,0.846,0.615
Seq_1662,0.118,0.824,0.824
Seq_1663,0.082,0.755,0.449
Seq_1664,0.078,0.647,0.412
Seq_1665,0.085,0.678,0.407
Seq_1666,0.214,0.786,0.5
Seq_1667,0.214,0.857,0.5
Seq_1668,0.125,0.75,0.625
Seq_1669,0.182,0.636,0.455
Seq_1670,0.026,0.718,0.513
Seq_1671,0.049,0.707,0.512
Seq_1672,0.049,0.61,0.244
Seq_1673,0.08,0.72,0.48
Seq_1674,0.091,0.727,0.5
Seq_1675,0.044,0.778,0.467
Seq_1676,0.044,0.756,0.489
Seq_1677,0.0,0.484,0.194
Seq_1678,0.083,0.875,0.792
Seq_1679,0.083,0.833,0.792
Seq_1680,0.048,0.857,0.524
Seq_1681,0.048,0.857,0.524
Seq_1682,0.111,0.75,0.417
Seq_1683,0.13,0.696,0.565
Seq_1684,0.13,0.696,0.565
Seq_1685,0.033,0.967,0.5
Seq_1686,0.0,0.955,0.909
Seq_1687,0.087,0.739,0.304
Seq_1688,0.154,0.923,0.692
Seq_1689,0.231,0.923,0.692
Seq_1690,0.154,0.923,0.692
Seq_1691,0.081,0.757,0.541
Seq_1692,0.065,0.742,0.516
Seq_1693,0.083,0.833,0.75
Seq_1694,0.083,0.833,0.75
Seq_1695,0.042,0.875,0.708
Seq_1696,0.083,0.833,0.708
Seq_1697,0.083,0.833,0.75
Seq_1698,0.029,0.794,0.559
Seq_1699,0.161,0.742,0.613
Seq_1700,0.051,0.627,0.356
Seq_1701,0.069,0.69,0.448
Seq_1702,0.097,0.71,0.516
Seq_1703,0.182,0.727,0.545
Seq_1704,0.04,0.76,0.6
Seq_1705,0.235,0.941,0.765
Seq_1706,0.083,0.833,0.708
Seq_1707,0.042,0.833,0.708
Seq_1708,0.0,0.697,0.545
Seq_1709,0.0,0.697,0.515
Seq_1710,0.081,0.757,0.486
Seq_1711,0.0,0.75,0.536
Seq_1712,0.0,0.75,0.571
Seq_1713,0.083,0.833,0.792
Seq_1714,0.083,0.833,0.792
Seq_1715,0.158,0.842,0.789
Seq_1716,0.028,0.917,0.556
Seq_1717,0.118,0.941,0.706
Seq_1718,0.143,0.857,0.476
Seq_1719,0.105,0.789,0.526
Seq_1720,0.0,0.737,0.474
Seq_1721,0.214,0.786,0.5
Seq_1722,0.231,0.769,0.538
Seq_1723,0.154,0.923,0.615
Seq_1724,0.154,0.923,0.615
Seq_1725,0.087,0.696,0.435
Seq_1726,0.08,0.6,0.44
Seq_1727,0.091,0.682,0.5
Seq_1728,0.095,0.667,0.476
Seq_1729,0.087,0.696,0.435
Seq_1730,0.0,0.923,0.615
Seq_1731,0.094,0.656,0.438
Seq_1732,0.077,0.615,0.538
Seq_1733,0.065,0.742,0.548
Seq_1734,0.091,0.727,0.409
Seq_1735,0.12,0.8,0.52
Seq_1736,0.136,0.773,0.455
Seq_1737,0.079,0.763,0.474
Seq_1738,0.1,0.7,0.55
Seq_1739,0.048,0.905,0.714
Seq_1740,0.136,0.955,0.591
Seq_1741,0.118,0.824,0.765
Seq_1742,0.16,0.8,0.6
Seq_1743,0.0,0.763,0.526
Seq_1744,0.16,0.76,0.48
Seq_1745,0.071,0.893,0.607
Seq_1746,0.125,1.0,0.812
Seq_1747,0.0,0.679,0.17
Seq_1748,0.0,0.944,0.722
Seq_1749,0.0,0.944,0.667
Seq_1750,0.032,0.742,0.484
Seq_1751,0.083,0.75,0.583
Seq_1752,0.0,0.68,0.64
Seq_1753,0.0,0.68,0.64
Seq_1754,0.07,0.535,0.395
Seq_1755,0.114,0.8,0.0
Seq_1756,0.08,0.68,0.48
Seq_1757,0.036,0.75,0.536
Seq_1758,0.083,0.917,0.5
Seq_1759,0.081,0.919,0.514
Seq_1760,0.0,0.944,0.778
Seq_1761,0.158,0.789,0.579
Seq_1762,0.158,0.789,0.632
Seq_1763,0.211,0.789,0.632
Seq_1764,0.034,0.621,0.483
Seq_1765,0.154,0.615,0.231
Seq_1766,0.12,0.76,0.46
Seq_1767,0.03,0.818,0.636
Seq_1768,0.095,0.762,0.524
Seq_1769,0.029,0.735,0.5
Seq_1770,0.143,0.786,0.5
Seq_1771,0.154,0.923,0.615
Seq_1772,0.154,0.923,0.615
Seq_1773,0.231,0.923,0.692
Seq_1774,0.231,0.923,0.692
Seq_1775,0.231,0.846,0.615
Seq_1776,0.158,0.842,0.632
Seq_1777,0.086,0.886,0.629
Seq_1778,0.048,0.905,0.714
Seq_1779,0.154,0.923,0.692
Seq_1780,0.0,1.0,0.692
Seq_1781,0.0,0.767,0.567
Seq_1782,0.14,0.721,0.419
Seq_1783,0.125,0.542,0.458
Seq_1784,0.017,0.78,0.644
Seq_1785,0.053,0.895,0.316
Seq_1786,0.0,0.545,0.436
Seq_1787,0.114,0.75,0.341
Seq_1788,0.118,0.941,0.588
Seq_1789,0.118,0.941,0.647
Seq_1790,0.122,0.659,0.317
Seq_1791,0.211,0.789,0.474
Seq_1792,0.222,0.611,0.389
Seq_1793,0.077,0.615,0.346
Seq_1794,0.025,0.8,0.5
Seq_1795,0.048,0.667,0.476
Seq_1796,0.062,0.875,0.562
Seq_1797,0.123,0.614,0.368
Seq_1798,0.113,0.811,0.547
Seq_1799,0.227,0.841,0.636
Seq_1800,0.091,0.909,0.636
Seq_1801,0.133,0.667,0.433
Seq_1802,0.227,0.818,0.568
Seq_1803,0.062,0.906,0.594
Seq_1804,0.186,0.744,0.535
Seq_1805,0.065,0.806,0.484
Seq_1806,0.077,0.731,0.615
Seq_1807,0.077,0.923,0.615
Seq_1808,0.077,0.769,0.538
Seq_1809,0.087,0.87,0.696
Seq_1810,0.038,0.846,0.692
Seq_1811,0.065,0.742,0.548
Seq_1812,0.077,0.885,0.769
Seq_1813,0.0,0.742,0.516
Seq_1814,0.062,0.875,0.812
Seq_1815,0.067,0.8,0.7
Seq_1816,0.043,0.826,0.609
Seq_1817,0.235,0.941,0.765
Seq_1818,0.077,0.923,0.692
Seq_1819,0.077,0.923,0.615
Seq_1820,0.077,0.923,0.692
Seq_1821,0.108,0.757,0.514
Seq_1822,0.033,0.8,0.5
Seq_1823,0.042,0.833,0.792
Seq_1824,0.125,0.833,0.75
Seq_1825,0.0,0.727,0.515
Seq_1826,0.0,0.818,0.576
Seq_1827,0.033,0.833,0.533
Seq_1828,0.074,0.815,0.556
Seq_1829,0.037,0.815,0.556
Seq_1830,0.083,0.792,0.667
Seq_1831,0.0,0.889,0.5
Seq_1832,0.087,0.739,0.435
Seq_1833,0.12,0.88,0.48
Seq_1834,0.083,0.833,0.625
Seq_1835,0.08,0.8,0.52
Seq_1836,0.08,0.8,0.52
Seq_1837,0.04,0.88,0.52
Seq_1838,0.12,0.8,0.48
Seq_1839,0.062,0.812,0.688
Seq_1840,0.045,0.864,0.682
Seq_1841,0.0,0.75,0.667
Seq_1842,0.167,0.75,0.667
Seq_1843,0.033,0.767,0.5
Seq_1844,0.0,0.758,0.545
Seq_1845,0.03,0.758,0.576
Seq_1846,0.021,0.66,0.383
Seq_1847,0.108,0.757,0.514
Seq_1848,0.097,0.742,0.484
Seq_1849,0.077,0.923,0.692
Seq_1850,0.067,0.833,0.6
Seq_1851,0.0,0.8,0.4
Seq_1852,0.042,0.792,0.625
Seq_1853,0.0,0.724,0.586
Seq_1854,0.0,0.724,0.586
Seq_1855,0.074,0.778,0.556
Seq_1856,0.12,0.76,0.56
Seq_1857,0.074,0.778,0.556
Seq_1858,0.08,0.8,0.6
Seq_1859,0.043,0.783,0.652
Seq_1860,0.043,0.783,0.652
Seq_1861,0.042,0.833,0.667
Seq_1862,0.069,0.759,0.517
Seq_1863,0.074,0.778,0.556
Seq_1864,0.148,0.778,0.444
Seq_1865,0.135,0.865,0.514
Seq_1866,0.139,0.833,0.583
Seq_1867,0.136,0.636,0.364
Seq_1868,0.188,0.844,0.344
Seq_1869,0.065,0.839,0.613
Seq_1870,0.065,0.871,0.677
Seq_1871,0.065,0.839,0.581
Seq_1872,0.033,0.767,0.5
Seq_1873,0.023,0.535,0.256
Seq_1874,0.179,0.872,0.538
Seq_1875,0.059,0.725,0.529
Seq_1876,0.044,0.711,0.467
Seq_1877,0.154,0.769,0.538
Seq_1878,0.231,0.923,0.538
Seq_1879,0.0,0.793,0.655
Seq_1880,0.043,0.804,0.565
Seq_1881,0.0,0.87,0.478
Seq_1882,0.0,0.692,0.538
Seq_1883,0.0,0.9,0.75
Seq_1884,0.0,0.9,0.75
Seq_1885,0.0,0.976,0.143
Seq_1886,0.077,0.615,0.308
Seq_1887,0.045,0.682,0.273
Seq_1888,0.05,0.75,0.45
Seq_1889,0.071,0.786,0.643
Seq_1890,0.167,0.889,0.667
Seq_1891,0.176,1.0,0.706
Seq_1892,0.106,0.638,0.426
Seq_1893,0.045,0.795,0.636
Seq_1894,0.065,0.871,0.677
Seq_1895,0.0,0.769,0.692
Seq_1896,0.0,0.786,0.714
Seq_1897,0.0,0.786,0.714
Seq_1898,0.0,0.786,0.714
Seq_1899,0.0,0.786,0.714
Seq_1900,0.077,0.846,0.615
Seq_1901,0.077,0.923,0.692
Seq_1902,0.091,0.909,0.636
Seq_1903,0.083,0.833,0.667
Seq_1904,0.17,0.774,0.189
Seq_1905,0.0,0.682,0.477
Seq_1906,0.0,0.875,0.562
Seq_1907,0.0,0.875,0.562
Seq_1908,0.062,0.688,0.438
Seq_1909,0.071,0.464,0.25
Seq_1910,0.069,0.828,0.483
Seq_1911,0.0,0.857,0.619
Seq_1912,0.0,0.789,0.421
Seq_1913,0.0,0.895,0.684
Seq_1914,0.138,0.759,0.483
Seq_1915,0.059,0.647,0.471
Seq_1916,0.056,0.833,0.611
Seq_1917,0.263,0.737,0.632
Seq_1918,0.0,0.714,0.429
Seq_1919,0.143,0.5,0.286
Seq_1920,0.065,0.935,0.742
Seq_1921,0.143,0.857,0.667
Seq_1922,0.123,0.877,0.509
Seq_1923,0.22,0.854,0.585
Seq_1924,0.115,0.808,0.654
Seq_1925,0.14,0.93,0.419
Seq_1926,0.143,0.786,0.5
Seq_1927,0.154,0.615,0.308
Seq_1928,0.192,0.692,0.269
Seq_1929,0.145,0.745,0.509
Seq_1930,0.163,0.816,0.429
Seq_1931,0.083,1.0,0.583
Seq_1932,0.15,0.75,0.65
Seq_1933,0.143,0.929,0.786
Seq_1934,0.04,0.8,0.44
Seq_1935,0.043,0.87,0.739
Seq_1936,0.043,0.87,0.696
Seq_1937,0.032,0.742,0.581
Seq_1938,0.143,0.81,0.714
Seq_1939,0.056,0.889,0.667
Seq_1940,0.062,0.875,0.625
Seq_1941,0.064,0.617,0.404
Seq_1942,0.206,0.559,0.471
Seq_1943,0.147,0.559,0.5
Seq_1944,0.054,0.649,0.459
Seq_1945,0.085,0.681,0.426
Seq_1946,0.182,0.818,0.545
Seq_1947,0.154,0.615,0.615
Seq_1948,0.062,0.875,0.75
Seq_1949,0.044,0.889,0.578
Seq_1950,0.145,0.727,0.491
Seq_1951,0.148,0.778,0.63
Seq_1952,0.182,0.682,0.455
Seq_1953,0.15,0.65,0.45
Seq_1954,0.0,1.0,0.857
Seq_1955,0.018,0.825,0.561
Seq_1956,0.12,0.8,0.44
Seq_1957,0.154,0.654,0.346
Seq_1958,0.062,0.75,0.5
Seq_1959,0.118,0.882,0.529
Seq_1960,0.087,0.739,0.435
Seq_1961,0.062,0.667,0.396
Seq_1962,0.132,0.789,0.421
Seq_1963,0.105,0.684,0.447
Seq_1964,0.143,0.679,0.536
Seq_1965,0.091,0.727,0.424
Seq_1966,0.062,0.875,0.688
Seq_1967,0.118,0.941,0.765
Seq_1968,0.176,0.941,0.824
Seq_1969,0.042,0.833,0.667
Seq_1970,0.083,0.833,0.625
Seq_1971,0.042,0.833,0.667
Seq_1972,0.083,0.833,0.625
Seq_1973,0.0,0.848,0.515
Seq_1974,0.0,0.771,0.486
Seq_1975,0.154,0.923,0.692
Seq_1976,0.083,0.833,0.75
Seq_1977,0.083,0.833,0.75
Seq_1978,0.03,0.758,0.576
Seq_1979,0.118,0.765,0.765
Seq_1980,0.065,0.742,0.484
Seq_1981,0.069,0.759,0.586
Seq_1982,0.0,0.793,0.586
Seq_1983,0.054,0.784,0.514
Seq_1984,0.03,0.879,0.576
Seq_1985,0.029,0.4,0.229
Seq_1986,0.115,0.808,0.538
Seq_1987,0.091,0.864,0.591
Seq_1988,0.109,0.826,0.478
Seq_1989,0.13,0.739,0.435
Seq_1990,0.071,0.786,0.5
Seq_1991,0.13,0.739,0.435
Seq_1992,0.0,0.857,0.571
Seq_1993,0.071,0.786,0.464
Seq_1994,0.071,0.75,0.464
Seq_1995,0.071,0.857,0.643
Seq_1996,0.071,0.786,0.643
Seq_1997,0.037,0.815,0.556
Seq_1998,0.12,0.76,0.48
Seq_1999,0.08,0.88,0.52
Seq_2000,0.04,0.8,0.48
Seq_2001,0.0,0.857,0.571
Seq_2002,0.105,0.947,0.684
Seq_2003,0.105,0.947,0.684
Seq_2004,0.025,0.775,0.5
Seq_2005,0.051,0.692,0.513
Seq_2006,0.025,0.75,0.5
Seq_2007,0.05,0.75,0.5
Seq_2008,0.025,0.75,0.5
Seq_2009,0.025,0.75,0.475
Seq_2010,0.0,0.75,0.475
Seq_2011,0.05,0.75,0.5
Seq_2012,0.025,0.825,0.5
Seq_2013,0.088,0.706,0.559
Seq_2014,0.088,0.765,0.471
Seq_2015,0.062,0.781,0.469
Seq_2016,0.021,0.532,0.34
Seq_2017,0.026,0.462,0.333
Seq_2018,0.047,0.721,0.512
Seq_2019,0.048,0.714,0.5
Seq_2020,0.082,0.714,0.327
Seq_2021,0.2,0.56,0.44
Seq_2022,0.125,0.75,0.562
Seq_2023,0.114,0.771,0.657
Seq_2024,0.158,0.684,0.474
Seq_2025,0.073,0.805,0.512
Seq_2026,0.098,0.784,0.471
Seq_2027,0.038,0.769,0.519
Seq_2028,0.154,0.885,0.577
Seq_2029,0.167,0.889,0.611
Seq_2030,0.15,0.95,0.65
Seq_2031,0.1,0.95,0.7
Seq_2032,0.14,0.78,0.52
Seq_2033,0.114,0.841,0.591
Seq_2034,0.176,0.941,0.647
Seq_2035,0.025,0.5,0.325
Seq_2036,0.057,0.717,0.302
Seq_2037,0.079,0.632,0.289
Seq_2038,0.094,0.594,0.312
Seq_2039,0.04,0.74,0.32
Seq_2040,0.125,0.875,0.625
Seq_2041,0.071,0.714,0.5
Seq_2042,0.233,0.733,0.367
Seq_2043,0.15,0.8,0.5
Seq_2044,0.05,0.7,0.55
Seq_2045,0.093,0.744,0.488
Seq_2046,0.125,0.792,0.583
Seq_2047,0.077,0.692,0.538
Seq_2048,0.08,0.76,0.56
Seq_2049,0.065,0.452,0.226
Seq_2050,0.154,0.923,0.692
Seq_2051,0.034,0.707,0.431
Seq_2052,0.105,0.842,0.737
Seq_2053,0.13,0.826,0.739
Seq_2054,0.091,0.818,0.727
Seq_2055,0.174,0.826,0.739
Seq_2056,0.048,0.857,0.714
Seq_2057,0.1,0.6,0.5
Seq_2058,0.0,0.692,0.538
Seq_2059,0.065,0.903,0.613
Seq_2060,0.081,0.73,0.378
Seq_2061,0.026,1.0,0.658
Seq_2062,0.077,0.846,0.538
Seq_2063,0.114,0.857,0.4
Seq_2064,0.048,0.929,0.619
Seq_2065,0.048,0.929,0.619
Seq_2066,0.048,0.905,0.619
Seq_2067,0.158,0.658,0.395
Seq_2068,0.162,0.73,0.432
Seq_2069,0.079,0.763,0.395
Seq_2070,0.058,0.731,0.423
Seq_2071,0.079,0.789,0.395
Seq_2072,0.08,0.68,0.48
Seq_2073,0.235,0.941,0.647
Seq_2074,0.071,0.857,0.786
Seq_2075,0.071,0.929,0.714
Seq_2076,0.04,0.72,0.52
Seq_2077,0.031,0.719,0.438
Seq_2078,0.031,0.719,0.438
Seq_2079,0.057,1.0,0.629
Seq_2080,0.105,0.895,0.737
Seq_2081,0.12,0.84,0.48
Seq_2082,0.098,0.829,0.585
Seq_2083,0.0,0.905,0.524
Seq_2084,0.0,0.905,0.524
Seq_2085,0.167,0.833,0.75
Seq_2086,0.08,0.88,0.76
Seq_2087,0.083,0.833,0.667
Seq_2088,0.061,0.788,0.545
Seq_2089,0.167,0.833,0.708
Seq_2090,0.083,0.875,0.792
Seq_2091,0.065,0.717,0.478
Seq_2092,0.065,0.717,0.478
Seq_2093,0.065,0.696,0.457
Seq_2094,0.093,0.767,0.465
Seq_2095,0.093,0.767,0.465
Seq_2096,0.0,0.706,0.529
Seq_2097,0.0,0.5,0.417
Seq_2098,0.0,0.571,0.429
Seq_2099,0.091,0.545,0.364
Seq_2100,0.118,0.647,0.412
Seq_2101,0.029,0.857,0.543
Seq_2102,0.2,0.65,0.55
Seq_2103,0.163,0.884,0.488
Seq_2104,0.042,0.75,0.458
Seq_2105,0.026,0.718,0.462
Seq_2106,0.029,0.714,0.429
Seq_2107,0.048,0.667,0.476
Seq_2108,0.286,0.857,0.714
Seq_2109,0.214,0.786,0.714
Seq_2110,0.333,0.667,0.611
Seq_2111,0.389,0.778,0.722
Seq_2112,0.286,0.857,0.786
Seq_2113,0.286,0.857,0.714
Seq_2114,0.286,0.857,0.714
Seq_2115,0.13,0.609,0.391
Seq_2116,0.154,0.808,0.5
Seq_2117,0.065,0.826,0.565
Seq_2118,0.07,0.721,0.535
Seq_2119,0.143,0.857,0.543
Seq_2120,0.115,0.808,0.462
Seq_2121,0.083,0.917,0.667
Seq_2122,0.132,0.789,0.421
Seq_2123,0.034,0.931,0.621
Seq_2124,0.094,0.875,0.562
Seq_2125,0.065,0.839,0.581
Seq_2126,0.033,0.833,0.533
Seq_2127,0.269,0.846,0.692
Seq_2128,0.043,0.739,0.435
Seq_2129,0.045,0.818,0.773
Seq_2130,0.182,0.545,0.455
Seq_2131,0.105,0.737,0.526
Seq_2132,0.0,0.791,0.535
Seq_2133,0.036,0.732,0.464
Seq_2134,0.0,0.75,0.562
Seq_2135,0.074,0.741,0.481
Seq_2136,0.154,0.846,0.462
Seq_2137,0.129,0.645,0.387
Seq_2138,0.062,0.719,0.5
Seq_2139,0.1,0.7,0.467
Seq_2140,0.094,0.688,0.375
Seq_2141,0.098,0.725,0.51
Seq_2142,0.103,0.793,0.517
Seq_2143,0.033,0.767,0.467
Seq_2144,0.033,0.767,0.5
Seq_2145,0.278,0.778,0.611
Seq_2146,0.222,0.741,0.63
Seq_2147,0.095,0.714,0.524
Seq_2148,0.12,0.84,0.56
Seq_2149,0.038,0.577,0.269
Seq_2150,0.188,0.75,0.562
Seq_2151,0.115,0.692,0.462
Seq_2152,0.167,0.667,0.611
Seq_2153,0.0,0.667,0.467
Seq_2154,0.154,0.769,0.462
Seq_2155,0.111,0.722,0.556
Seq_2156,0.045,0.636,0.455
Seq_2157,0.083,0.667,0.5
Seq_2158,0.167,0.722,0.333
Seq_2159,0.091,0.636,0.364
Seq_2160,0.034,0.448,0.241
Seq_2161,0.034,0.655,0.517
Seq_2162,0.154,0.923,0.769
Seq_2163,0.095,0.81,0.571
Seq_2164,0.043,0.783,0.565
Seq_2165,0.043,0.783,0.565
Seq_2166,0.118,0.765,0.706
Seq_2167,0.118,0.765,0.706
Seq_2168,0.067,0.689,0.422
Seq_2169,0.267,0.867,0.467
Seq_2170,0.2,0.867,0.467
Seq_2171,0.16,0.64,0.48
Seq_2172,0.154,0.615,0.5
Seq_2173,0.0,0.522,0.413
Seq_2174,0.079,0.868,0.553
Seq_2175,0.037,0.852,0.667
Seq_2176,0.15,0.9,0.7
Seq_2177,0.125,0.792,0.542
Seq_2178,0.093,0.767,0.535
Seq_2179,0.154,0.872,0.359
Seq_2180,0.174,0.696,0.413
Seq_2181,0.145,0.727,0.364
Seq_2182,0.127,0.745,0.364
Seq_2183,0.047,0.791,0.558
Seq_2184,0.085,0.66,0.383
Seq_2185,0.122,0.683,0.317
Seq_2186,0.095,0.738,0.405
Seq_2187,0.0,0.684,0.526
Seq_2188,0.107,0.786,0.429
Seq_2189,0.17,0.792,0.189
Seq_2190,0.121,0.758,0.455
Seq_2191,0.0,0.65,0.45
Seq_2192,0.138,0.483,0.345
Seq_2193,0.056,0.5,0.278
Seq_2194,0.103,0.603,0.397
Seq_2195,0.059,0.667,0.373
Seq_2196,0.118,0.941,0.647
Seq_2197,0.154,0.692,0.5
Seq_2198,0.059,0.941,0.647
Seq_2199,0.111,0.815,0.444
Seq_2200,0.071,0.786,0.5
Seq_2201,0.1,0.9,0.6
Seq_2202,0.278,0.722,0.278
Seq_2203,0.0,0.846,0.462
Seq_2204,0.045,0.909,0.682
Seq_2205,0.067,0.733,0.533
Seq_2206,0.05,0.75,0.4
Seq_2207,0.034,0.661,0.542
Seq_2208,0.0,0.929,0.714
Seq_2209,0.167,0.944,0.667
Seq_2210,0.167,0.583,0.583
Seq_2211,0.154,0.692,0.462
Seq_2212,0.028,0.944,0.583
Seq_2213,0.077,0.692,0.385
Seq_2214,0.077,0.923,0.615
Seq_2215,0.154,0.923,0.615
Seq_2216,0.111,0.889,0.722
Seq_2217,0.105,0.895,0.526
Seq_2218,0.231,0.923,0.615
Seq_2219,0.136,0.682,0.5
Seq_2220,0.136,0.773,0.455
Seq_2221,0.083,0.667,0.417
Seq_2222,0.0,0.647,0.647
Seq_2223,0.0,0.588,0.471
Seq_2224,0.0,0.682,0.455
Seq_2225,0.0,0.619,0.619
Seq_2226,0.0,0.556,0.444
Seq_2227,0.0,0.63,0.519
Seq_2228,0.0,0.55,0.5
Seq_2229,0.0,0.571,0.5
Seq_2230,0.034,0.759,0.517
Seq_2231,0.062,0.688,0.531
Seq_2232,0.067,0.833,0.5
Seq_2233,0.0,0.868,0.632
Seq_2234,0.0,0.767,0.567
Seq_2235,0.16,0.74,0.48
Seq_2236,0.2,0.8,0.467
Seq_2237,0.2,0.8,0.467
Seq_2238,0.06,0.72,0.38
Seq_2239,0.029,0.657,0.371
Seq_2240,0.0,0.667,0.5
Seq_2241,0.026,0.658,0.395
Seq_2242,0.176,0.784,0.549
Seq_2243,0.118,0.804,0.549
Seq_2244,0.136,0.955,0.591
Seq_2245,0.078,0.686,0.431
Seq_2246,0.044,0.711,0.444
Seq_2247,0.091,0.636,0.485
Seq_2248,0.061,0.727,0.333
Seq_2249,0.088,0.794,0.529
Seq_2250,0.154,0.615,0.154
Seq_2251,0.036,0.714,0.393
Seq_2252,0.037,0.852,0.463
Seq_2253,0.163,0.791,0.442
Seq_2254,0.163,0.791,0.442
Seq_2255,0.14,0.93,0.581
Seq_2256,0.121,0.879,0.515
Seq_2257,0.0,0.759,0.552
Seq_2258,0.083,0.875,0.792
Seq_2259,0.069,0.724,0.517
Seq_2260,0.231,0.923,0.846
Seq_2261,0.083,0.833,0.792
Seq_2262,0.067,0.767,0.533
Seq_2263,0.308,0.923,0.769
Seq_2264,0.125,0.812,0.75
Seq_2265,0.15,0.8,0.5
Seq_2266,0.067,0.867,0.6
Seq_2267,0.067,0.867,0.533
Seq_2268,0.061,0.758,0.545
Seq_2269,0.143,0.81,0.476
Seq_2270,0.065,0.742,0.548
Seq_2271,0.111,0.815,0.519
Seq_2272,0.2,0.75,0.6
Seq_2273,0.043,0.696,0.522
Seq_2274,0.227,0.682,0.455
Seq_2275,0.113,0.736,0.453
Seq_2276,0.061,0.673,0.408
Seq_2277,0.062,0.708,0.479
Seq_2278,0.243,0.811,0.649
Seq_2279,0.08,0.6,0.44
Seq_2280,0.0,0.75,0.417
Seq_2281,0.2,0.7,0.6
Seq_2282,0.059,0.824,0.647
Seq_2283,0.056,0.833,0.611
Seq_2284,0.19,0.524,0.476
Seq_2285,0.2,0.55,0.45
Seq_2286,0.138,0.517,0.448
Seq_2287,0.053,1.0,0.737
Seq_2288,0.053,0.895,0.632
Seq_2289,0.417,0.417,0.417
Seq_2290,0.0,0.667,0.667
Seq_2291,0.053,1.0,0.737
Seq_2292,0.385,0.692,0.692
Seq_2293,0.048,0.762,0.429
Seq_2294,0.462,0.538,0.538
Seq_2295,0.167,0.542,0.458
Seq_2296,0.214,0.571,0.429
Seq_2297,0.048,0.952,0.952
Seq_2298,0.119,0.738,0.524
Seq_2299,0.122,0.707,0.512
Seq_2300,0.059,0.706,0.647
Seq_2301,0.059,0.765,0.706
Seq_2302,0.118,0.765,0.588
Seq_2303,0.0,0.778,0.667
Seq_2304,0.059,0.882,0.588
Seq_2305,0.133,0.867,0.467
Seq_2306,0.094,0.75,0.469
Seq_2307,0.054,0.784,0.432
Seq_2308,0.071,0.786,0.714
Seq_2309,0.0,0.882,0.471
Seq_2310,0.059,0.941,0.706
Seq_2311,0.05,0.85,0.8
Seq_2312,0.111,0.822,0.533
Seq_2313,0.023,0.581,0.349
Seq_2314,0.029,0.618,0.294
Seq_2315,0.079,0.605,0.447
Seq_2316,0.136,0.727,0.591
Seq_2317,0.115,0.769,0.5
Seq_2318,0.0,0.75,0.531
Seq_2319,0.186,0.791,0.535
Seq_2320,0.034,0.621,0.414
Seq_2321,0.051,0.744,0.564
Seq_2322,0.229,0.743,0.543
Seq_2323,0.219,0.719,0.531
Seq_2324,0.174,0.739,0.435
Seq_2325,0.083,0.5,0.417
Seq_2326,0.107,0.607,0.321
Seq_2327,0.125,0.688,0.562
Seq_2328,0.081,0.676,0.486
Seq_2329,0.179,0.893,0.214
Seq_2330,0.216,0.73,0.514
Seq_2331,0.095,0.857,0.643
Seq_2332,0.12,0.84,0.6
Seq_2333,0.081,0.892,0.622
Seq_2334,0.069,0.862,0.655
Seq_2335,0.053,0.842,0.737
Seq_2336,0.04,0.8,0.48
Seq_2337,0.0,0.941,0.647
Seq_2338,0.045,0.773,0.545
Seq_2339,0.057,0.886,0.629
Seq_2340,0.0,0.875,0.562
Seq_2341,0.158,0.684,0.526
Seq_2342,0.1,0.65,0.45
Seq_2343,0.2,0.7,0.55
Seq_2344,0.2,0.55,0.4
Seq_2345,0.25,0.667,0.583
Seq_2346,0.222,0.722,0.5
Seq_2347,0.105,0.632,0.579
Seq_2348,0.222,0.722,0.444
Seq_2349,0.294,0.647,0.471
Seq_2350,0.25,0.667,0.417
Seq_2351,0.15,0.6,0.35
Seq_2352,0.067,0.533,0.467
Seq_2353,0.0,0.625,0.438
Seq_2354,0.158,0.737,0.526
Seq_2355,0.0,0.667,0.467
Seq_2356,0.059,0.706,0.529
Seq_2357,0.0,0.667,0.467
Seq_2358,0.0,0.667,0.667
Seq_2359,0.125,0.75,0.688
Seq_2360,0.053,0.737,0.526
Seq_2361,0.0,0.643,0.571
Seq_2362,0.133,0.733,0.467
Seq_2363,0.154,0.769,0.692
Seq_2364,0.136,0.591,0.318
Seq_2365,0.111,0.611,0.556
Seq_2366,0.052,0.931,0.707
Seq_2367,0.125,0.875,0.583
Seq_2368,0.045,0.932,0.523
Seq_2369,0.068,0.886,0.455
Seq_2370,0.0,0.818,0.515
Seq_2371,0.105,0.868,0.421
Seq_2372,0.106,0.894,0.574
Seq_2373,0.078,0.824,0.471
Seq_2374,0.125,0.688,0.625
Seq_2375,0.188,0.75,0.656
Seq_2376,0.194,0.581,0.484
Seq_2377,0.138,0.621,0.379
Seq_2378,0.172,0.69,0.448
Seq_2379,0.154,0.846,0.615
Seq_2380,0.154,0.769,0.615
Seq_2381,0.154,0.846,0.692
Seq_2382,0.231,0.846,0.615
Seq_2383,0.0,0.727,0.545
Seq_2384,0.227,0.727,0.545
Seq_2385,0.115,0.769,0.5
Seq_2386,0.167,0.944,0.667
Seq_2387,0.182,0.682,0.545
Seq_2388,0.028,0.611,0.306
Seq_2389,0.077,0.923,0.769
Seq_2390,0.0,0.909,0.545
Seq_2391,0.1,0.8,0.5
Seq_2392,0.091,0.545,0.318
Seq_2393,0.122,0.653,0.49
Seq_2394,0.2,0.6,0.4
Seq_2395,0.238,0.619,0.381
Seq_2396,0.2,0.667,0.333
Seq_2397,0.2,0.8,0.4
Seq_2398,0.091,0.818,0.545
Seq_2399,0.14,0.628,0.395
Seq_2400,0.053,0.895,0.632
Seq_2401,0.053,0.842,0.632
Seq_2402,0.053,0.842,0.737
Seq_2403,0.105,0.842,0.684
Seq_2404,0.105,0.895,0.684
Seq_2405,0.0,0.944,0.778
Seq_2406,0.12,0.64,0.52
Seq_2407,0.148,0.593,0.444
Seq_2408,0.077,0.615,0.487
Seq_2409,0.036,0.545,0.436
Seq_2410,0.077,0.615,0.462
Seq_2411,0.227,0.727,0.591
Seq_2412,0.077,0.788,0.385
Seq_2413,0.043,0.783,0.522
Seq_2414,0.025,0.75,0.5
Seq_2415,0.079,0.737,0.421
Seq_2416,0.109,0.636,0.364
Seq_2417,0.061,0.697,0.394
Seq_2418,0.25,0.8,0.65
Seq_2419,0.026,0.513,0.333
Seq_2420,0.036,0.75,0.536
Seq_2421,0.036,0.821,0.571
Seq_2422,0.079,0.816,0.474
Seq_2423,0.026,0.763,0.474
Seq_2424,0.083,0.833,0.083
Seq_2425,0.158,0.763,0.316
Seq_2426,0.135,0.73,0.378
Seq_2427,0.075,0.75,0.525
Seq_2428,0.136,0.727,0.455
Seq_2429,0.25,0.8,0.45
Seq_2430,0.121,0.818,0.545
Seq_2431,0.077,0.538,0.385
Seq_2432,0.0,0.769,0.462
Seq_2433,0.05,0.75,0.5
Seq_2434,0.061,0.694,0.388
Seq_2435,0.0,0.882,0.529
Seq_2436,0.125,0.875,0.688
Seq_2437,0.091,0.955,0.636
Seq_2438,0.032,0.806,0.645
Seq_2439,0.0,0.786,0.571
Seq_2440,0.0,0.786,0.714
Seq_2441,0.15,0.9,0.8
Seq_2442,0.154,0.577,0.308
Seq_2443,0.077,0.923,0.615
Seq_2444,0.125,0.938,0.625
Seq_2445,0.067,0.867,0.533
Seq_2446,0.143,0.643,0.429
Seq_2447,0.125,0.656,0.406
Seq_2448,0.111,0.75,0.611
Seq_2449,0.171,0.8,0.743
Seq_2450,0.12,0.8,0.52
Seq_2451,0.0,0.484,0.194
Seq_2452,0.067,0.778,0.444
Seq_2453,0.043,0.783,0.522
Seq_2454,0.105,0.947,0.737
Seq_2455,0.15,0.8,0.75
Seq_2456,0.158,0.842,0.316
Seq_2457,0.122,0.805,0.439
Seq_2458,0.045,0.864,0.636
Seq_2459,0.077,0.769,0.615
Seq_2460,0.038,0.731,0.462
Seq_2461,0.077,0.692,0.487
Seq_2462,0.085,0.702,0.447
Seq_2463,0.042,0.875,0.75
Seq_2464,0.098,0.902,0.412
Seq_2465,0.059,0.843,0.49
Seq_2466,0.148,0.889,0.481
Seq_2467,0.167,0.567,0.467
Seq_2468,0.025,0.65,0.35
Seq_2469,0.121,0.576,0.364
Seq_2470,0.152,0.576,0.455
Seq_2471,0.039,0.843,0.627
Seq_2472,0.04,0.68,0.4
Seq_2473,0.03,0.818,0.424
Seq_2474,0.062,0.875,0.594
Seq_2475,0.083,0.667,0.667
Seq_2476,0.25,0.667,0.667
Seq_2477,0.273,0.636,0.545
Seq_2478,0.077,0.615,0.615
Seq_2479,0.0,0.615,0.615
Seq_2480,0.143,0.571,0.571
Seq_2481,0.182,0.727,0.636
Seq_2482,0.0,0.571,0.5
Seq_2483,0.0,0.714,0.643
Seq_2484,0.029,0.714,0.4
Seq_2485,0.062,0.594,0.312
Seq_2486,0.068,0.932,0.523
Seq_2487,0.188,0.688,0.562
Seq_2488,0.085,0.681,0.447
Seq_2489,0.15,0.55,0.45
Seq_2490,0.0,0.923,0.615
Seq_2491,0.065,0.839,0.677
Seq_2492,0.067,0.9,0.6
Seq_2493,0.079,0.737,0.447
Seq_2494,0.194,0.667,0.361
Seq_2495,0.08,0.6,0.44
Seq_2496,0.154,0.808,0.5
Seq_2497,0.118,0.735,0.5
Seq_2498,0.143,0.75,0.179
Seq_2499,0.136,0.682,0.455
Seq_2500,0.038,0.654,0.577
Seq_2501,0.051,0.712,0.441
Seq_2502,0.214,0.714,0.5
Seq_2503,0.091,0.727,0.5
Seq_2504,0.135,0.892,0.162
Seq_2505,0.182,0.818,0.364
Seq_2506,0.071,0.786,0.643
Seq_2507,0.128,0.641,0.359
Seq_2508,0.06,0.8,0.48
Seq_2509,0.08,0.76,0.56
Seq_2510,0.024,0.738,0.405
Seq_2511,0.03,0.97,0.758
Seq_2512,0.167,0.833,0.833
Seq_2513,0.154,0.846,0.692
Seq_2514,0.029,0.8,0.6
Seq_2515,0.111,0.593,0.296
Seq_2516,0.083,0.611,0.417
Seq_2517,0.029,0.657,0.457
Seq_2518,0.2,0.65,0.45
Seq_2519,0.041,0.816,0.469
Seq_2520,0.2,0.75,0.3
Seq_2521,0.16,0.72,0.4
Seq_2522,0.226,0.677,0.548
Seq_2523,0.167,0.667,0.375
Seq_2524,0.25,0.75,0.458
Seq_2525,0.05,0.85,0.6
Seq_2526,0.0,0.808,0.615
Seq_2527,0.174,0.609,0.348
Seq_2528,0.375,1.0,0.688
Seq_2529,0.08,0.96,0.6
Seq_2530,0.028,0.722,0.583
Seq_2531,0.0,0.829,0.6
Seq_2532,0.091,0.848,0.485
Seq_2533,0.179,0.75,0.321
Seq_2534,0.0,0.786,0.643
Seq_2535,0.12,0.84,0.44
Seq_2536,0.032,0.871,0.677
Seq_2537,0.031,0.625,0.438
Seq_2538,0.179,0.643,0.393
Seq_2539,0.037,0.63,0.407
Seq_2540,0.1,0.75,0.6
Seq_2541,0.042,0.792,0.667
Seq_2542,0.083,0.833,0.667
Seq_2543,0.025,0.775,0.575
Seq_2544,0.051,0.744,0.513
Seq_2545,0.075,0.725,0.5
Seq_2546,0.081,0.757,0.459
Seq_2547,0.081	,0.757	,0.459	
