Sequence,Activity
GLFDIIKKIAESF,anti-viral
AACARFIDDFCDTLTPNIYRPRDNGQRCYAVNGHRCDFTVFNTNNGGNPIRASTPNCKTVLRTAANRCPTGGRGKINPNAPFLFAIDPNDGDCSTNF,anti-viral
HGVSGHGQHGVHG,anti-viral
FKCRRWQWRMKKLGAPSITCVRRAF,anti-viral
CLGIGSCNDFAGCGYAVVCFW,anti-viral
KWKLFKKIKFLHSAKKF,anti-viral
GIGTKILGGVKTALKGALKELASTYAN,anti-viral
GIGGKILSGLKTALKGAAKELASTYLH,anti-viral
GIGGVLLSAGKAALKGLAKVLAEKYAN,anti-viral
SIGAKILGGVKTFFKGALKELASTYLQ,anti-viral
FLPVLAGIAAKVVPALFCKITKKC,anti-viral
FLPLIGRVLSGIL,anti-viral
GLMDTVKNVAKNLAGHMLDKLKCKITGC,anti-viral
KWKLFKKIEKVGQNIRDGIIKAGPAVAVVGQATQIAK,anti-viral
GLKKLLGKLLKKLGKLLLK,anti-viral
GIGKFLHSAKKFGKAFVGEIMNS,anti-viral
GIGAVLKVLTTGLPALISWIKRKRQQ,anti-viral
ILPWKWPWWPWRR,anti-viral
ALWKTMLKKLGTMALHAGKAALGAAADTISQGTQ,anti-viral
ALWMTLLKKVLKAAAKALNAVLVGANA,anti-viral
RCICTTRTCRFPYRRLGTCLFQNRVYTFCC,anti-viral
RRCICTTRTCRFPYRRLGTCIFQNRVYTFCC,anti-viral
ACYCRIPACIAGERRYGTCIYQGRLWAFCC,anti-viral
CYCRIPACIAGERRYGTCIYQGRLWAFCC,anti-viral
DCYCRIPACIAGERRYGTCIYQGRLWAFCC,anti-viral
VCSCRLVFCRRTELRVGNCLIGGVSFTYCCTRV,anti-viral
ATCYCRTGRCATRESLSGVCEISGRLYRLCCR,anti-viral
AFTCHCRRSCYSTEYSYGTCTVMGINHRFCCL,anti-viral
VVCACRRALCLPRERRAGFCRIRGRIHPLCCRR,anti-viral
VVCACRRALCLPLERRAGFCRIRGRIHPLCCRR,anti-viral
RGGRLCYCRRRFCVCVGR,anti-viral
RRWCFRVCYRGFCYRKCR,anti-viral
RRWCFRVCYKGFCYRKCR,anti-viral
KWCFRVCYRGICYRRCR,anti-viral
GICACRRRFCPNSERFSGYCRVNGARYVRCCSRR,anti-viral
RGGRLCYCRRRFCICV,anti-viral
RGGGLCYCRRRFCVCVGR,anti-viral
RGGRLCYCRGWICFCVGR,anti-viral
RGGRLCYCRPRFCVCVGR,anti-viral
VTCYCRRTRCGFRERLSGACGYRGRIYRLCCR,anti-viral
VTCYCRSTRCGFRERLSGACGYRGRIYRLCCR,anti-viral
CSCRTSSCRFGERLSGACRLNGRIYRLCC,anti-viral
ACYCRIGACVSGERLTGACGLNGRIYRLCCR,anti-viral
GLLSVLGSVAKHVLPHVVPVIAEHL,anti-viral
GLWQKIKSAAGDLASGIVEGIKS,anti-viral
GIPCGESCVWIPCISAALGCSCKNKVCYRN,anti-viral
GVIPCGESCVFIPCISTLLGCSCKNKVCYRN,anti-viral
VFQFLGRIIHHVGNFVHGFSHVF,anti-viral
GIINTLQKYYCRVRGGRCAVLSCLPKEEQIGKCSTRGRKCCRRKK,anti-viral
LLGDFFRKSKEKIGKEFKRIVQRIKDFLRNLVPRTES,anti-viral
GVIDAAKKVVNVLKNLF,anti-viral
GWFDVVKHIASAV,anti-viral
SCASRCKGHCRARRCGYYVSVLYRGRCYCKCLRC,anti-viral
ANTAFVSSAHNTQKIPAGAPFNRNLRAMLADLRQNAAFAG,anti-viral
GRFKRFRKKFKKLFKKLSPVIPLLHLG,anti-viral
GGLRSLGRKILRAWKKYGPIIVPIIRIG,anti-viral
LLKELWTKIKGAGKAVLGKIKGLL,anti-viral
HVDKKVADKVLLLKQLRIMRLLTRL,anti-viral
FISAIASMLGKFL,anti-viral
FLFPLITSFLSKVL,anti-viral
GFCRCLCRRGVCRCICTR,anti-viral
GADFQECMKEHSQKQHQHQG,anti-viral
SYSMEHFRWGKPV,anti-viral
DHYNCVSSGGQCLYSACPIFTKIQGTCYRGKAKCCK,anti-viral
FFHHIFRGIVHVGKTIHRLVTG,anti-viral
FIHHIFRGIVHAGRSIGRFLTG,anti-viral
ILGPVLGLVSDTLDDVLGIL,anti-viral
VGALAVVVWLWLWLW,anti-viral
DSHAKRHHGYKRKFHEKHHSHRGY,anti-viral
FKCRRWQWRM,anti-viral
GIGDPVTCLKSGAICHPVFCPRRYKQIGTCGLPGTKCCKKP,anti-viral
KTCENLADTFRGPCFATSNC,anti-viral
GFGCNGPWDEDDMQCHNHCKSIKGYKGGYCAKGGFVCKCY,anti-viral
KTCENLADTY,anti-viral
GIWDTIKSMGKVFAGKILQNL,anti-viral
GLLGLLGSVVSHVVPAIVGHF,anti-viral
GFSSIFRGVAKFASKGLGKDLARLGVNLVACKISKQC,anti-viral
GLRKKFRKTRKRIQKLGRKIGKTGRKVWKAWREYGQIPYPCRI,anti-viral
GLLASLGKVFGGYLAEKLKPK,anti-viral
FKRIVQRIKDFLR,anti-viral
RCLCRRGVCRCLCRRGVC,anti-viral
RCICTRGFCRCICTRGFC,anti-viral
GLRSKIWLWVLLMIWQESNKFKKM,anti-viral
GIKCRFCCGCCTPGICGVCCRF,anti-viral
GLPVCGETCVGGTCNTPGCTCSWPVCTRN,anti-viral
GSVLNCGETCLLGTCYTTGCTCNKYRVCTKD,anti-viral
ILGPVISTIGGVLGGLLKNL,anti-viral
KYYGNGVSCNKKGCSVDWGKAIGIIGNNSAANLATGGAAGWKS,anti-viral
GVIPCGESCVFIPCISAAIGCSCKNKVCYRN,anti-viral
GTACGESCYVLPCFTVGCTCTSSQCFKN,anti-viral
GIPCGESCVFIPCLTTVAGCSCKNKVCYRN,anti-viral
GFPCGESCVFIPCISAAIGCSCKNKVCYRN,anti-viral
GLPICGETCVGGTCNTPGCSCSWPVCTRN,anti-viral
GDPTFCGETCRVIPVCTYSAALGCTCDDRSDGLCKRN,anti-viral
GLPVCGETCFGGTCNTPGCSCTWPICTRD,anti-viral
SISCGESCAMISFCFTEVIGCSCKNKVCYLN,anti-viral
GIPCGESCVFIPCITSVAGCSCKSKVCYRN,anti-viral
KIPCGESCVWIPCVTSIFNCKCKENKVCYHD,anti-viral
KIPCGESCVWIPCLTSVFNCKCENKVCYHD,anti-viral
KVCYRAIPCGESCVWIPCISAAIGCSCKN,anti-viral
GIPCGESCVWIPCISAAIGCSCKSKVCYRN,anti-viral
GSIPACGESCFKGKCYTPGCSCSKYPLCAKN,anti-viral
GLPTCGETCFGGTCNTPGCTCDPWPVCTHN,anti-viral
GGTIFDCGETCFLGTCYTPGCSCGNYGFCYGTN,anti-viral
GVPCGESCVFIPCITGVIGCSCSSNVCYLN,anti-viral
GIPCAESCVWIPCTVTALVGCSCSDKVCYN,anti-viral
GGTIFDCGESCFLGTCYTKGCSCGEWKLCYGTN,anti-viral
CLGVGSCNDFAGCGYAVVCFW,anti-viral
CLGVGSCNDFAGCGYAIVCFW,anti-viral
GICRCICGRGICRCICGR,anti-viral
GICRCICGRRICRCICGR,anti-viral
RICRCICGRRICRCICGR,anti-viral
GFKDLLKGAAKALVKTVLF,anti-viral
GFLSILKKVLPKVMAHMK,anti-viral
GIFPKIIGKGIVNGIKSLAKGVGMKVFKAGLNNIGNTGCNNRDEC,anti-viral
GLFPKFNKKKVKTGIFDIIKTVGKEAGMDVLRTGIDVIGCKIKGEC,anti-viral
FIFHIIKGLFHAGKMIHGLVTRRRH,anti-viral
SLSRFLSFLKIVYPPAF,anti-viral
EKKCPGRCTLKCGKHERPTLPYNCGKYICCVPVKVK,anti-viral
ACSAG,anti-viral
FFGSVLKLIPKIL,anti-viral
FFHHIFRGIVHVGKTIHKLVTG,anti-viral
QEAQSVACTSYYCSKFCGSAGCSLYGCYLLHPGKICYCLHCSR,anti-viral
EQCREEEDDR,anti-viral
